james-server-dev mailing list archives

Site index · List index
Message view « Date » · « Thread »
Top « Date » · « Thread »
From Apache Jenkins Server <jenk...@builds.apache.org>
Subject Build failed in Jenkins: james-server-trunk #2679
Date Thu, 01 Mar 2012 14:28:14 GMT
See <https://builds.apache.org/job/james-server-trunk/2679/changes>

Changes:

[eric] [maven-release-plugin] prepare for next development iteration

[eric] [maven-release-plugin] prepare release james-server-3.0-beta4

------------------------------------------
[...truncated 3001 lines...]
	at org.apache.camel.util.AsyncProcessorHelper.process(AsyncProcessorHelper.java:70)
	at org.apache.camel.component.direct.DirectProducer.process(DirectProducer.java:61)
	at org.apache.camel.processor.UnitOfWorkProcessor.process(UnitOfWorkProcessor.java:99)
	at org.apache.camel.util.AsyncProcessorHelper.process(AsyncProcessorHelper.java:91)
	at org.apache.camel.processor.DelegateAsyncProcessor.process(DelegateAsyncProcessor.java:85)
	at org.apache.camel.processor.UnitOfWorkProducer.process(UnitOfWorkProducer.java:63)
	at org.apache.camel.impl.ProducerCache$1.doInProducer(ProducerCache.java:333)
	at org.apache.camel.impl.ProducerCache$1.doInProducer(ProducerCache.java:303)
	at org.apache.camel.impl.ProducerCache.doInProducer(ProducerCache.java:208)
	at org.apache.camel.impl.ProducerCache.sendExchange(ProducerCache.java:303)
	at org.apache.camel.impl.ProducerCache.send(ProducerCache.java:154)
	at org.apache.camel.impl.DefaultProducerTemplate.send(DefaultProducerTemplate.java:110)
	at org.apache.camel.impl.DefaultProducerTemplate.sendBody(DefaultProducerTemplate.java:123)
	at org.apache.camel.impl.DefaultProducerTemplate.sendBody(DefaultProducerTemplate.java:130)
	at org.apache.james.mailetcontainer.impl.camel.CamelMailetProcessor.service(CamelMailetProcessor.java:62)
	at org.apache.james.mailetcontainer.lib.AbstractStateMailetProcessorTest.testMailetThrowException(AbstractStateMailetProcessorTest.java:235)
	at sun.reflect.NativeMethodAccessorImpl.invoke0(Native Method)
	at sun.reflect.NativeMethodAccessorImpl.invoke(NativeMethodAccessorImpl.java:39)
	at sun.reflect.DelegatingMethodAccessorImpl.invoke(DelegatingMethodAccessorImpl.java:25)
	at java.lang.reflect.Method.invoke(Method.java:597)
	at junit.framework.TestCase.runTest(TestCase.java:154)
	at junit.framework.TestCase.runBare(TestCase.java:127)
	at junit.framework.TestResult$1.protect(TestResult.java:106)
	at junit.framework.TestResult.runProtected(TestResult.java:124)
	at junit.framework.TestResult.run(TestResult.java:109)
	at junit.framework.TestCase.run(TestCase.java:118)
	at junit.framework.TestSuite.runTest(TestSuite.java:208)
	at junit.framework.TestSuite.run(TestSuite.java:203)
	at sun.reflect.NativeMethodAccessorImpl.invoke0(Native Method)
	at sun.reflect.NativeMethodAccessorImpl.invoke(NativeMethodAccessorImpl.java:39)
	at sun.reflect.DelegatingMethodAccessorImpl.invoke(DelegatingMethodAccessorImpl.java:25)
	at java.lang.reflect.Method.invoke(Method.java:597)
	at org.apache.maven.surefire.junit.JUnitTestSet.execute(JUnitTestSet.java:96)
	at org.apache.maven.surefire.junit.JUnit3Provider.executeTestSet(JUnit3Provider.java:117)
	at org.apache.maven.surefire.junit.JUnit3Provider.invoke(JUnit3Provider.java:94)
	at sun.reflect.NativeMethodAccessorImpl.invoke0(Native Method)
	at sun.reflect.NativeMethodAccessorImpl.invoke(NativeMethodAccessorImpl.java:39)
	at sun.reflect.DelegatingMethodAccessorImpl.invoke(DelegatingMethodAccessorImpl.java:25)
	at java.lang.reflect.Method.invoke(Method.java:597)
	at org.apache.maven.surefire.util.ReflectionUtils.invokeMethodWithArray(ReflectionUtils.java:164)
	at org.apache.maven.surefire.booter.ProviderFactory$ProviderProxy.invoke(ProviderFactory.java:110)
	at org.apache.maven.surefire.booter.SurefireStarter.invokeProvider(SurefireStarter.java:175)
	at org.apache.maven.surefire.booter.SurefireStarter.runSuitesInProcessWhenForked(SurefireStarter.java:81)
	at org.apache.maven.surefire.booter.ForkedBooter.main(ForkedBooter.java:68)
Tests run: 4, Failures: 0, Errors: 0, Skipped: 0, Time elapsed: 1.918 sec
Running org.apache.james.mailetcontainer.impl.MailetConfigImplTest
Tests run: 4, Failures: 0, Errors: 0, Skipped: 0, Time elapsed: 0.144 sec
Running org.apache.james.mailetcontainer.impl.matchers.AndTest
Tests run: 2, Failures: 0, Errors: 0, Skipped: 0, Time elapsed: 0.03 sec
Running org.apache.james.mailetcontainer.impl.matchers.XorTest
Tests run: 2, Failures: 0, Errors: 0, Skipped: 0, Time elapsed: 0.03 sec
Running org.apache.james.mailetcontainer.impl.matchers.OrTest
test2@james.apache.org
Tests run: 1, Failures: 0, Errors: 0, Skipped: 0, Time elapsed: 0.029 sec

Results :

Tests run: 17, Failures: 0, Errors: 0, Skipped: 0

[JENKINS] Recording test results
[INFO] 
[INFO] [INFO] Building jar: <https://builds.apache.org/job/james-server-trunk/ws/trunk/mailetcontainer-camel/target/james-server-mailetcontainer-camel-3.0-beta5-SNAPSHOT.jar>
--- maven-jar-plugin:2.3.2:jar (default-jar) @ james-server-mailetcontainer-camel ---
[INFO] 
[INFO] --- maven-site-plugin:3.0:attach-descriptor (attach-descriptor) @ james-server-mailetcontainer-camel
---
[INFO] 
[INFO] --- maven-jar-plugin:2.3.2:jar (default) @ james-server-mailetcontainer-camel ---
[INFO] [INFO] Building jar: <https://builds.apache.org/job/james-server-trunk/ws/trunk/mailetcontainer-camel/target/james-server-mailetcontainer-camel-3.0-beta5-SNAPSHOT-tests.jar>

[INFO] --- maven-jar-plugin:2.3.2:test-jar (default) @ james-server-mailetcontainer-camel
---
[INFO] [INFO] Installing <https://builds.apache.org/job/james-server-trunk/ws/trunk/mailetcontainer-camel/target/james-server-mailetcontainer-camel-3.0-beta5-SNAPSHOT.jar>
to /home/jenkins/jenkins-slave/maven-repositories/1/org/apache/james/james-server-mailetcontainer-camel/3.0-beta5-SNAPSHOT/james-server-mailetcontainer-camel-3.0-beta5-SNAPSHOT.jar
[INFO] Installing <https://builds.apache.org/job/james-server-trunk/ws/trunk/mailetcontainer-camel/pom.xml>
to /home/jenkins/jenkins-slave/maven-repositories/1/org/apache/james/james-server-mailetcontainer-camel/3.0-beta5-SNAPSHOT/james-server-mailetcontainer-camel-3.0-beta5-SNAPSHOT.pom
[INFO] Installing <https://builds.apache.org/job/james-server-trunk/ws/trunk/mailetcontainer-camel/target/james-server-mailetcontainer-camel-3.0-beta5-SNAPSHOT-tests.jar>
to /home/jenkins/jenkins-slave/maven-repositories/1/org/apache/james/james-server-mailetcontainer-camel/3.0-beta5-SNAPSHOT/james-server-mailetcontainer-camel-3.0-beta5-SNAPSHOT-tests.jar

[INFO] --- maven-install-plugin:2.3.1:install (default-install) @ james-server-mailetcontainer-camel
---
[INFO] Downloading: https://repository.apache.org/content/repositories/snapshots/org/apache/james/james-server-mailetcontainer-camel/3.0-beta5-SNAPSHOT/maven-metadata.xml

[INFO] --- maven-deploy-plugin:2.7:deploy (default-deploy) @ james-server-mailetcontainer-camel
---
Uploading: https://repository.apache.org/content/repositories/snapshots/org/apache/james/james-server-mailetcontainer-camel/3.0-beta5-SNAPSHOT/james-server-mailetcontainer-camel-3.0-beta5-20120301.142802-1.jar
Uploaded: https://repository.apache.org/content/repositories/snapshots/org/apache/james/james-server-mailetcontainer-camel/3.0-beta5-SNAPSHOT/james-server-mailetcontainer-camel-3.0-beta5-20120301.142802-1.jar
(70 KB at 189.5 KB/sec)
Uploading: https://repository.apache.org/content/repositories/snapshots/org/apache/james/james-server-mailetcontainer-camel/3.0-beta5-SNAPSHOT/james-server-mailetcontainer-camel-3.0-beta5-20120301.142802-1.pom
Uploaded: https://repository.apache.org/content/repositories/snapshots/org/apache/james/james-server-mailetcontainer-camel/3.0-beta5-SNAPSHOT/james-server-mailetcontainer-camel-3.0-beta5-20120301.142802-1.pom
(6 KB at 33.9 KB/sec)
Downloading: https://repository.apache.org/content/repositories/snapshots/org/apache/james/james-server-mailetcontainer-camel/maven-metadata.xml
Downloaded: https://repository.apache.org/content/repositories/snapshots/org/apache/james/james-server-mailetcontainer-camel/maven-metadata.xml
(460 B at 2.8 KB/sec)
Uploading: https://repository.apache.org/content/repositories/snapshots/org/apache/james/james-server-mailetcontainer-camel/3.0-beta5-SNAPSHOT/maven-metadata.xml
Uploaded: https://repository.apache.org/content/repositories/snapshots/org/apache/james/james-server-mailetcontainer-camel/3.0-beta5-SNAPSHOT/maven-metadata.xml
(812 B at 3.7 KB/sec)
Uploading: https://repository.apache.org/content/repositories/snapshots/org/apache/james/james-server-mailetcontainer-camel/maven-metadata.xml
Uploaded: https://repository.apache.org/content/repositories/snapshots/org/apache/james/james-server-mailetcontainer-camel/maven-metadata.xml
(504 B at 2.9 KB/sec)
Uploading: https://repository.apache.org/content/repositories/snapshots/org/apache/james/james-server-mailetcontainer-camel/3.0-beta5-SNAPSHOT/james-server-mailetcontainer-camel-3.0-beta5-20120301.142802-1-tests.jar
Uploaded: https://repository.apache.org/content/repositories/snapshots/org/apache/james/james-server-mailetcontainer-camel/3.0-beta5-SNAPSHOT/james-server-mailetcontainer-camel-3.0-beta5-20120301.142802-1-tests.jar
(31 KB at 101.6 KB/sec)
Uploading: https://repository.apache.org/content/repositories/snapshots/org/apache/james/james-server-mailetcontainer-camel/3.0-beta5-SNAPSHOT/maven-metadata.xml
Uploaded: https://repository.apache.org/content/repositories/snapshots/org/apache/james/james-server-mailetcontainer-camel/3.0-beta5-SNAPSHOT/maven-metadata.xml
(2 KB at 5.3 KB/sec)
[JENKINS] Archiving <https://builds.apache.org/job/james-server-trunk/ws/trunk/mailetcontainer-camel/pom.xml>
to /home/hudson/hudson/jobs/james-server-trunk/modules/org.apache.james$james-server-mailetcontainer-camel/builds/2012-03-01_14-22-14/archive/org.apache.james/james-server-mailetcontainer-camel/3.0-beta5-SNAPSHOT/james-server-mailetcontainer-camel-3.0-beta5-SNAPSHOT.pom
[JENKINS] Archiving <https://builds.apache.org/job/james-server-trunk/ws/trunk/mailetcontainer-camel/target/james-server-mailetcontainer-camel-3.0-beta5-SNAPSHOT.jar>
to /home/hudson/hudson/jobs/james-server-trunk/modules/org.apache.james$james-server-mailetcontainer-camel/builds/2012-03-01_14-22-14/archive/org.apache.james/james-server-mailetcontainer-camel/3.0-beta5-20120301.142802-1/james-server-mailetcontainer-camel-3.0-beta5-20120301.142802-1.jar
[JENKINS] Archiving <https://builds.apache.org/job/james-server-trunk/ws/trunk/mailetcontainer-camel/target/james-server-mailetcontainer-camel-3.0-beta5-SNAPSHOT-tests.jar>
to /home/hudson/hudson/jobs/james-server-trunk/modules/org.apache.james$james-server-mailetcontainer-camel/builds/2012-03-01_14-22-14/archive/org.apache.james/james-server-mailetcontainer-camel/3.0-beta5-20120301.142802-1/james-server-mailetcontainer-camel-3.0-beta5-20120301.142802-1-tests.jar
[INFO] Downloading: http://download.java.net/maven/2/org/apache/james/apache-jsieve-mailet/0.5/apache-jsieve-mailet-0.5.pom
                                                                        
[INFO] ------------------------------------------------------------------------
[INFO] Building Apache James Server Mailets 3.0-beta5-SNAPSHOT
[INFO] ------------------------------------------------------------------------
Downloading: http://people.apache.org/~rawson/repo/org/apache/james/apache-jsieve-mailet/0.5/apache-jsieve-mailet-0.5.pom
Downloading: http://repo1.maven.org/maven2/org/apache/james/apache-jsieve-mailet/0.5/apache-jsieve-mailet-0.5.pom
Downloaded: http://repo1.maven.org/maven2/org/apache/james/apache-jsieve-mailet/0.5/apache-jsieve-mailet-0.5.pom
(6 KB at 13.9 KB/sec)
Downloading: http://download.java.net/maven/2/org/apache/james/apache-jsieve-core/0.5/apache-jsieve-core-0.5.pom
Downloading: http://people.apache.org/~rawson/repo/org/apache/james/apache-jsieve-core/0.5/apache-jsieve-core-0.5.pom
Downloading: http://repo1.maven.org/maven2/org/apache/james/apache-jsieve-core/0.5/apache-jsieve-core-0.5.pom
Downloaded: http://repo1.maven.org/maven2/org/apache/james/apache-jsieve-core/0.5/apache-jsieve-core-0.5.pom
(7 KB at 21.5 KB/sec)
Downloading: http://download.java.net/maven/2/org/apache/james/protocols/protocols-smtp/1.6.2/protocols-smtp-1.6.2.pom
Downloading: http://people.apache.org/~rawson/repo/org/apache/james/protocols/protocols-smtp/1.6.2/protocols-smtp-1.6.2.pom
Downloading: http://repo1.maven.org/maven2/org/apache/james/protocols/protocols-smtp/1.6.2/protocols-smtp-1.6.2.pom
Downloaded: http://repo1.maven.org/maven2/org/apache/james/protocols/protocols-smtp/1.6.2/protocols-smtp-1.6.2.pom
(5 KB at 14.9 KB/sec)
Downloading: http://download.java.net/maven/2/org/apache/james/jspf/apache-jspf-resolver/1.0.0/apache-jspf-resolver-1.0.0.pom
Downloading: http://people.apache.org/~rawson/repo/org/apache/james/jspf/apache-jspf-resolver/1.0.0/apache-jspf-resolver-1.0.0.pom
Downloading: http://repo1.maven.org/maven2/org/apache/james/jspf/apache-jspf-resolver/1.0.0/apache-jspf-resolver-1.0.0.pom
Downloaded: http://repo1.maven.org/maven2/org/apache/james/jspf/apache-jspf-resolver/1.0.0/apache-jspf-resolver-1.0.0.pom
(9 KB at 26.6 KB/sec)
Downloading: http://download.java.net/maven/2/org/apache/james/apache-jspf-project/1.0.0/apache-jspf-project-1.0.0.pom
Downloading: http://people.apache.org/~rawson/repo/org/apache/james/apache-jspf-project/1.0.0/apache-jspf-project-1.0.0.pom
Downloading: http://repo1.maven.org/maven2/org/apache/james/apache-jspf-project/1.0.0/apache-jspf-project-1.0.0.pom
Downloaded: http://repo1.maven.org/maven2/org/apache/james/apache-jspf-project/1.0.0/apache-jspf-project-1.0.0.pom
(5 KB at 13.6 KB/sec)
Downloading: http://download.java.net/maven/2/org/apache/james/apache-james-imap-processor/0.3/apache-james-imap-processor-0.3.pom
Downloading: http://people.apache.org/~rawson/repo/org/apache/james/apache-james-imap-processor/0.3/apache-james-imap-processor-0.3.pom
Downloading: http://repo1.maven.org/maven2/org/apache/james/apache-james-imap-processor/0.3/apache-james-imap-processor-0.3.pom
[WARNING] The POM for org.apache.james:apache-james-imap-processor:jar:0.3 is missing, no
dependency information available
Downloading: http://download.java.net/maven/2/org/apache/james/apache-jsieve-mailet/0.5/apache-jsieve-mailet-0.5.jar
Downloading: http://download.java.net/maven/2/org/apache/james/apache-jsieve-core/0.5/apache-jsieve-core-0.5.jar
Downloading: http://download.java.net/maven/2/org/apache/geronimo/specs/geronimo-activation_1.1_spec/1.0.2/geronimo-activation_1.1_spec-1.0.2.jar
Downloading: http://download.java.net/maven/2/org/apache/james/protocols/protocols-smtp/1.6.2/protocols-smtp-1.6.2.jar
Downloading: http://download.java.net/maven/2/org/apache/james/jspf/apache-jspf-resolver/1.0.0/apache-jspf-resolver-1.0.0.jar
Downloading: http://download.java.net/maven/2/org/apache/james/apache-james-imap-processor/0.3/apache-james-imap-processor-0.3.jar
Downloading: http://people.apache.org/~rawson/repo/org/apache/james/apache-jsieve-mailet/0.5/apache-jsieve-mailet-0.5.jar
Downloading: http://people.apache.org/~rawson/repo/org/apache/james/apache-jsieve-core/0.5/apache-jsieve-core-0.5.jar
Downloading: http://people.apache.org/~rawson/repo/org/apache/geronimo/specs/geronimo-activation_1.1_spec/1.0.2/geronimo-activation_1.1_spec-1.0.2.jar
Downloading: http://people.apache.org/~rawson/repo/org/apache/james/protocols/protocols-smtp/1.6.2/protocols-smtp-1.6.2.jar
Downloading: http://people.apache.org/~rawson/repo/org/apache/james/jspf/apache-jspf-resolver/1.0.0/apache-jspf-resolver-1.0.0.jar
Downloading: http://people.apache.org/~rawson/repo/org/apache/james/apache-james-imap-processor/0.3/apache-james-imap-processor-0.3.jar
Downloading: http://repo1.maven.org/maven2/org/apache/james/apache-jsieve-mailet/0.5/apache-jsieve-mailet-0.5.jar
Downloading: http://repo1.maven.org/maven2/org/apache/james/apache-jsieve-core/0.5/apache-jsieve-core-0.5.jar
Downloading: http://repo1.maven.org/maven2/org/apache/geronimo/specs/geronimo-activation_1.1_spec/1.0.2/geronimo-activation_1.1_spec-1.0.2.jar
Downloading: http://repo1.maven.org/maven2/org/apache/james/protocols/protocols-smtp/1.6.2/protocols-smtp-1.6.2.jar
Downloading: http://repo1.maven.org/maven2/org/apache/james/jspf/apache-jspf-resolver/1.0.0/apache-jspf-resolver-1.0.0.jar
Downloaded: http://repo1.maven.org/maven2/org/apache/geronimo/specs/geronimo-activation_1.1_spec/1.0.2/geronimo-activation_1.1_spec-1.0.2.jar
(34 KB at 24.3 KB/sec)
Downloading: http://repo1.maven.org/maven2/org/apache/james/apache-james-imap-processor/0.3/apache-james-imap-processor-0.3.jar
Downloaded: http://repo1.maven.org/maven2/org/apache/james/apache-jsieve-mailet/0.5/apache-jsieve-mailet-0.5.jar
(43 KB at 26.5 KB/sec)
Downloaded: http://repo1.maven.org/maven2/org/apache/james/jspf/apache-jspf-resolver/1.0.0/apache-jspf-resolver-1.0.0.jar
(151 KB at 80.4 KB/sec)
Downloaded: http://repo1.maven.org/maven2/org/apache/james/apache-jsieve-core/0.5/apache-jsieve-core-0.5.jar
(175 KB at 81.1 KB/sec)
Downloaded: http://repo1.maven.org/maven2/org/apache/james/protocols/protocols-smtp/1.6.2/protocols-smtp-1.6.2.jar
(133 KB at 50.4 KB/sec)
[JENKINS] Archiving <https://builds.apache.org/job/james-server-trunk/ws/trunk/mailets/pom.xml>
to /home/hudson/hudson/jobs/james-server-trunk/modules/org.apache.james$james-server-mailets/builds/2012-03-01_14-22-14/archive/org.apache.james/james-server-mailets/3.0-beta5-SNAPSHOT/james-server-mailets-3.0-beta5-SNAPSHOT.pom
[INFO] ------------------------------------------------------------------------
[INFO] Reactor Summary:
[INFO] 
[INFO] Apache James Server ............................... SUCCESS [24.541s]
[INFO] Apache James Server Lifecycle API ................. SUCCESS [6.860s]
[INFO] Apache James Server Filesystem API ................ SUCCESS [18.091s]
[INFO] Apache James Server Data API ...................... SUCCESS [5.298s]
[INFO] Apache James Server Lifecycle Spring .............. SUCCESS [22.132s]
[INFO] Apache James Server Mailetcontainer API ........... SUCCESS [4.041s]
[INFO] Apache James Server Common Utilities .............. SUCCESS [6.666s]
[INFO] Apache James Server Protocols Library ............. SUCCESS [10.275s]
[INFO] Apache James Server Core .......................... SUCCESS [14.721s]
[INFO] Apache James Server Container Spring .............. SUCCESS [21.287s]
[INFO] Apache James Server DNS Server API ................ SUCCESS [6.257s]
[INFO] Apache James Server DNSService Implementation ..... SUCCESS [4.888s]
[INFO] Apache James Server DNSService Library ............ SUCCESS [6.460s]
[INFO] Apache James Server Queue API ..................... SUCCESS [5.897s]
[INFO] Apache James Server FetchMail ..................... SUCCESS [4.640s]
[INFO] Apache James Server Data Library .................. SUCCESS [6.728s]
[INFO] Apache James Server HBase Data Persistence ........ SUCCESS [45.903s]
[INFO] Apache James Server JPA Data Persistence .......... SUCCESS [16.694s]
[INFO] Apache James Server JCR Data Persistence .......... SUCCESS [21.050s]
[INFO] Apache James Server JDBC Data Persistence ......... SUCCESS [15.820s]
[INFO] Apache James Server File Data Persistence ......... SUCCESS [7.838s]
[INFO] Apache James Server LDAP Data Implementation ...... SUCCESS [5.256s]
[INFO] Apache James Server Mailbox Adapter ............... SUCCESS [6.924s]
[INFO] Apache James Server Mailetcontainer Camel ......... SUCCESS [14.985s]
[INFO] Apache James Server Mailets ....................... FAILURE [5.931s]
[INFO] Apache James Server IMAP .......................... SKIPPED
[INFO] Apache James Server SMTP .......................... SKIPPED
[INFO] Apache James Server LMTP .......................... SKIPPED
[INFO] Apache James Server POP3 .......................... SKIPPED
[INFO] Apache James Server File Mail Queue ............... SKIPPED
[INFO] Apache James Server JMS Mail Queue ................ SKIPPED
[INFO] Apache James Server ActiveMQ Queue ................ SKIPPED
[INFO] Apache James Server Client ........................ SKIPPED
[INFO] ------------------------------------------------------------------------
[INFO] BUILD FAILURE
[INFO] ------------------------------------------------------------------------
[INFO] Total time: 5:49.811s
[INFO] Finished at: Thu Mar 01 14:28:11 UTC 2012
[INFO] Final Memory: 41M/336M
[INFO] ------------------------------------------------------------------------
mavenExecutionResult exceptions not empty
message : Failed to execute goal on project james-server-mailets: Could not resolve dependencies
for project org.apache.james:james-server-mailets:jar:3.0-beta5-SNAPSHOT: Could not find artifact
org.apache.james:apache-james-imap-processor:jar:0.3 in maven2-repository.dev.java.net (http://download.java.net/maven/2/)
cause : Could not resolve dependencies for project org.apache.james:james-server-mailets:jar:3.0-beta5-SNAPSHOT:
Could not find artifact org.apache.james:apache-james-imap-processor:jar:0.3 in maven2-repository.dev.java.net
(http://download.java.net/maven/2/)
Stack trace : 
org.apache.maven.lifecycle.LifecycleExecutionException: Failed to execute goal on project
james-server-mailets: Could not resolve dependencies for project org.apache.james:james-server-mailets:jar:3.0-beta5-SNAPSHOT:
Could not find artifact org.apache.james:apache-james-imap-processor:jar:0.3 in maven2-repository.dev.java.net
(http://download.java.net/maven/2/)
	at org.apache.maven.lifecycle.internal.LifecycleDependencyResolver.getDependencies(LifecycleDependencyResolver.java:196)
	at org.apache.maven.lifecycle.internal.LifecycleDependencyResolver.resolveProjectDependencies(LifecycleDependencyResolver.java:108)
	at org.apache.maven.lifecycle.internal.MojoExecutor.ensureDependenciesAreResolved(MojoExecutor.java:258)
	at org.apache.maven.lifecycle.internal.MojoExecutor.execute(MojoExecutor.java:201)
	at org.apache.maven.lifecycle.internal.MojoExecutor.execute(MojoExecutor.java:153)
	at org.apache.maven.lifecycle.internal.MojoExecutor.execute(MojoExecutor.java:145)
	at org.apache.maven.lifecycle.internal.LifecycleModuleBuilder.buildProject(LifecycleModuleBuilder.java:84)
	at org.apache.maven.lifecycle.internal.LifecycleModuleBuilder.buildProject(LifecycleModuleBuilder.java:59)
	at org.apache.maven.lifecycle.internal.LifecycleStarter.singleThreadedBuild(LifecycleStarter.java:183)
	at org.apache.maven.lifecycle.internal.LifecycleStarter.execute(LifecycleStarter.java:161)
	at org.apache.maven.DefaultMaven.doExecute(DefaultMaven.java:319)
	at org.apache.maven.DefaultMaven.execute(DefaultMaven.java:156)
	at org.jvnet.hudson.maven3.launcher.Maven3Launcher.main(Maven3Launcher.java:79)
	at sun.reflect.NativeMethodAccessorImpl.invoke0(Native Method)
	at sun.reflect.NativeMethodAccessorImpl.invoke(NativeMethodAccessorImpl.java:39)
	at sun.reflect.DelegatingMethodAccessorImpl.invoke(DelegatingMethodAccessorImpl.java:25)
	at java.lang.reflect.Method.invoke(Method.java:597)
	at org.codehaus.plexus.classworlds.launcher.Launcher.launchStandard(Launcher.java:329)
	at org.codehaus.plexus.classworlds.launcher.Launcher.launch(Launcher.java:239)
	at org.jvnet.hudson.maven3.agent.Maven3Main.launch(Maven3Main.java:158)
	at hudson.maven.Maven3Builder.call(Maven3Builder.java:104)
	at hudson.maven.Maven3Builder.call(Maven3Builder.java:70)
	at hudson.remoting.UserRequest.perform(UserRequest.java:118)
	at hudson.remoting.UserRequest.perform(UserRequest.java:48)
	at hudson.remoting.Request$2.run(Request.java:287)
	at hudson.remoting.InterceptingExecutorService$1.call(InterceptingExecutorService.java:72)
	at java.util.concurrent.FutureTask$Sync.innerRun(FutureTask.java:303)
	at java.util.concurrent.FutureTask.run(FutureTask.java:138)
	at java.util.concurrent.ThreadPoolExecutor$Worker.runTask(ThreadPoolExecutor.java:886)
	at java.util.concurrent.ThreadPoolExecutor$Worker.run(ThreadPoolExecutor.java:908)
	at java.lang.Thread.run(Thread.java:662)
Caused by: org.apache.maven.project.DependencyResolutionException: Could not resolve dependencies
for project org.apache.james:james-server-mailets:jar:3.0-beta5-SNAPSHOT: Could not find artifact
org.apache.james:apache-james-imap-processor:jar:0.3 in maven2-repository.dev.java.net (http://download.java.net/maven/2/)
	at org.apache.maven.project.DefaultProjectDependenciesResolver.resolve(DefaultProjectDependenciesResolver.java:170)
	at org.apache.maven.lifecycle.internal.LifecycleDependencyResolver.getDependencies(LifecycleDependencyResolver.java:171)
	... 30 more
Caused by: org.sonatype.aether.resolution.DependencyResolutionException: Could not find artifact
org.apache.james:apache-james-imap-processor:jar:0.3 in maven2-repository.dev.java.net (http://download.java.net/maven/2/)
	at org.sonatype.aether.impl.internal.DefaultRepositorySystem.resolveDependencies(DefaultRepositorySystem.java:412)
	at org.apache.maven.project.DefaultProjectDependenciesResolver.resolve(DefaultProjectDependenciesResolver.java:164)
	... 31 more
Caused by: org.sonatype.aether.resolution.ArtifactResolutionException: Could not find artifact
org.apache.james:apache-james-imap-processor:jar:0.3 in maven2-repository.dev.java.net (http://download.java.net/maven/2/)
	at org.sonatype.aether.impl.internal.DefaultArtifactResolver.resolve(DefaultArtifactResolver.java:541)
	at org.sonatype.aether.impl.internal.DefaultArtifactResolver.resolveArtifacts(DefaultArtifactResolver.java:220)
	at org.sonatype.aether.impl.internal.DefaultRepositorySystem.resolveDependencies(DefaultRepositorySystem.java:395)
	... 32 more
Caused by: org.sonatype.aether.transfer.ArtifactNotFoundException: Could not find artifact
org.apache.james:apache-james-imap-processor:jar:0.3 in maven2-repository.dev.java.net (http://download.java.net/maven/2/)
	at org.sonatype.aether.connector.wagon.WagonRepositoryConnector$4.wrap(WagonRepositoryConnector.java:945)
	at org.sonatype.aether.connector.wagon.WagonRepositoryConnector$4.wrap(WagonRepositoryConnector.java:940)
	at org.sonatype.aether.connector.wagon.WagonRepositoryConnector$GetTask.flush(WagonRepositoryConnector.java:695)
	at org.sonatype.aether.connector.wagon.WagonRepositoryConnector$GetTask.flush(WagonRepositoryConnector.java:689)
	at org.sonatype.aether.connector.wagon.WagonRepositoryConnector.get(WagonRepositoryConnector.java:445)
	at org.sonatype.aether.impl.internal.DefaultArtifactResolver.resolve(DefaultArtifactResolver.java:460)
	... 34 more
Maven failed with error.
channel stopped


---------------------------------------------------------------------
To unsubscribe, e-mail: server-dev-unsubscribe@james.apache.org
For additional commands, e-mail: server-dev-help@james.apache.org


Mime
View raw message