james-server-dev mailing list archives

Site index · List index
Message view « Date » · « Thread »
Top « Date » · « Thread »
From Apache Jenkins Server <jenk...@builds.apache.org>
Subject Build failed in Jenkins: james-server-trunk #2696
Date Sun, 11 Mar 2012 21:35:14 GMT
See <https://builds.apache.org/job/james-server-trunk/2696/changes>

Changes:

[ieugen] JAMES-1393

- updated tests to junit 4.x style
Issue #JAMES-1393 - Upgrate all test suites to junit 4.10

[ieugen] JAMES-1393

- bumped junit version to 4.10
Issue #JAMES-1393 - Upgrate all test suites to junit 4.10

------------------------------------------
[...truncated 1308 lines...]

-------------------------------------------------------
 T E S T S
-------------------------------------------------------


Results :

Tests run: 0, Failures: 0, Errors: 0, Skipped: 0
[INFO] --- maven-surefire-plugin:2.10:test (default-test) @ james-server-fetchmail ---

[JENKINS] Recording test results
[INFO] [INFO] Building jar: <https://builds.apache.org/job/james-server-trunk/ws/trunk/fetchmail/target/james-server-fetchmail-3.0-beta5-SNAPSHOT.jar>

[INFO] --- maven-jar-plugin:2.3.2:jar (default-jar) @ james-server-fetchmail ---
[INFO] 
[INFO] --- maven-site-plugin:3.0:attach-descriptor (attach-descriptor) @ james-server-fetchmail
---
[INFO] 
[INFO] --- maven-jar-plugin:2.3.2:jar (default) @ james-server-fetchmail ---
[INFO] Building jar: <https://builds.apache.org/job/james-server-trunk/ws/trunk/fetchmail/target/james-server-fetchmail-3.0-beta5-SNAPSHOT-tests.jar>
[INFO] 
[INFO] --- maven-jar-plugin:2.3.2:test-jar (default) @ james-server-fetchmail ---
[INFO] [INFO] Installing <https://builds.apache.org/job/james-server-trunk/ws/trunk/fetchmail/target/james-server-fetchmail-3.0-beta5-SNAPSHOT.jar>
to /home/jenkins/jenkins-slave/maven-repositories/0/org/apache/james/james-server-fetchmail/3.0-beta5-SNAPSHOT/james-server-fetchmail-3.0-beta5-SNAPSHOT.jar

[INFO] --- maven-install-plugin:2.3.1:install (default-install) @ james-server-fetchmail ---
[INFO] Installing <https://builds.apache.org/job/james-server-trunk/ws/trunk/fetchmail/pom.xml>
to /home/jenkins/jenkins-slave/maven-repositories/0/org/apache/james/james-server-fetchmail/3.0-beta5-SNAPSHOT/james-server-fetchmail-3.0-beta5-SNAPSHOT.pom
[INFO] Installing <https://builds.apache.org/job/james-server-trunk/ws/trunk/fetchmail/target/james-server-fetchmail-3.0-beta5-SNAPSHOT-tests.jar>
to /home/jenkins/jenkins-slave/maven-repositories/0/org/apache/james/james-server-fetchmail/3.0-beta5-SNAPSHOT/james-server-fetchmail-3.0-beta5-SNAPSHOT-tests.jar
[INFO] Downloading: https://repository.apache.org/content/repositories/snapshots/org/apache/james/james-server-fetchmail/3.0-beta5-SNAPSHOT/maven-metadata.xml

[INFO] --- maven-deploy-plugin:2.7:deploy (default-deploy) @ james-server-fetchmail ---
Downloaded: https://repository.apache.org/content/repositories/snapshots/org/apache/james/james-server-fetchmail/3.0-beta5-SNAPSHOT/maven-metadata.xml
(1020 B at 4.0 KB/sec)
Uploading: https://repository.apache.org/content/repositories/snapshots/org/apache/james/james-server-fetchmail/3.0-beta5-SNAPSHOT/james-server-fetchmail-3.0-beta5-20120311.213449-14.jar
Uploaded: https://repository.apache.org/content/repositories/snapshots/org/apache/james/james-server-fetchmail/3.0-beta5-SNAPSHOT/james-server-fetchmail-3.0-beta5-20120311.213449-14.jar
(51 KB at 93.3 KB/sec)
Uploading: https://repository.apache.org/content/repositories/snapshots/org/apache/james/james-server-fetchmail/3.0-beta5-SNAPSHOT/james-server-fetchmail-3.0-beta5-20120311.213449-14.pom
Uploaded: https://repository.apache.org/content/repositories/snapshots/org/apache/james/james-server-fetchmail/3.0-beta5-SNAPSHOT/james-server-fetchmail-3.0-beta5-20120311.213449-14.pom
(5 KB at 25.0 KB/sec)
Downloading: https://repository.apache.org/content/repositories/snapshots/org/apache/james/james-server-fetchmail/maven-metadata.xml
Downloaded: https://repository.apache.org/content/repositories/snapshots/org/apache/james/james-server-fetchmail/maven-metadata.xml
(492 B at 2.4 KB/sec)
Uploading: https://repository.apache.org/content/repositories/snapshots/org/apache/james/james-server-fetchmail/3.0-beta5-SNAPSHOT/maven-metadata.xml
Uploaded: https://repository.apache.org/content/repositories/snapshots/org/apache/james/james-server-fetchmail/3.0-beta5-SNAPSHOT/maven-metadata.xml
(1020 B at 4.1 KB/sec)
Uploading: https://repository.apache.org/content/repositories/snapshots/org/apache/james/james-server-fetchmail/maven-metadata.xml
Uploaded: https://repository.apache.org/content/repositories/snapshots/org/apache/james/james-server-fetchmail/maven-metadata.xml
(492 B at 2.5 KB/sec)
Uploading: https://repository.apache.org/content/repositories/snapshots/org/apache/james/james-server-fetchmail/3.0-beta5-SNAPSHOT/james-server-fetchmail-3.0-beta5-20120311.213449-14-tests.jar
Uploaded: https://repository.apache.org/content/repositories/snapshots/org/apache/james/james-server-fetchmail/3.0-beta5-SNAPSHOT/james-server-fetchmail-3.0-beta5-20120311.213449-14-tests.jar
(9 KB at 46.1 KB/sec)
Uploading: https://repository.apache.org/content/repositories/snapshots/org/apache/james/james-server-fetchmail/3.0-beta5-SNAPSHOT/maven-metadata.xml
Uploaded: https://repository.apache.org/content/repositories/snapshots/org/apache/james/james-server-fetchmail/3.0-beta5-SNAPSHOT/maven-metadata.xml
(1020 B at 6.3 KB/sec)
[JENKINS] Archiving <https://builds.apache.org/job/james-server-trunk/ws/trunk/fetchmail/pom.xml>
to /home/hudson/hudson/jobs/james-server-trunk/modules/org.apache.james$james-server-fetchmail/builds/2012-03-11_21-31-57/archive/org.apache.james/james-server-fetchmail/3.0-beta5-SNAPSHOT/james-server-fetchmail-3.0-beta5-SNAPSHOT.pom
[JENKINS] Archiving <https://builds.apache.org/job/james-server-trunk/ws/trunk/fetchmail/target/james-server-fetchmail-3.0-beta5-SNAPSHOT.jar>
to /home/hudson/hudson/jobs/james-server-trunk/modules/org.apache.james$james-server-fetchmail/builds/2012-03-11_21-31-57/archive/org.apache.james/james-server-fetchmail/3.0-beta5-20120311.213449-14/james-server-fetchmail-3.0-beta5-20120311.213449-14.jar
[JENKINS] Archiving <https://builds.apache.org/job/james-server-trunk/ws/trunk/fetchmail/target/james-server-fetchmail-3.0-beta5-SNAPSHOT-tests.jar>
to /home/hudson/hudson/jobs/james-server-trunk/modules/org.apache.james$james-server-fetchmail/builds/2012-03-11_21-31-57/archive/org.apache.james/james-server-fetchmail/3.0-beta5-20120311.213449-14/james-server-fetchmail-3.0-beta5-20120311.213449-14-tests.jar
[INFO] [INFO] Deleting <https://builds.apache.org/job/james-server-trunk/ws/trunk/data-library/target>
                                                                        
[INFO] ------------------------------------------------------------------------
[INFO] Building Apache James Server Data Library 3.0-beta5-SNAPSHOT
[INFO] ------------------------------------------------------------------------
[INFO] 
[INFO] --- maven-clean-plugin:2.4.1:clean (default-clean) @ james-server-data-library ---
[INFO] 
[INFO] --- maven-remote-resources-plugin:1.2.1:process (default) @ james-server-data-library
---
[INFO] [debug] execute contextualize
[INFO] Using 'UTF-8' encoding to copy filtered resources.
[INFO] Copying 2 resources
[INFO] Copying 3 resources

[INFO] --- maven-resources-plugin:2.5:resources (default-resources) @ james-server-data-library
---
[INFO] 
[INFO] --- maven-compiler-plugin:2.3.2:compile (default-compile) @ james-server-data-library
---
[INFO] Compiling 22 source files to <https://builds.apache.org/job/james-server-trunk/ws/trunk/data-library/target/classes>
[INFO] 
[INFO] --- maven-bundle-plugin:2.3.5:manifest (bundle-manifest) @ james-server-data-library
---
[debug] execute contextualize
[INFO] [INFO] Using 'UTF-8' encoding to copy filtered resources.
[INFO] skip non existing resourceDirectory <https://builds.apache.org/job/james-server-trunk/ws/trunk/data-library/src/test/resources>
[INFO] Copying 3 resources

[INFO] --- maven-resources-plugin:2.5:testResources (default-testResources) @ james-server-data-library
---
[INFO] [INFO] Compiling 8 source files to <https://builds.apache.org/job/james-server-trunk/ws/trunk/data-library/target/test-classes>

[INFO] --- maven-compiler-plugin:2.3.2:testCompile (default-testCompile) @ james-server-data-library
---
[INFO] [INFO] Surefire report directory: <https://builds.apache.org/job/james-server-trunk/ws/trunk/data-library/target/surefire-reports>

-------------------------------------------------------
 T E S T S
-------------------------------------------------------

-------------------------------------------------------
 T E S T S
-------------------------------------------------------

[INFO] --- maven-surefire-plugin:2.10:test (default-test) @ james-server-data-library ---
Running org.apache.james.user.lib.UsersRepositoryManagementTest
Tests run: 5, Failures: 0, Errors: 0, Skipped: 0, Time elapsed: 0.107 sec

Results :

Tests run: 5, Failures: 0, Errors: 0, Skipped: 0

[JENKINS] Recording test results
[INFO] [INFO] Building jar: <https://builds.apache.org/job/james-server-trunk/ws/trunk/data-library/target/james-server-data-library-3.0-beta5-SNAPSHOT.jar>

[INFO] --- maven-jar-plugin:2.3.2:jar (default-jar) @ james-server-data-library ---
[INFO] 
[INFO] --- maven-site-plugin:3.0:attach-descriptor (attach-descriptor) @ james-server-data-library
---
[INFO] 
[INFO] --- maven-jar-plugin:2.3.2:jar (default) @ james-server-data-library ---
[INFO] Building jar: <https://builds.apache.org/job/james-server-trunk/ws/trunk/data-library/target/james-server-data-library-3.0-beta5-SNAPSHOT-tests.jar>
[INFO] 
[INFO] --- maven-jar-plugin:2.3.2:test-jar (default) @ james-server-data-library ---
[INFO] [INFO] Installing <https://builds.apache.org/job/james-server-trunk/ws/trunk/data-library/target/james-server-data-library-3.0-beta5-SNAPSHOT.jar>
to /home/jenkins/jenkins-slave/maven-repositories/0/org/apache/james/james-server-data-library/3.0-beta5-SNAPSHOT/james-server-data-library-3.0-beta5-SNAPSHOT.jar
[INFO] Installing <https://builds.apache.org/job/james-server-trunk/ws/trunk/data-library/pom.xml>
to /home/jenkins/jenkins-slave/maven-repositories/0/org/apache/james/james-server-data-library/3.0-beta5-SNAPSHOT/james-server-data-library-3.0-beta5-SNAPSHOT.pom
[INFO] Installing <https://builds.apache.org/job/james-server-trunk/ws/trunk/data-library/target/james-server-data-library-3.0-beta5-SNAPSHOT-tests.jar>
to /home/jenkins/jenkins-slave/maven-repositories/0/org/apache/james/james-server-data-library/3.0-beta5-SNAPSHOT/james-server-data-library-3.0-beta5-SNAPSHOT-tests.jar

[INFO] --- maven-install-plugin:2.3.1:install (default-install) @ james-server-data-library
---
[INFO] Downloading: https://repository.apache.org/content/repositories/snapshots/org/apache/james/james-server-data-library/3.0-beta5-SNAPSHOT/maven-metadata.xml

[INFO] --- maven-deploy-plugin:2.7:deploy (default-deploy) @ james-server-data-library ---
Downloaded: https://repository.apache.org/content/repositories/snapshots/org/apache/james/james-server-data-library/3.0-beta5-SNAPSHOT/maven-metadata.xml
(1023 B at 3.0 KB/sec)
Uploading: https://repository.apache.org/content/repositories/snapshots/org/apache/james/james-server-data-library/3.0-beta5-SNAPSHOT/james-server-data-library-3.0-beta5-20120311.213501-14.jar
Uploaded: https://repository.apache.org/content/repositories/snapshots/org/apache/james/james-server-data-library/3.0-beta5-SNAPSHOT/james-server-data-library-3.0-beta5-20120311.213501-14.jar
(52 KB at 125.3 KB/sec)
Uploading: https://repository.apache.org/content/repositories/snapshots/org/apache/james/james-server-data-library/3.0-beta5-SNAPSHOT/james-server-data-library-3.0-beta5-20120311.213501-14.pom
Uploaded: https://repository.apache.org/content/repositories/snapshots/org/apache/james/james-server-data-library/3.0-beta5-SNAPSHOT/james-server-data-library-3.0-beta5-20120311.213501-14.pom
(4 KB at 23.7 KB/sec)
Downloading: https://repository.apache.org/content/repositories/snapshots/org/apache/james/james-server-data-library/maven-metadata.xml
Downloaded: https://repository.apache.org/content/repositories/snapshots/org/apache/james/james-server-data-library/maven-metadata.xml
(495 B at 2.4 KB/sec)
Uploading: https://repository.apache.org/content/repositories/snapshots/org/apache/james/james-server-data-library/3.0-beta5-SNAPSHOT/maven-metadata.xml
Uploaded: https://repository.apache.org/content/repositories/snapshots/org/apache/james/james-server-data-library/3.0-beta5-SNAPSHOT/maven-metadata.xml
(1023 B at 3.9 KB/sec)
Uploading: https://repository.apache.org/content/repositories/snapshots/org/apache/james/james-server-data-library/maven-metadata.xml
Uploaded: https://repository.apache.org/content/repositories/snapshots/org/apache/james/james-server-data-library/maven-metadata.xml
(495 B at 2.7 KB/sec)
Uploading: https://repository.apache.org/content/repositories/snapshots/org/apache/james/james-server-data-library/3.0-beta5-SNAPSHOT/james-server-data-library-3.0-beta5-20120311.213501-14-tests.jar
Uploaded: https://repository.apache.org/content/repositories/snapshots/org/apache/james/james-server-data-library/3.0-beta5-SNAPSHOT/james-server-data-library-3.0-beta5-20120311.213501-14-tests.jar
(30 KB at 121.8 KB/sec)
Uploading: https://repository.apache.org/content/repositories/snapshots/org/apache/james/james-server-data-library/3.0-beta5-SNAPSHOT/maven-metadata.xml
Uploaded: https://repository.apache.org/content/repositories/snapshots/org/apache/james/james-server-data-library/3.0-beta5-SNAPSHOT/maven-metadata.xml
(1023 B at 6.6 KB/sec)
[JENKINS] Archiving <https://builds.apache.org/job/james-server-trunk/ws/trunk/data-library/pom.xml>
to /home/hudson/hudson/jobs/james-server-trunk/modules/org.apache.james$james-server-data-library/builds/2012-03-11_21-31-57/archive/org.apache.james/james-server-data-library/3.0-beta5-SNAPSHOT/james-server-data-library-3.0-beta5-SNAPSHOT.pom
[JENKINS] Archiving <https://builds.apache.org/job/james-server-trunk/ws/trunk/data-library/target/james-server-data-library-3.0-beta5-SNAPSHOT.jar>
to /home/hudson/hudson/jobs/james-server-trunk/modules/org.apache.james$james-server-data-library/builds/2012-03-11_21-31-57/archive/org.apache.james/james-server-data-library/3.0-beta5-20120311.213501-14/james-server-data-library-3.0-beta5-20120311.213501-14.jar
[JENKINS] Archiving <https://builds.apache.org/job/james-server-trunk/ws/trunk/data-library/target/james-server-data-library-3.0-beta5-SNAPSHOT-tests.jar>
to /home/hudson/hudson/jobs/james-server-trunk/modules/org.apache.james$james-server-data-library/builds/2012-03-11_21-31-57/archive/org.apache.james/james-server-data-library/3.0-beta5-20120311.213501-14/james-server-data-library-3.0-beta5-20120311.213501-14-tests.jar
[INFO]                                                                         
[INFO] ------------------------------------------------------------------------
[INFO] Building Apache James Server HBase Data Persistence 3.0-beta5-SNAPSHOT
[INFO] ------------------------------------------------------------------------
[INFO] [INFO] Deleting <https://builds.apache.org/job/james-server-trunk/ws/trunk/data-hbase/target>

[INFO] --- maven-clean-plugin:2.4.1:clean (default-clean) @ james-server-data-hbase ---
[INFO] 
[INFO] --- maven-remote-resources-plugin:1.2.1:process (default) @ james-server-data-hbase
---
[debug] execute contextualize
[INFO] [INFO] Using 'UTF-8' encoding to copy filtered resources.
[INFO] skip non existing resourceDirectory <https://builds.apache.org/job/james-server-trunk/ws/trunk/data-hbase/src/main/resources>
[INFO] Copying 3 resources

[INFO] --- maven-resources-plugin:2.5:resources (default-resources) @ james-server-data-hbase
---
[INFO] 
[INFO] --- maven-compiler-plugin:2.3.2:compile (default-compile) @ james-server-data-hbase
---
[INFO] Compiling 7 source files to <https://builds.apache.org/job/james-server-trunk/ws/trunk/data-hbase/target/classes>
[INFO] -------------------------------------------------------------
[ERROR] COMPILATION ERROR : 
[INFO] -------------------------------------------------------------
[ERROR] <https://builds.apache.org/job/james-server-trunk/ws/trunk/data-hbase/src/main/java/org/apache/james/system/hbase/TablePool.java>:[121,31]
unreported exception java.io.IOException; must be caught or declared to be thrown
[INFO] 1 error
[INFO] -------------------------------------------------------------
[JENKINS] Archiving <https://builds.apache.org/job/james-server-trunk/ws/trunk/data-hbase/pom.xml>
to /home/hudson/hudson/jobs/james-server-trunk/modules/org.apache.james$james-server-data-hbase/builds/2012-03-11_21-31-57/archive/org.apache.james/james-server-data-hbase/3.0-beta5-SNAPSHOT/james-server-data-hbase-3.0-beta5-SNAPSHOT.pom
[INFO] ------------------------------------------------------------------------
[INFO] Reactor Summary:
[INFO] 
[INFO] Apache James Server ............................... SUCCESS [28.345s]
[INFO] Apache James Server Lifecycle API ................. SUCCESS [6.854s]
[INFO] Apache James Server Filesystem API ................ SUCCESS [6.215s]
[INFO] Apache James Server Data API ...................... SUCCESS [6.277s]
[INFO] Apache James Server Lifecycle Spring .............. SUCCESS [9.451s]
[INFO] Apache James Server Mailetcontainer API ........... SUCCESS [4.793s]
[INFO] Apache James Server Common Utilities .............. SUCCESS [14.128s]
[INFO] Apache James Server Protocols Library ............. SUCCESS [6.983s]
[INFO] Apache James Server Core .......................... SUCCESS [14.706s]
[INFO] Apache James Server Container Spring .............. SUCCESS [8.596s]
[INFO] Apache James Server DNS Server API ................ SUCCESS [6.138s]
[INFO] Apache James Server DNSService Implementation ..... SUCCESS [6.819s]
[INFO] Apache James Server DNSService Library ............ SUCCESS [7.148s]
[INFO] Apache James Server Queue API ..................... SUCCESS [6.004s]
[INFO] Apache James Server FetchMail ..................... SUCCESS [4.999s]
[INFO] Apache James Server Data Library .................. SUCCESS [9.282s]
[INFO] Apache James Server HBase Data Persistence ........ FAILURE [5.901s]
[INFO] Apache James Server JPA Data Persistence .......... SKIPPED
[INFO] Apache James Server JCR Data Persistence .......... SKIPPED
[INFO] Apache James Server JDBC Data Persistence ......... SKIPPED
[INFO] Apache James Server File Data Persistence ......... SKIPPED
[INFO] Apache James Server LDAP Data Implementation ...... SKIPPED
[INFO] Apache James Server Mailbox Adapter ............... SKIPPED
[INFO] Apache James Server Mailetcontainer Camel ......... SKIPPED
[INFO] Apache James Server Mailets ....................... SKIPPED
[INFO] Apache James Server IMAP .......................... SKIPPED
[INFO] Apache James Server SMTP .......................... SKIPPED
[INFO] Apache James Server LMTP .......................... SKIPPED
[INFO] Apache James Server POP3 .......................... SKIPPED
[INFO] Apache James Server File Mail Queue ............... SKIPPED
[INFO] Apache James Server JMS Mail Queue ................ SKIPPED
[INFO] Apache James Server ActiveMQ Queue ................ SKIPPED
[INFO] Apache James Server Client ........................ SKIPPED
[INFO] ------------------------------------------------------------------------
[INFO] BUILD FAILURE
[INFO] ------------------------------------------------------------------------
[INFO] Total time: 3:04.077s
[INFO] Finished at: Sun Mar 11 21:35:12 UTC 2012
[INFO] Final Memory: 50M/233M
[INFO] ------------------------------------------------------------------------
Waiting for Jenkins to finish collecting data
mavenExecutionResult exceptions not empty
message : Failed to execute goal org.apache.maven.plugins:maven-compiler-plugin:2.3.2:compile
(default-compile) on project james-server-data-hbase: Compilation failure
<https://builds.apache.org/job/james-server-trunk/ws/trunk/data-hbase/src/main/java/org/apache/james/system/hbase/TablePool.java>:[121,31]
unreported exception java.io.IOException; must be caught or declared to be thrown

cause : Compilation failure
<https://builds.apache.org/job/james-server-trunk/ws/trunk/data-hbase/src/main/java/org/apache/james/system/hbase/TablePool.java>:[121,31]
unreported exception java.io.IOException; must be caught or declared to be thrown

Stack trace : 
org.apache.maven.lifecycle.LifecycleExecutionException: Failed to execute goal org.apache.maven.plugins:maven-compiler-plugin:2.3.2:compile
(default-compile) on project james-server-data-hbase: Compilation failure
<https://builds.apache.org/job/james-server-trunk/ws/trunk/data-hbase/src/main/java/org/apache/james/system/hbase/TablePool.java>:[121,31]
unreported exception java.io.IOException; must be caught or declared to be thrown

	at org.apache.maven.lifecycle.internal.MojoExecutor.execute(MojoExecutor.java:213)
	at org.apache.maven.lifecycle.internal.MojoExecutor.execute(MojoExecutor.java:153)
	at org.apache.maven.lifecycle.internal.MojoExecutor.execute(MojoExecutor.java:145)
	at org.apache.maven.lifecycle.internal.LifecycleModuleBuilder.buildProject(LifecycleModuleBuilder.java:84)
	at org.apache.maven.lifecycle.internal.LifecycleModuleBuilder.buildProject(LifecycleModuleBuilder.java:59)
	at org.apache.maven.lifecycle.internal.LifecycleStarter.singleThreadedBuild(LifecycleStarter.java:183)
	at org.apache.maven.lifecycle.internal.LifecycleStarter.execute(LifecycleStarter.java:161)
	at org.apache.maven.DefaultMaven.doExecute(DefaultMaven.java:319)
	at org.apache.maven.DefaultMaven.execute(DefaultMaven.java:156)
	at org.jvnet.hudson.maven3.launcher.Maven3Launcher.main(Maven3Launcher.java:79)
	at sun.reflect.NativeMethodAccessorImpl.invoke0(Native Method)
	at sun.reflect.NativeMethodAccessorImpl.invoke(NativeMethodAccessorImpl.java:39)
	at sun.reflect.DelegatingMethodAccessorImpl.invoke(DelegatingMethodAccessorImpl.java:25)
	at java.lang.reflect.Method.invoke(Method.java:597)
	at org.codehaus.plexus.classworlds.launcher.Launcher.launchStandard(Launcher.java:329)
	at org.codehaus.plexus.classworlds.launcher.Launcher.launch(Launcher.java:239)
	at org.jvnet.hudson.maven3.agent.Maven3Main.launch(Maven3Main.java:158)
	at hudson.maven.Maven3Builder.call(Maven3Builder.java:104)
	at hudson.maven.Maven3Builder.call(Maven3Builder.java:70)
	at hudson.remoting.UserRequest.perform(UserRequest.java:118)
	at hudson.remoting.UserRequest.perform(UserRequest.java:48)
	at hudson.remoting.Request$2.run(Request.java:287)
	at hudson.remoting.InterceptingExecutorService$1.call(InterceptingExecutorService.java:72)
	at java.util.concurrent.FutureTask$Sync.innerRun(FutureTask.java:303)
	at java.util.concurrent.FutureTask.run(FutureTask.java:138)
	at java.util.concurrent.ThreadPoolExecutor$Worker.runTask(ThreadPoolExecutor.java:886)
	at java.util.concurrent.ThreadPoolExecutor$Worker.run(ThreadPoolExecutor.java:908)
	at java.lang.Thread.run(Thread.java:662)
Caused by: org.apache.maven.plugin.CompilationFailureException: Compilation failure
<https://builds.apache.org/job/james-server-trunk/ws/trunk/data-hbase/src/main/java/org/apache/james/system/hbase/TablePool.java>:[121,31]
unreported exception java.io.IOException; must be caught or declared to be thrown

	at org.apache.maven.plugin.AbstractCompilerMojo.execute(AbstractCompilerMojo.java:656)
	at org.apache.maven.plugin.CompilerMojo.execute(CompilerMojo.java:128)
	at org.apache.maven.plugin.DefaultBuildPluginManager.executeMojo(DefaultBuildPluginManager.java:101)
	at org.apache.maven.lifecycle.internal.MojoExecutor.execute(MojoExecutor.java:209)
	... 27 more
channel stopped


---------------------------------------------------------------------
To unsubscribe, e-mail: server-dev-unsubscribe@james.apache.org
For additional commands, e-mail: server-dev-help@james.apache.org


Mime
View raw message