james-server-dev mailing list archives

Site index · List index
Message view « Date » · « Thread »
Top « Date » · « Thread »
From Apache Jenkins Server <jenk...@builds.apache.org>
Subject Build failed in Jenkins: james-server-trunk #2702
Date Sun, 11 Mar 2012 23:04:33 GMT
See <https://builds.apache.org/job/james-server-trunk/2702/changes>

Changes:

[ieugen] JAMES-1393

- changed tearDown from protected to public 
Issue #JAMES-1393 - Upgrate all test suites to junit 4.10

[ieugen] JAMES-1393

- updated tests to juni 4.x style
- added @Override and reformated code
- temporarily disabled tests for this module
Issue #JAMES-1393 - Upgrate all test suites to junit 4.10

------------------------------------------
[...truncated 1415 lines...]
[INFO] --- maven-jar-plugin:2.3.2:test-jar (default) @ james-server-data-library ---
[INFO] Building jar: <https://builds.apache.org/job/james-server-trunk/ws/trunk/data-library/target/james-server-data-library-3.0-beta5-SNAPSHOT-tests.jar>
[INFO] [INFO] Installing <https://builds.apache.org/job/james-server-trunk/ws/trunk/data-library/target/james-server-data-library-3.0-beta5-SNAPSHOT.jar>
to /home/jenkins/jenkins-slave/maven-repositories/0/org/apache/james/james-server-data-library/3.0-beta5-SNAPSHOT/james-server-data-library-3.0-beta5-SNAPSHOT.jar
[INFO] Installing <https://builds.apache.org/job/james-server-trunk/ws/trunk/data-library/pom.xml>
to /home/jenkins/jenkins-slave/maven-repositories/0/org/apache/james/james-server-data-library/3.0-beta5-SNAPSHOT/james-server-data-library-3.0-beta5-SNAPSHOT.pom

[INFO] [INFO] Installing <https://builds.apache.org/job/james-server-trunk/ws/trunk/data-library/target/james-server-data-library-3.0-beta5-SNAPSHOT-tests.jar>
to /home/jenkins/jenkins-slave/maven-repositories/0/org/apache/james/james-server-data-library/3.0-beta5-SNAPSHOT/james-server-data-library-3.0-beta5-SNAPSHOT-tests.jar
--- maven-install-plugin:2.3.1:install (default-install) @ james-server-data-library ---
[INFO] Downloading: https://repository.apache.org/content/repositories/snapshots/org/apache/james/james-server-data-library/3.0-beta5-SNAPSHOT/maven-metadata.xml

[INFO] --- maven-deploy-plugin:2.7:deploy (default-deploy) @ james-server-data-library ---
Downloaded: https://repository.apache.org/content/repositories/snapshots/org/apache/james/james-server-data-library/3.0-beta5-SNAPSHOT/maven-metadata.xml
(1023 B at 35.7 KB/sec)
Uploading: https://repository.apache.org/content/repositories/snapshots/org/apache/james/james-server-data-library/3.0-beta5-SNAPSHOT/james-server-data-library-3.0-beta5-20120311.230421-20.jar
Uploaded: https://repository.apache.org/content/repositories/snapshots/org/apache/james/james-server-data-library/3.0-beta5-SNAPSHOT/james-server-data-library-3.0-beta5-20120311.230421-20.jar
(52 KB at 471.8 KB/sec)
Uploading: https://repository.apache.org/content/repositories/snapshots/org/apache/james/james-server-data-library/3.0-beta5-SNAPSHOT/james-server-data-library-3.0-beta5-20120311.230421-20.pom
Uploaded: https://repository.apache.org/content/repositories/snapshots/org/apache/james/james-server-data-library/3.0-beta5-SNAPSHOT/james-server-data-library-3.0-beta5-20120311.230421-20.pom
(4 KB at 46.8 KB/sec)
Downloading: https://repository.apache.org/content/repositories/snapshots/org/apache/james/james-server-data-library/maven-metadata.xml
Downloaded: https://repository.apache.org/content/repositories/snapshots/org/apache/james/james-server-data-library/maven-metadata.xml
(495 B at 16.1 KB/sec)
Uploading: https://repository.apache.org/content/repositories/snapshots/org/apache/james/james-server-data-library/3.0-beta5-SNAPSHOT/maven-metadata.xml
Uploaded: https://repository.apache.org/content/repositories/snapshots/org/apache/james/james-server-data-library/3.0-beta5-SNAPSHOT/maven-metadata.xml
(1023 B at 15.9 KB/sec)
Uploading: https://repository.apache.org/content/repositories/snapshots/org/apache/james/james-server-data-library/maven-metadata.xml
Uploaded: https://repository.apache.org/content/repositories/snapshots/org/apache/james/james-server-data-library/maven-metadata.xml
(495 B at 5.5 KB/sec)
Uploading: https://repository.apache.org/content/repositories/snapshots/org/apache/james/james-server-data-library/3.0-beta5-SNAPSHOT/james-server-data-library-3.0-beta5-20120311.230421-20-tests.jar
Uploaded: https://repository.apache.org/content/repositories/snapshots/org/apache/james/james-server-data-library/3.0-beta5-SNAPSHOT/james-server-data-library-3.0-beta5-20120311.230421-20-tests.jar
(30 KB at 303.7 KB/sec)
Uploading: https://repository.apache.org/content/repositories/snapshots/org/apache/james/james-server-data-library/3.0-beta5-SNAPSHOT/maven-metadata.xml
Uploaded: https://repository.apache.org/content/repositories/snapshots/org/apache/james/james-server-data-library/3.0-beta5-SNAPSHOT/maven-metadata.xml
(1023 B at 14.5 KB/sec)
[JENKINS] Archiving <https://builds.apache.org/job/james-server-trunk/ws/trunk/data-library/pom.xml>
to /home/hudson/hudson/jobs/james-server-trunk/modules/org.apache.james$james-server-data-library/builds/2012-03-11_23-03-05/archive/org.apache.james/james-server-data-library/3.0-beta5-SNAPSHOT/james-server-data-library-3.0-beta5-SNAPSHOT.pom
[JENKINS] Archiving <https://builds.apache.org/job/james-server-trunk/ws/trunk/data-library/target/james-server-data-library-3.0-beta5-SNAPSHOT.jar>
to /home/hudson/hudson/jobs/james-server-trunk/modules/org.apache.james$james-server-data-library/builds/2012-03-11_23-03-05/archive/org.apache.james/james-server-data-library/3.0-beta5-20120311.230421-20/james-server-data-library-3.0-beta5-20120311.230421-20.jar
[JENKINS] Archiving <https://builds.apache.org/job/james-server-trunk/ws/trunk/data-library/target/james-server-data-library-3.0-beta5-SNAPSHOT-tests.jar>
to /home/hudson/hudson/jobs/james-server-trunk/modules/org.apache.james$james-server-data-library/builds/2012-03-11_23-03-05/archive/org.apache.james/james-server-data-library/3.0-beta5-20120311.230421-20/james-server-data-library-3.0-beta5-20120311.230421-20-tests.jar
[INFO]                                                                         
[INFO] ------------------------------------------------------------------------
[INFO] Building Apache James Server HBase Data Persistence 3.0-beta5-SNAPSHOT
[INFO] ------------------------------------------------------------------------
Downloading: http://download.java.net/maven/2/org/apache/james/apache-james-mailbox-hbase/0.5-SNAPSHOT/maven-metadata.xml
Downloading: http://repository.apache.org/snapshots/org/apache/james/apache-james-mailbox-hbase/0.5-SNAPSHOT/maven-metadata.xml
Downloaded: http://repository.apache.org/snapshots/org/apache/james/apache-james-mailbox-hbase/0.5-SNAPSHOT/maven-metadata.xml
(1000 B at 44.4 KB/sec)
Downloading: http://download.java.net/maven/2/org/apache/james/apache-james-mailbox/0.5-SNAPSHOT/maven-metadata.xml
Downloading: http://repository.apache.org/snapshots/org/apache/james/apache-james-mailbox/0.5-SNAPSHOT/maven-metadata.xml
Downloaded: http://repository.apache.org/snapshots/org/apache/james/apache-james-mailbox/0.5-SNAPSHOT/maven-metadata.xml
(2 KB at 42.0 KB/sec)
[INFO] Deleting <https://builds.apache.org/job/james-server-trunk/ws/trunk/data-hbase/target>
[INFO] 
[INFO] --- maven-clean-plugin:2.4.1:clean (default-clean) @ james-server-data-hbase ---
[INFO] 
[INFO] --- maven-remote-resources-plugin:1.2.1:process (default) @ james-server-data-hbase
---
Downloading: http://download.java.net/maven/2/org/apache/james/apache-james-mailbox-hbase/0.5-SNAPSHOT/maven-metadata.xml
Downloading: http://repository.apache.org/snapshots/org/apache/james/apache-james-mailbox-hbase/0.5-SNAPSHOT/maven-metadata.xml
Downloaded: http://repository.apache.org/snapshots/org/apache/james/apache-james-mailbox-hbase/0.5-SNAPSHOT/maven-metadata.xml
(1000 B at 34.9 KB/sec)
[debug] execute contextualize
[INFO] [INFO] Using 'UTF-8' encoding to copy filtered resources.
[INFO] skip non existing resourceDirectory <https://builds.apache.org/job/james-server-trunk/ws/trunk/data-hbase/src/main/resources>
[INFO] Copying 3 resources

[INFO] --- maven-resources-plugin:2.5:resources (default-resources) @ james-server-data-hbase
---
[INFO] 
[INFO] --- maven-compiler-plugin:2.3.2:compile (default-compile) @ james-server-data-hbase
---
[INFO] Compiling 7 source files to <https://builds.apache.org/job/james-server-trunk/ws/trunk/data-hbase/target/classes>
[INFO] 
[INFO] --- maven-bundle-plugin:2.3.5:manifest (bundle-manifest) @ james-server-data-hbase
---
[debug] execute contextualize
[INFO] [INFO] Using 'UTF-8' encoding to copy filtered resources.
[INFO] Copying 3 resources
[INFO] Copying 3 resources

[INFO] --- maven-resources-plugin:2.5:testResources (default-testResources) @ james-server-data-hbase
---
[INFO] 
[INFO] --- maven-compiler-plugin:2.3.2:testCompile (default-testCompile) @ james-server-data-hbase
---
[INFO] Compiling 5 source files to <https://builds.apache.org/job/james-server-trunk/ws/trunk/data-hbase/target/test-classes>
[INFO] 
[INFO] Surefire report directory: <https://builds.apache.org/job/james-server-trunk/ws/trunk/data-hbase/target/surefire-reports>
[INFO] 
-------------------------------------------------------
 T E S T S
-------------------------------------------------------
--- maven-surefire-plugin:2.10:test (default-test) @ james-server-data-hbase ---

-------------------------------------------------------
 T E S T S
-------------------------------------------------------
Running org.apache.james.JamesServerHBaseSuiteTest
Tests run: 0, Failures: 0, Errors: 0, Skipped: 0, Time elapsed: 0.048 sec

Results :

Tests run: 0, Failures: 0, Errors: 0, Skipped: 0

[JENKINS] Recording test results
[INFO] 
[INFO] --- maven-jar-plugin:2.3.2:jar (default-jar) @ james-server-data-hbase ---
[INFO] Building jar: <https://builds.apache.org/job/james-server-trunk/ws/trunk/data-hbase/target/james-server-data-hbase-3.0-beta5-SNAPSHOT.jar>
[INFO] 
[INFO] --- maven-site-plugin:3.0:attach-descriptor (attach-descriptor) @ james-server-data-hbase
---
[INFO] 
[INFO] --- maven-jar-plugin:2.3.2:jar (default) @ james-server-data-hbase ---
[INFO] 
[INFO] --- maven-jar-plugin:2.3.2:test-jar (default) @ james-server-data-hbase ---
[INFO] Building jar: <https://builds.apache.org/job/james-server-trunk/ws/trunk/data-hbase/target/james-server-data-hbase-3.0-beta5-SNAPSHOT-tests.jar>
[INFO] [INFO] Installing <https://builds.apache.org/job/james-server-trunk/ws/trunk/data-hbase/target/james-server-data-hbase-3.0-beta5-SNAPSHOT.jar>
to /home/jenkins/jenkins-slave/maven-repositories/0/org/apache/james/james-server-data-hbase/3.0-beta5-SNAPSHOT/james-server-data-hbase-3.0-beta5-SNAPSHOT.jar

[INFO] --- maven-install-plugin:2.3.1:install (default-install) @ james-server-data-hbase
---
[INFO] Installing <https://builds.apache.org/job/james-server-trunk/ws/trunk/data-hbase/pom.xml>
to /home/jenkins/jenkins-slave/maven-repositories/0/org/apache/james/james-server-data-hbase/3.0-beta5-SNAPSHOT/james-server-data-hbase-3.0-beta5-SNAPSHOT.pom
[INFO] Installing <https://builds.apache.org/job/james-server-trunk/ws/trunk/data-hbase/target/james-server-data-hbase-3.0-beta5-SNAPSHOT-tests.jar>
to /home/jenkins/jenkins-slave/maven-repositories/0/org/apache/james/james-server-data-hbase/3.0-beta5-SNAPSHOT/james-server-data-hbase-3.0-beta5-SNAPSHOT-tests.jar
[INFO] Downloading: https://repository.apache.org/content/repositories/snapshots/org/apache/james/james-server-data-hbase/3.0-beta5-SNAPSHOT/maven-metadata.xml

[INFO] --- maven-deploy-plugin:2.7:deploy (default-deploy) @ james-server-data-hbase ---
Downloaded: https://repository.apache.org/content/repositories/snapshots/org/apache/james/james-server-data-hbase/3.0-beta5-SNAPSHOT/maven-metadata.xml
(1021 B at 6.3 KB/sec)
Uploading: https://repository.apache.org/content/repositories/snapshots/org/apache/james/james-server-data-hbase/3.0-beta5-SNAPSHOT/james-server-data-hbase-3.0-beta5-20120311.230426-14.jar
Uploaded: https://repository.apache.org/content/repositories/snapshots/org/apache/james/james-server-data-hbase/3.0-beta5-SNAPSHOT/james-server-data-hbase-3.0-beta5-20120311.230426-14.jar
(30 KB at 266.7 KB/sec)
Uploading: https://repository.apache.org/content/repositories/snapshots/org/apache/james/james-server-data-hbase/3.0-beta5-SNAPSHOT/james-server-data-hbase-3.0-beta5-20120311.230426-14.pom
Uploaded: https://repository.apache.org/content/repositories/snapshots/org/apache/james/james-server-data-hbase/3.0-beta5-SNAPSHOT/james-server-data-hbase-3.0-beta5-20120311.230426-14.pom
(6 KB at 80.8 KB/sec)
Downloading: https://repository.apache.org/content/repositories/snapshots/org/apache/james/james-server-data-hbase/maven-metadata.xml
Downloaded: https://repository.apache.org/content/repositories/snapshots/org/apache/james/james-server-data-hbase/maven-metadata.xml
(411 B at 1.3 KB/sec)
Uploading: https://repository.apache.org/content/repositories/snapshots/org/apache/james/james-server-data-hbase/3.0-beta5-SNAPSHOT/maven-metadata.xml
Uploaded: https://repository.apache.org/content/repositories/snapshots/org/apache/james/james-server-data-hbase/3.0-beta5-SNAPSHOT/maven-metadata.xml
(1021 B at 4.0 KB/sec)
Uploading: https://repository.apache.org/content/repositories/snapshots/org/apache/james/james-server-data-hbase/maven-metadata.xml
Uploaded: https://repository.apache.org/content/repositories/snapshots/org/apache/james/james-server-data-hbase/maven-metadata.xml
(411 B at 4.4 KB/sec)
Uploading: https://repository.apache.org/content/repositories/snapshots/org/apache/james/james-server-data-hbase/3.0-beta5-SNAPSHOT/james-server-data-hbase-3.0-beta5-20120311.230426-14-tests.jar
Uploaded: https://repository.apache.org/content/repositories/snapshots/org/apache/james/james-server-data-hbase/3.0-beta5-SNAPSHOT/james-server-data-hbase-3.0-beta5-20120311.230426-14-tests.jar
(21 KB at 378.8 KB/sec)
Uploading: https://repository.apache.org/content/repositories/snapshots/org/apache/james/james-server-data-hbase/3.0-beta5-SNAPSHOT/maven-metadata.xml
Uploaded: https://repository.apache.org/content/repositories/snapshots/org/apache/james/james-server-data-hbase/3.0-beta5-SNAPSHOT/maven-metadata.xml
(1021 B at 18.1 KB/sec)
[JENKINS] Archiving <https://builds.apache.org/job/james-server-trunk/ws/trunk/data-hbase/pom.xml>
to /home/hudson/hudson/jobs/james-server-trunk/modules/org.apache.james$james-server-data-hbase/builds/2012-03-11_23-03-05/archive/org.apache.james/james-server-data-hbase/3.0-beta5-SNAPSHOT/james-server-data-hbase-3.0-beta5-SNAPSHOT.pom
[JENKINS] Archiving <https://builds.apache.org/job/james-server-trunk/ws/trunk/data-hbase/target/james-server-data-hbase-3.0-beta5-SNAPSHOT.jar>
to /home/hudson/hudson/jobs/james-server-trunk/modules/org.apache.james$james-server-data-hbase/builds/2012-03-11_23-03-05/archive/org.apache.james/james-server-data-hbase/3.0-beta5-20120311.230426-14/james-server-data-hbase-3.0-beta5-20120311.230426-14.jar
[JENKINS] Archiving <https://builds.apache.org/job/james-server-trunk/ws/trunk/data-hbase/target/james-server-data-hbase-3.0-beta5-SNAPSHOT-tests.jar>
to /home/hudson/hudson/jobs/james-server-trunk/modules/org.apache.james$james-server-data-hbase/builds/2012-03-11_23-03-05/archive/org.apache.james/james-server-data-hbase/3.0-beta5-20120311.230426-14/james-server-data-hbase-3.0-beta5-20120311.230426-14-tests.jar
[INFO]                                                                         
[INFO] ------------------------------------------------------------------------
[INFO] Building Apache James Server JPA Data Persistence 3.0-beta5-SNAPSHOT
[INFO] ------------------------------------------------------------------------
[INFO] [INFO] Deleting <https://builds.apache.org/job/james-server-trunk/ws/trunk/data-jpa/target>

[INFO] --- maven-clean-plugin:2.4.1:clean (default-clean) @ james-server-data-jpa ---
[INFO] 
[INFO] --- maven-remote-resources-plugin:1.2.1:process (default) @ james-server-data-jpa ---
[debug] execute contextualize
[INFO] [INFO] Using 'UTF-8' encoding to copy filtered resources.

[INFO] --- maven-resources-plugin:2.5:resources (default-resources) @ james-server-data-jpa
---
[INFO] Copying 1 resource
[INFO] Copying 3 resources
[INFO] 
[INFO] --- maven-compiler-plugin:2.3.2:compile (default-compile) @ james-server-data-jpa ---
[INFO] Compiling 6 source files to <https://builds.apache.org/job/james-server-trunk/ws/trunk/data-jpa/target/classes>
[INFO] 
[INFO] --- openjpa-maven-plugin:1.2:enhance (enhancer) @ james-server-data-jpa ---
[INFO] 
[INFO] --- maven-bundle-plugin:2.3.5:manifest (bundle-manifest) @ james-server-data-jpa ---
[debug] execute contextualize
[INFO] [INFO] Using 'UTF-8' encoding to copy filtered resources.

[INFO] --- maven-resources-plugin:2.5:testResources (default-testResources) @ james-server-data-jpa
---
[INFO] Copying 1 resource
[INFO] Copying 3 resources
[INFO] 
[INFO] --- maven-compiler-plugin:2.3.2:testCompile (default-testCompile) @ james-server-data-jpa
---
[INFO] Compiling 3 source files to <https://builds.apache.org/job/james-server-trunk/ws/trunk/data-jpa/target/test-classes>
[INFO] -------------------------------------------------------------
[ERROR] COMPILATION ERROR : 
[INFO] -------------------------------------------------------------
[ERROR] <https://builds.apache.org/job/james-server-trunk/ws/trunk/data-jpa/src/test/java/org/apache/james/user/jpa/JpaUsersRepositoryTest.java>:[41,19]
setUp() in org.apache.james.user.jpa.JpaUsersRepositoryTest cannot override setUp() in org.apache.james.user.lib.AbstractUsersRepositoryTest;
attempting to assign weaker access privileges; was public
[ERROR] <https://builds.apache.org/job/james-server-trunk/ws/trunk/data-jpa/src/test/java/org/apache/james/rrt/jpa/JPARecipientRewriteTableTest.java>:[49,19]
setUp() in org.apache.james.rrt.jpa.JPARecipientRewriteTableTest cannot override setUp() in
org.apache.james.rrt.lib.AbstractRecipientRewriteTableTest; attempting to assign weaker access
privileges; was public
[ERROR] <https://builds.apache.org/job/james-server-trunk/ws/trunk/data-jpa/src/test/java/org/apache/james/domainlist/jpa/JPADomainListTest.java>:[41,19]
setUp() in org.apache.james.domainlist.jpa.JPADomainListTest cannot override setUp() in org.apache.james.domainlist.lib.AbstractDomainListTest;
attempting to assign weaker access privileges; was public
[ERROR] <https://builds.apache.org/job/james-server-trunk/ws/trunk/data-jpa/src/test/java/org/apache/james/domainlist/jpa/JPADomainListTest.java>:[47,13]
cannot find symbol
symbol  : method tearDown()
location: class org.apache.james.domainlist.lib.AbstractDomainListTest
[ERROR] <https://builds.apache.org/job/james-server-trunk/ws/trunk/data-jpa/src/test/java/org/apache/james/domainlist/jpa/JPADomainListTest.java>:[45,4]
method does not override or implement a method from a supertype
[INFO] 5 errors 
[INFO] -------------------------------------------------------------
[JENKINS] Archiving <https://builds.apache.org/job/james-server-trunk/ws/trunk/data-jpa/pom.xml>
to /home/hudson/hudson/jobs/james-server-trunk/modules/org.apache.james$james-server-data-jpa/builds/2012-03-11_23-03-05/archive/org.apache.james/james-server-data-jpa/3.0-beta5-SNAPSHOT/james-server-data-jpa-3.0-beta5-SNAPSHOT.pom
[INFO] ------------------------------------------------------------------------
[INFO] Reactor Summary:
[INFO] 
[INFO] Apache James Server ............................... SUCCESS [6.699s]
[INFO] Apache James Server Lifecycle API ................. SUCCESS [2.351s]
[INFO] Apache James Server Filesystem API ................ SUCCESS [2.426s]
[INFO] Apache James Server Data API ...................... SUCCESS [2.192s]
[INFO] Apache James Server Lifecycle Spring .............. SUCCESS [8.078s]
[INFO] Apache James Server Mailetcontainer API ........... SUCCESS [1.869s]
[INFO] Apache James Server Common Utilities .............. SUCCESS [5.369s]
[INFO] Apache James Server Protocols Library ............. SUCCESS [2.757s]
[INFO] Apache James Server Core .......................... SUCCESS [10.447s]
[INFO] Apache James Server Container Spring .............. SUCCESS [5.521s]
[INFO] Apache James Server DNS Server API ................ SUCCESS [2.585s]
[INFO] Apache James Server DNSService Implementation ..... SUCCESS [2.427s]
[INFO] Apache James Server DNSService Library ............ SUCCESS [3.764s]
[INFO] Apache James Server Queue API ..................... SUCCESS [4.635s]
[INFO] Apache James Server FetchMail ..................... SUCCESS [2.002s]
[INFO] Apache James Server Data Library .................. SUCCESS [2.973s]
[INFO] Apache James Server HBase Data Persistence ........ SUCCESS [5.309s]
[INFO] Apache James Server JPA Data Persistence .......... FAILURE [3.616s]
[INFO] Apache James Server JCR Data Persistence .......... SKIPPED
[INFO] Apache James Server JDBC Data Persistence ......... SKIPPED
[INFO] Apache James Server File Data Persistence ......... SKIPPED
[INFO] Apache James Server LDAP Data Implementation ...... SKIPPED
[INFO] Apache James Server Mailbox Adapter ............... SKIPPED
[INFO] Apache James Server Mailetcontainer Camel ......... SKIPPED
[INFO] Apache James Server Mailets ....................... SKIPPED
[INFO] Apache James Server IMAP .......................... SKIPPED
[INFO] Apache James Server SMTP .......................... SKIPPED
[INFO] Apache James Server LMTP .......................... SKIPPED
[INFO] Apache James Server POP3 .......................... SKIPPED
[INFO] Apache James Server File Mail Queue ............... SKIPPED
[INFO] Apache James Server JMS Mail Queue ................ SKIPPED
[INFO] Apache James Server ActiveMQ Queue ................ SKIPPED
[INFO] Apache James Server Client ........................ SKIPPED
[INFO] ------------------------------------------------------------------------
[INFO] BUILD FAILURE
[INFO] ------------------------------------------------------------------------
[INFO] Total time: 1:22.702s
[INFO] Finished at: Sun Mar 11 23:04:31 UTC 2012
[INFO] Final Memory: 57M/724M
[INFO] ------------------------------------------------------------------------
Waiting for Jenkins to finish collecting data
mavenExecutionResult exceptions not empty
message : Failed to execute goal org.apache.maven.plugins:maven-compiler-plugin:2.3.2:testCompile
(default-testCompile) on project james-server-data-jpa: Compilation failure
cause : Compilation failure
Stack trace : 
org.apache.maven.lifecycle.LifecycleExecutionException: Failed to execute goal org.apache.maven.plugins:maven-compiler-plugin:2.3.2:testCompile
(default-testCompile) on project james-server-data-jpa: Compilation failure
	at org.apache.maven.lifecycle.internal.MojoExecutor.execute(MojoExecutor.java:213)
	at org.apache.maven.lifecycle.internal.MojoExecutor.execute(MojoExecutor.java:153)
	at org.apache.maven.lifecycle.internal.MojoExecutor.execute(MojoExecutor.java:145)
	at org.apache.maven.lifecycle.internal.LifecycleModuleBuilder.buildProject(LifecycleModuleBuilder.java:84)
	at org.apache.maven.lifecycle.internal.LifecycleModuleBuilder.buildProject(LifecycleModuleBuilder.java:59)
	at org.apache.maven.lifecycle.internal.LifecycleStarter.singleThreadedBuild(LifecycleStarter.java:183)
	at org.apache.maven.lifecycle.internal.LifecycleStarter.execute(LifecycleStarter.java:161)
	at org.apache.maven.DefaultMaven.doExecute(DefaultMaven.java:319)
	at org.apache.maven.DefaultMaven.execute(DefaultMaven.java:156)
	at org.jvnet.hudson.maven3.launcher.Maven3Launcher.main(Maven3Launcher.java:79)
	at sun.reflect.NativeMethodAccessorImpl.invoke0(Native Method)
	at sun.reflect.NativeMethodAccessorImpl.invoke(NativeMethodAccessorImpl.java:39)
	at sun.reflect.DelegatingMethodAccessorImpl.invoke(DelegatingMethodAccessorImpl.java:25)
	at java.lang.reflect.Method.invoke(Method.java:597)
	at org.codehaus.plexus.classworlds.launcher.Launcher.launchStandard(Launcher.java:329)
	at org.codehaus.plexus.classworlds.launcher.Launcher.launch(Launcher.java:239)
	at org.jvnet.hudson.maven3.agent.Maven3Main.launch(Maven3Main.java:158)
	at hudson.maven.Maven3Builder.call(Maven3Builder.java:104)
	at hudson.maven.Maven3Builder.call(Maven3Builder.java:70)
	at hudson.remoting.UserRequest.perform(UserRequest.java:118)
	at hudson.remoting.UserRequest.perform(UserRequest.java:48)
	at hudson.remoting.Request$2.run(Request.java:287)
	at hudson.remoting.InterceptingExecutorService$1.call(InterceptingExecutorService.java:72)
	at java.util.concurrent.FutureTask$Sync.innerRun(FutureTask.java:303)
	at java.util.concurrent.FutureTask.run(FutureTask.java:138)
	at java.util.concurrent.ThreadPoolExecutor$Worker.runTask(ThreadPoolExecutor.java:886)
	at java.util.concurrent.ThreadPoolExecutor$Worker.run(ThreadPoolExecutor.java:908)
	at java.lang.Thread.run(Thread.java:662)
Caused by: org.apache.maven.plugin.CompilationFailureException: Compilation failure
	at org.apache.maven.plugin.AbstractCompilerMojo.execute(AbstractCompilerMojo.java:656)
	at org.apache.maven.plugin.TestCompilerMojo.execute(TestCompilerMojo.java:161)
	at org.apache.maven.plugin.DefaultBuildPluginManager.executeMojo(DefaultBuildPluginManager.java:101)
	at org.apache.maven.lifecycle.internal.MojoExecutor.execute(MojoExecutor.java:209)
	... 27 more
channel stopped


---------------------------------------------------------------------
To unsubscribe, e-mail: server-dev-unsubscribe@james.apache.org
For additional commands, e-mail: server-dev-help@james.apache.org


Mime
View raw message