james-server-dev mailing list archives

Site index · List index
Message view « Date » · « Thread »
Top « Date » · « Thread »
From Apache Jenkins Server <jenk...@builds.apache.org>
Subject Build failed in Jenkins: james-server-trunk #2972
Date Fri, 22 Jun 2012 14:16:54 GMT
See <https://builds.apache.org/job/james-server-trunk/2972/>

------------------------------------------
[...truncated 2361 lines...]
	at org.apache.hadoop.hbase.ipc.HBaseRPC.waitForProxy(HBaseRPC.java:236)
	at org.apache.hadoop.hbase.regionserver.HRegionServer.getMaster(HRegionServer.java:1629)
	at org.apache.hadoop.hbase.regionserver.HRegionServer.reportForDuty(HRegionServer.java:1666)
	at org.apache.hadoop.hbase.regionserver.HRegionServer.run(HRegionServer.java:634)
	at org.apache.hadoop.hbase.MiniHBaseCluster$MiniHBaseClusterRegionServer.runRegionServer(MiniHBaseCluster.java:136)
	at org.apache.hadoop.hbase.MiniHBaseCluster$MiniHBaseClusterRegionServer.access$000(MiniHBaseCluster.java:89)
	at org.apache.hadoop.hbase.MiniHBaseCluster$MiniHBaseClusterRegionServer$1.run(MiniHBaseCluster.java:120)
	at java.security.AccessController.doPrivileged(Native Method)
	at javax.security.auth.Subject.doAs(Subject.java:337)
	at org.apache.hadoop.security.UserGroupInformation.doAs(UserGroupInformation.java:1075)
	at sun.reflect.NativeMethodAccessorImpl.invoke0(Native Method)
	at sun.reflect.NativeMethodAccessorImpl.invoke(NativeMethodAccessorImpl.java:39)
	at sun.reflect.DelegatingMethodAccessorImpl.invoke(DelegatingMethodAccessorImpl.java:25)
	at java.lang.reflect.Method.invoke(Method.java:597)
	at org.apache.hadoop.hbase.util.Methods.call(Methods.java:37)
	at org.apache.hadoop.hbase.security.User.call(User.java:586)
	at org.apache.hadoop.hbase.security.User.access$700(User.java:50)
	at org.apache.hadoop.hbase.security.User$SecureHadoopUser.runAs(User.java:426)
	at org.apache.hadoop.hbase.MiniHBaseCluster$MiniHBaseClusterRegionServer.run(MiniHBaseCluster.java:118)
	at java.lang.Thread.run(Thread.java:662)
Tests run: 1, Failures: 0, Errors: 1, Skipped: 0, Time elapsed: 611.556 sec <<< FAILURE!
2012-06-22 14:16:22,281 [RegionServer:0;vesta.apache.org,50147,1340373978275] WARN  org.apache.hadoop.hbase.regionserver.HRegionServer
- reportForDuty failed; sleeping and then retrying.
2012-06-22 14:16:22,304 [RegionServer:0;vesta.apache.org,50147,1340373978275] WARN  org.apache.hadoop.hbase.zookeeper.RecoverableZooKeeper
- Node /hbase/rs/vesta.apache.org,50147,1340373978275 already deleted, and this is not a retry
2012-06-22 14:16:22,304 [RegionServer:0;vesta.apache.org,50147,1340373978275] WARN  org.apache.hadoop.hbase.regionserver.HRegionServer
- Failed deleting my ephemeral node
org.apache.zookeeper.KeeperException$NoNodeException: KeeperErrorCode = NoNode for /hbase/rs/vesta.apache.org,50147,1340373978275
	at org.apache.zookeeper.KeeperException.create(KeeperException.java:111)
	at org.apache.zookeeper.KeeperException.create(KeeperException.java:51)
	at org.apache.zookeeper.ZooKeeper.delete(ZooKeeper.java:868)
	at org.apache.hadoop.hbase.zookeeper.RecoverableZooKeeper.delete(RecoverableZooKeeper.java:107)
	at org.apache.hadoop.hbase.zookeeper.ZKUtil.deleteNode(ZKUtil.java:962)
	at org.apache.hadoop.hbase.zookeeper.ZKUtil.deleteNode(ZKUtil.java:951)
	at org.apache.hadoop.hbase.regionserver.HRegionServer.deleteMyEphemeralNode(HRegionServer.java:950)
	at org.apache.hadoop.hbase.regionserver.HRegionServer.run(HRegionServer.java:748)
	at org.apache.hadoop.hbase.MiniHBaseCluster$MiniHBaseClusterRegionServer.runRegionServer(MiniHBaseCluster.java:136)
	at org.apache.hadoop.hbase.MiniHBaseCluster$MiniHBaseClusterRegionServer.access$000(MiniHBaseCluster.java:89)
	at org.apache.hadoop.hbase.MiniHBaseCluster$MiniHBaseClusterRegionServer$1.run(MiniHBaseCluster.java:120)
	at java.security.AccessController.doPrivileged(Native Method)
	at javax.security.auth.Subject.doAs(Subject.java:337)
	at org.apache.hadoop.security.UserGroupInformation.doAs(UserGroupInformation.java:1075)
	at sun.reflect.NativeMethodAccessorImpl.invoke0(Native Method)
	at sun.reflect.NativeMethodAccessorImpl.invoke(NativeMethodAccessorImpl.java:39)
	at sun.reflect.DelegatingMethodAccessorImpl.invoke(DelegatingMethodAccessorImpl.java:25)
	at java.lang.reflect.Method.invoke(Method.java:597)
	at org.apache.hadoop.hbase.util.Methods.call(Methods.java:37)
	at org.apache.hadoop.hbase.security.User.call(User.java:586)
	at org.apache.hadoop.hbase.security.User.access$700(User.java:50)
	at org.apache.hadoop.hbase.security.User$SecureHadoopUser.runAs(User.java:426)
	at org.apache.hadoop.hbase.MiniHBaseCluster$MiniHBaseClusterRegionServer.run(MiniHBaseCluster.java:118)
	at java.lang.Thread.run(Thread.java:662)
2012-06-22 14:16:22,314 [RegionServer:0;vesta.apache.org,50147,1340373978275] ERROR org.apache.hadoop.hbase.regionserver.HRegionServer
- Exception in run
java.lang.NullPointerException
	at org.apache.hadoop.hbase.regionserver.HRegionServer.join(HRegionServer.java:1587)
	at org.apache.hadoop.hbase.regionserver.HRegionServer.run(HRegionServer.java:757)
	at org.apache.hadoop.hbase.MiniHBaseCluster$MiniHBaseClusterRegionServer.runRegionServer(MiniHBaseCluster.java:136)
	at org.apache.hadoop.hbase.MiniHBaseCluster$MiniHBaseClusterRegionServer.access$000(MiniHBaseCluster.java:89)
	at org.apache.hadoop.hbase.MiniHBaseCluster$MiniHBaseClusterRegionServer$1.run(MiniHBaseCluster.java:120)
	at java.security.AccessController.doPrivileged(Native Method)
	at javax.security.auth.Subject.doAs(Subject.java:337)
	at org.apache.hadoop.security.UserGroupInformation.doAs(UserGroupInformation.java:1075)
	at sun.reflect.NativeMethodAccessorImpl.invoke0(Native Method)
	at sun.reflect.NativeMethodAccessorImpl.invoke(NativeMethodAccessorImpl.java:39)
	at sun.reflect.DelegatingMethodAccessorImpl.invoke(DelegatingMethodAccessorImpl.java:25)
	at java.lang.reflect.Method.invoke(Method.java:597)
	at org.apache.hadoop.hbase.util.Methods.call(Methods.java:37)
	at org.apache.hadoop.hbase.security.User.call(User.java:586)
	at org.apache.hadoop.hbase.security.User.access$700(User.java:50)
	at org.apache.hadoop.hbase.security.User$SecureHadoopUser.runAs(User.java:426)
	at org.apache.hadoop.hbase.MiniHBaseCluster$MiniHBaseClusterRegionServer.run(MiniHBaseCluster.java:118)
	at java.lang.Thread.run(Thread.java:662)

Results :

Tests in error: 
  testStoreAndRetrieveRegexMapping(org.apache.james.rrt.hbase.HBaseRecipientRewriteTableTest)
  testStoreAndRetrieveAddressMapping(org.apache.james.rrt.hbase.HBaseRecipientRewriteTableTest):
Could not initialize class org.apache.james.rrt.hbase.HBaseRecipientRewriteTableTest
  testStoreAndRetrieveErrorMapping(org.apache.james.rrt.hbase.HBaseRecipientRewriteTableTest):
Could not initialize class org.apache.james.rrt.hbase.HBaseRecipientRewriteTableTest
  testStoreAndRetrieveWildCardAddressMapping(org.apache.james.rrt.hbase.HBaseRecipientRewriteTableTest):
Could not initialize class org.apache.james.rrt.hbase.HBaseRecipientRewriteTableTest
  testRecursiveMapping(org.apache.james.rrt.hbase.HBaseRecipientRewriteTableTest): Could not
initialize class org.apache.james.rrt.hbase.HBaseRecipientRewriteTableTest
  testAliasDomainMapping(org.apache.james.rrt.hbase.HBaseRecipientRewriteTableTest): Could
not initialize class org.apache.james.rrt.hbase.HBaseRecipientRewriteTableTest
  org.apache.james.domainlist.hbase.HBaseDomainListTest
  org.apache.james.system.hbase.TablePoolTest
  org.apache.james.user.hbase.HBaseUsersRepositoryTest

Tests run: 9, Failures: 0, Errors: 9, Skipped: 0

mojoFailed org.apache.maven.plugins:maven-surefire-plugin:2.10(default-test)
[JENKINS] Recording test results
projectFailed org.apache.james:james-server-data-hbase:3.0-beta5-SNAPSHOT
sessionEnded
[INFO] ------------------------------------------------------------------------
[INFO] Reactor Summary:
[INFO] 
[INFO] Apache James Server ............................... SUCCESS [23.434s]
[INFO] Apache James Server Lifecycle API ................. SUCCESS [9.175s]
[INFO] Apache James Server Filesystem API ................ SUCCESS [7.216s]
[INFO] Apache James Server Data API ...................... SUCCESS [6.193s]
[INFO] Apache James Server Lifecycle Spring .............. SUCCESS [8.245s]
[INFO] Apache James Server Mailetcontainer API ........... SUCCESS [5.285s]
[INFO] Apache James Server Common Utilities .............. SUCCESS [15.315s]
[INFO] Apache James Server Protocols Library ............. SUCCESS [9.659s]
[INFO] Apache James Server Core .......................... SUCCESS [14.715s]
[INFO] Apache James Server Container Spring .............. SUCCESS [11.989s]
[INFO] Apache James Server DNS Server API ................ SUCCESS [6.233s]
[INFO] Apache James Server DNSService Implementation ..... SUCCESS [8.355s]
[INFO] Apache James Server DNSService Library ............ SUCCESS [13.350s]
[INFO] Apache James Server Queue API ..................... SUCCESS [9.287s]
[INFO] Apache James Server FetchMail ..................... SUCCESS [6.484s]
[INFO] Apache James Server Data Library .................. SUCCESS [7.983s]
[INFO] Apache James Server HBase Data Persistence ........ FAILURE [40:59.145s]
[INFO] Apache James Server JPA Data Persistence .......... SKIPPED
[INFO] Apache James Server JCR Data Persistence .......... SKIPPED
[INFO] Apache James Server JDBC Data Persistence ......... SKIPPED
[INFO] Apache James Server File Data Persistence ......... SKIPPED
[INFO] Apache James Server LDAP Data Implementation ...... SKIPPED
[INFO] Apache James Server Mailbox Adapter ............... SKIPPED
[INFO] Apache James Server Mailetcontainer Camel ......... SKIPPED
[INFO] Apache James Server Mailets ....................... SKIPPED
[INFO] Apache James Server IMAP .......................... SKIPPED
[INFO] Apache James Server SMTP .......................... SKIPPED
[INFO] Apache James Server LMTP .......................... SKIPPED
[INFO] Apache James Server POP3 .......................... SKIPPED
[INFO] Apache James Server File Mail Queue ............... SKIPPED
[INFO] Apache James Server JMS Mail Queue ................ SKIPPED
[INFO] Apache James Server ActiveMQ Queue ................ SKIPPED
[INFO] Apache James Server Client ........................ SKIPPED
[INFO] ------------------------------------------------------------------------
[INFO] BUILD FAILURE
[INFO] ------------------------------------------------------------------------
[INFO] Total time: 43:50.542s
[INFO] Finished at: Fri Jun 22 14:16:23 UTC 2012
[INFO] Final Memory: 67M/271M
[INFO] ------------------------------------------------------------------------
Projects to build: [MavenProject: org.apache.james:james-server:3.0-beta5-SNAPSHOT @ <https://builds.apache.org/job/james-server-trunk/ws/trunk/pom.xml,>
MavenProject: org.apache.james:james-server-lifecycle-api:3.0-beta5-SNAPSHOT @ <https://builds.apache.org/job/james-server-trunk/ws/trunk/lifecycle-api/pom.xml,>
MavenProject: org.apache.james:james-server-filesystem-api:3.0-beta5-SNAPSHOT @ <https://builds.apache.org/job/james-server-trunk/ws/trunk/filesystem-api/pom.xml,>
MavenProject: org.apache.james:james-server-data-api:3.0-beta5-SNAPSHOT @ <https://builds.apache.org/job/james-server-trunk/ws/trunk/data-api/pom.xml,>
MavenProject: org.apache.james:james-server-lifecycle-spring:3.0-beta5-SNAPSHOT @ <https://builds.apache.org/job/james-server-trunk/ws/trunk/lifecycle-spring/pom.xml,>
MavenProject: org.apache.james:james-server-mailetcontainer-api:3.0-beta5-SNAPSHOT @ <https://builds.apache.org/job/james-server-trunk/ws/trunk/mailetcontainer-api/pom.xml,>
MavenProject: org.apache.james:james-server-util:3.0-beta5-SNAPSHOT @ <https://builds.apache.org/job/james-server-trunk/ws/trunk/util/pom.xml,>
MavenProject: org.apache.james:james-server-protocols-library:3.0-beta5-SNAPSHOT @ <https://builds.apache.org/job/james-server-trunk/ws/trunk/protocols-library/pom.xml,>
MavenProject: org.apache.james:james-server-core:3.0-beta5-SNAPSHOT @ <https://builds.apache.org/job/james-server-trunk/ws/trunk/core/pom.xml,>
MavenProject: org.apache.james:james-server-container-spring:3.0-beta5-SNAPSHOT @ <https://builds.apache.org/job/james-server-trunk/ws/trunk/container-spring/pom.xml,>
MavenProject: org.apache.james:james-server-dnsservice-api:3.0-beta5-SNAPSHOT @ <https://builds.apache.org/job/james-server-trunk/ws/trunk/dnsservice-api/pom.xml,>
MavenProject: org.apache.james:james-server-dnsservice-dnsjava:3.0-beta5-SNAPSHOT @ <https://builds.apache.org/job/james-server-trunk/ws/trunk/dnsservice-dnsjava/pom.xml,>
MavenProject: org.apache.james:james-server-dnsservice-library:3.0-beta5-SNAPSHOT @ <https://builds.apache.org/job/james-server-trunk/ws/trunk/dnsservice-library/pom.xml,>
MavenProject: org.apache.james:james-server-queue-api:3.0-beta5-SNAPSHOT @ <https://builds.apache.org/job/james-server-trunk/ws/trunk/queue-api/pom.xml,>
MavenProject: org.apache.james:james-server-fetchmail:3.0-beta5-SNAPSHOT @ <https://builds.apache.org/job/james-server-trunk/ws/trunk/fetchmail/pom.xml,>
MavenProject: org.apache.james:james-server-data-library:3.0-beta5-SNAPSHOT @ <https://builds.apache.org/job/james-server-trunk/ws/trunk/data-library/pom.xml,>
MavenProject: org.apache.james:james-server-data-hbase:3.0-beta5-SNAPSHOT @ <https://builds.apache.org/job/james-server-trunk/ws/trunk/data-hbase/pom.xml,>
MavenProject: org.apache.james:james-server-data-jpa:3.0-beta5-SNAPSHOT @ <https://builds.apache.org/job/james-server-trunk/ws/trunk/data-jpa/pom.xml,>
MavenProject: org.apache.james:james-server-data-jcr:3.0-beta5-SNAPSHOT @ <https://builds.apache.org/job/james-server-trunk/ws/trunk/data-jcr/pom.xml,>
MavenProject: org.apache.james:james-server-data-jdbc:3.0-beta5-SNAPSHOT @ <https://builds.apache.org/job/james-server-trunk/ws/trunk/data-jdbc/pom.xml,>
MavenProject: org.apache.james:james-server-data-file:3.0-beta5-SNAPSHOT @ <https://builds.apache.org/job/james-server-trunk/ws/trunk/data-file/pom.xml,>
MavenProject: org.apache.james:james-server-data-ldap:3.0-beta5-SNAPSHOT @ <https://builds.apache.org/job/james-server-trunk/ws/trunk/data-ldap/pom.xml,>
MavenProject: org.apache.james:james-server-mailbox-adapter:3.0-beta5-SNAPSHOT @ <https://builds.apache.org/job/james-server-trunk/ws/trunk/mailbox-adapter/pom.xml,>
MavenProject: org.apache.james:james-server-mailetcontainer-camel:3.0-beta5-SNAPSHOT @ <https://builds.apache.org/job/james-server-trunk/ws/trunk/mailetcontainer-camel/pom.xml,>
MavenProject: org.apache.james:james-server-mailets:3.0-beta5-SNAPSHOT @ <https://builds.apache.org/job/james-server-trunk/ws/trunk/mailets/pom.xml,>
MavenProject: org.apache.james:james-server-protocols-imap4:3.0-beta5-SNAPSHOT @ <https://builds.apache.org/job/james-server-trunk/ws/trunk/protocols-imap4/pom.xml,>
MavenProject: org.apache.james:james-server-protocols-smtp:3.0-beta5-SNAPSHOT @ <https://builds.apache.org/job/james-server-trunk/ws/trunk/protocols-smtp/pom.xml,>
MavenProject: org.apache.james:james-server-protocols-lmtp:3.0-beta5-SNAPSHOT @ <https://builds.apache.org/job/james-server-trunk/ws/trunk/protocols-lmtp/pom.xml,>
MavenProject: org.apache.james:james-server-protocols-pop3:3.0-beta5-SNAPSHOT @ <https://builds.apache.org/job/james-server-trunk/ws/trunk/protocols-pop3/pom.xml,>
MavenProject: org.apache.james:james-server-queue-file:3.0-beta5-SNAPSHOT @ <https://builds.apache.org/job/james-server-trunk/ws/trunk/queue-file/pom.xml,>
MavenProject: org.apache.james:james-server-queue-jms:3.0-beta5-SNAPSHOT @ <https://builds.apache.org/job/james-server-trunk/ws/trunk/queue-jms/pom.xml,>
MavenProject: org.apache.james:james-server-queue-activemq:3.0-beta5-SNAPSHOT @ <https://builds.apache.org/job/james-server-trunk/ws/trunk/queue-activemq/pom.xml,>
MavenProject: org.apache.james:james-server-cli:3.0-beta5-SNAPSHOT @ <https://builds.apache.org/job/james-server-trunk/ws/trunk/cli/pom.xml]>
[JENKINS] Archiving <https://builds.apache.org/job/james-server-trunk/ws/trunk/data-file/pom.xml>
to /home/hudson/hudson/jobs/james-server-trunk/modules/org.apache.james$james-server-data-file/builds/2012-06-22_13-32-19/archive/org.apache.james/james-server-data-file/3.0-beta5-SNAPSHOT/james-server-data-file-3.0-beta5-SNAPSHOT.pom
[JENKINS] Archiving <https://builds.apache.org/job/james-server-trunk/ws/trunk/protocols-lmtp/pom.xml>
to /home/hudson/hudson/jobs/james-server-trunk/modules/org.apache.james$james-server-protocols-lmtp/builds/2012-06-22_13-32-19/archive/org.apache.james/james-server-protocols-lmtp/3.0-beta5-SNAPSHOT/james-server-protocols-lmtp-3.0-beta5-SNAPSHOT.pom
[JENKINS] Archiving <https://builds.apache.org/job/james-server-trunk/ws/trunk/data-jcr/pom.xml>
to /home/hudson/hudson/jobs/james-server-trunk/modules/org.apache.james$james-server-data-jcr/builds/2012-06-22_13-32-18/archive/org.apache.james/james-server-data-jcr/3.0-beta5-SNAPSHOT/james-server-data-jcr-3.0-beta5-SNAPSHOT.pom
[JENKINS] Archiving <https://builds.apache.org/job/james-server-trunk/ws/trunk/fetchmail/pom.xml>
to /home/hudson/hudson/jobs/james-server-trunk/modules/org.apache.james$james-server-fetchmail/builds/2012-06-22_13-32-18/archive/org.apache.james/james-server-fetchmail/3.0-beta5-SNAPSHOT/james-server-fetchmail-3.0-beta5-SNAPSHOT.pom
[JENKINS] Archiving <https://builds.apache.org/job/james-server-trunk/ws/trunk/fetchmail/target/james-server-fetchmail-3.0-beta5-SNAPSHOT.jar>
to /home/hudson/hudson/jobs/james-server-trunk/modules/org.apache.james$james-server-fetchmail/builds/2012-06-22_13-32-18/archive/org.apache.james/james-server-fetchmail/3.0-beta5-20120622.133514-285/james-server-fetchmail-3.0-beta5-20120622.133514-285.jar
[JENKINS] Archiving <https://builds.apache.org/job/james-server-trunk/ws/trunk/fetchmail/target/james-server-fetchmail-3.0-beta5-SNAPSHOT-tests.jar>
to /home/hudson/hudson/jobs/james-server-trunk/modules/org.apache.james$james-server-fetchmail/builds/2012-06-22_13-32-18/archive/org.apache.james/james-server-fetchmail/3.0-beta5-20120622.133514-285/james-server-fetchmail-3.0-beta5-20120622.133514-285-tests.jar
[JENKINS] Archiving <https://builds.apache.org/job/james-server-trunk/ws/trunk/data-jdbc/pom.xml>
to /home/hudson/hudson/jobs/james-server-trunk/modules/org.apache.james$james-server-data-jdbc/builds/2012-06-22_13-32-19/archive/org.apache.james/james-server-data-jdbc/3.0-beta5-SNAPSHOT/james-server-data-jdbc-3.0-beta5-SNAPSHOT.pom
[JENKINS] Archiving <https://builds.apache.org/job/james-server-trunk/ws/trunk/dnsservice-api/pom.xml>
to /home/hudson/hudson/jobs/james-server-trunk/modules/org.apache.james$james-server-dnsservice-api/builds/2012-06-22_13-32-18/archive/org.apache.james/james-server-dnsservice-api/3.0-beta5-SNAPSHOT/james-server-dnsservice-api-3.0-beta5-SNAPSHOT.pom
[JENKINS] Archiving <https://builds.apache.org/job/james-server-trunk/ws/trunk/dnsservice-api/target/james-server-dnsservice-api-3.0-beta5-SNAPSHOT.jar>
to /home/hudson/hudson/jobs/james-server-trunk/modules/org.apache.james$james-server-dnsservice-api/builds/2012-06-22_13-32-18/archive/org.apache.james/james-server-dnsservice-api/3.0-beta5-20120622.133435-285/james-server-dnsservice-api-3.0-beta5-20120622.133435-285.jar
[JENKINS] Archiving <https://builds.apache.org/job/james-server-trunk/ws/trunk/dnsservice-api/target/james-server-dnsservice-api-3.0-beta5-SNAPSHOT-tests.jar>
to /home/hudson/hudson/jobs/james-server-trunk/modules/org.apache.james$james-server-dnsservice-api/builds/2012-06-22_13-32-18/archive/org.apache.james/james-server-dnsservice-api/3.0-beta5-20120622.133435-285/james-server-dnsservice-api-3.0-beta5-20120622.133435-285-tests.jar
[JENKINS] Archiving <https://builds.apache.org/job/james-server-trunk/ws/trunk/pom.xml>
to /home/hudson/hudson/jobs/james-server-trunk/modules/org.apache.james$james-server/builds/2012-06-22_13-32-18/archive/org.apache.james/james-server/3.0-beta5-SNAPSHOT/james-server-3.0-beta5-SNAPSHOT.pom
[JENKINS] Archiving <https://builds.apache.org/job/james-server-trunk/ws/trunk/target/james-server-3.0-beta5-SNAPSHOT-site.xml>
to /home/hudson/hudson/jobs/james-server-trunk/modules/org.apache.james$james-server/builds/2012-06-22_13-32-18/archive/org.apache.james/james-server/3.0-beta5-20120622.133259-288/james-server-3.0-beta5-20120622.133259-288-site.xml
[JENKINS] Archiving <https://builds.apache.org/job/james-server-trunk/ws/trunk/data-api/pom.xml>
to /home/hudson/hudson/jobs/james-server-trunk/modules/org.apache.james$james-server-data-api/builds/2012-06-22_13-32-18/archive/org.apache.james/james-server-data-api/3.0-beta5-SNAPSHOT/james-server-data-api-3.0-beta5-SNAPSHOT.pom
[JENKINS] Archiving <https://builds.apache.org/job/james-server-trunk/ws/trunk/data-api/target/james-server-data-api-3.0-beta5-SNAPSHOT.jar>
to /home/hudson/hudson/jobs/james-server-trunk/modules/org.apache.james$james-server-data-api/builds/2012-06-22_13-32-18/archive/org.apache.james/james-server-data-api/3.0-beta5-20120622.133322-288/james-server-data-api-3.0-beta5-20120622.133322-288.jar
[JENKINS] Archiving <https://builds.apache.org/job/james-server-trunk/ws/trunk/data-api/target/james-server-data-api-3.0-beta5-SNAPSHOT-tests.jar>
to /home/hudson/hudson/jobs/james-server-trunk/modules/org.apache.james$james-server-data-api/builds/2012-06-22_13-32-18/archive/org.apache.james/james-server-data-api/3.0-beta5-20120622.133322-288/james-server-data-api-3.0-beta5-20120622.133322-288-tests.jar
[JENKINS] Archiving <https://builds.apache.org/job/james-server-trunk/ws/trunk/container-spring/pom.xml>
to /home/hudson/hudson/jobs/james-server-trunk/modules/org.apache.james$james-server-container-spring/builds/2012-06-22_13-32-18/archive/org.apache.james/james-server-container-spring/3.0-beta5-SNAPSHOT/james-server-container-spring-3.0-beta5-SNAPSHOT.pom
[JENKINS] Archiving <https://builds.apache.org/job/james-server-trunk/ws/trunk/container-spring/target/james-server-container-spring-3.0-beta5-SNAPSHOT.jar>
to /home/hudson/hudson/jobs/james-server-trunk/modules/org.apache.james$james-server-container-spring/builds/2012-06-22_13-32-18/archive/org.apache.james/james-server-container-spring/3.0-beta5-20120622.133428-285/james-server-container-spring-3.0-beta5-20120622.133428-285.jar
[JENKINS] Archiving <https://builds.apache.org/job/james-server-trunk/ws/trunk/container-spring/target/james-server-container-spring-3.0-beta5-SNAPSHOT-tests.jar>
to /home/hudson/hudson/jobs/james-server-trunk/modules/org.apache.james$james-server-container-spring/builds/2012-06-22_13-32-18/archive/org.apache.james/james-server-container-spring/3.0-beta5-20120622.133428-285/james-server-container-spring-3.0-beta5-20120622.133428-285-tests.jar
[JENKINS] Archiving <https://builds.apache.org/job/james-server-trunk/ws/trunk/protocols-library/pom.xml>
to /home/hudson/hudson/jobs/james-server-trunk/modules/org.apache.james$james-server-protocols-library/builds/2012-06-22_13-32-19/archive/org.apache.james/james-server-protocols-library/3.0-beta5-SNAPSHOT/james-server-protocols-library-3.0-beta5-SNAPSHOT.pom
[JENKINS] Archiving <https://builds.apache.org/job/james-server-trunk/ws/trunk/protocols-library/target/james-server-protocols-library-3.0-beta5-SNAPSHOT.jar>
to /home/hudson/hudson/jobs/james-server-trunk/modules/org.apache.james$james-server-protocols-library/builds/2012-06-22_13-32-19/archive/org.apache.james/james-server-protocols-library/3.0-beta5-20120622.133401-285/james-server-protocols-library-3.0-beta5-20120622.133401-285.jar
[JENKINS] Archiving <https://builds.apache.org/job/james-server-trunk/ws/trunk/protocols-library/target/james-server-protocols-library-3.0-beta5-SNAPSHOT-tests.jar>
to /home/hudson/hudson/jobs/james-server-trunk/modules/org.apache.james$james-server-protocols-library/builds/2012-06-22_13-32-19/archive/org.apache.james/james-server-protocols-library/3.0-beta5-20120622.133401-285/james-server-protocols-library-3.0-beta5-20120622.133401-285-tests.jar
[JENKINS] Archiving <https://builds.apache.org/job/james-server-trunk/ws/trunk/dnsservice-library/pom.xml>
to /home/hudson/hudson/jobs/james-server-trunk/modules/org.apache.james$james-server-dnsservice-library/builds/2012-06-22_13-32-18/archive/org.apache.james/james-server-dnsservice-library/3.0-beta5-SNAPSHOT/james-server-dnsservice-library-3.0-beta5-SNAPSHOT.pom
[JENKINS] Archiving <https://builds.apache.org/job/james-server-trunk/ws/trunk/dnsservice-library/target/james-server-dnsservice-library-3.0-beta5-SNAPSHOT.jar>
to /home/hudson/hudson/jobs/james-server-trunk/modules/org.apache.james$james-server-dnsservice-library/builds/2012-06-22_13-32-18/archive/org.apache.james/james-server-dnsservice-library/3.0-beta5-20120622.133456-285/james-server-dnsservice-library-3.0-beta5-20120622.133456-285.jar
[JENKINS] Archiving <https://builds.apache.org/job/james-server-trunk/ws/trunk/dnsservice-library/target/james-server-dnsservice-library-3.0-beta5-SNAPSHOT-tests.jar>
to /home/hudson/hudson/jobs/james-server-trunk/modules/org.apache.james$james-server-dnsservice-library/builds/2012-06-22_13-32-18/archive/org.apache.james/james-server-dnsservice-library/3.0-beta5-20120622.133456-285/james-server-dnsservice-library-3.0-beta5-20120622.133456-285-tests.jar
[JENKINS] Archiving <https://builds.apache.org/job/james-server-trunk/ws/trunk/util/pom.xml>
to /home/hudson/hudson/jobs/james-server-trunk/modules/org.apache.james$james-server-util/builds/2012-06-22_13-32-19/archive/org.apache.james/james-server-util/3.0-beta5-SNAPSHOT/james-server-util-3.0-beta5-SNAPSHOT.pom
[JENKINS] Archiving <https://builds.apache.org/job/james-server-trunk/ws/trunk/util/target/james-server-util-3.0-beta5-SNAPSHOT.jar>
to /home/hudson/hudson/jobs/james-server-trunk/modules/org.apache.james$james-server-util/builds/2012-06-22_13-32-19/archive/org.apache.james/james-server-util/3.0-beta5-20120622.133352-285/james-server-util-3.0-beta5-20120622.133352-285.jar
[JENKINS] Archiving <https://builds.apache.org/job/james-server-trunk/ws/trunk/util/target/james-server-util-3.0-beta5-SNAPSHOT-tests.jar>
to /home/hudson/hudson/jobs/james-server-trunk/modules/org.apache.james$james-server-util/builds/2012-06-22_13-32-19/archive/org.apache.james/james-server-util/3.0-beta5-20120622.133352-285/james-server-util-3.0-beta5-20120622.133352-285-tests.jar
[JENKINS] Archiving <https://builds.apache.org/job/james-server-trunk/ws/trunk/protocols-pop3/pom.xml>
to /home/hudson/hudson/jobs/james-server-trunk/modules/org.apache.james$james-server-protocols-pop3/builds/2012-06-22_13-32-19/archive/org.apache.james/james-server-protocols-pop3/3.0-beta5-SNAPSHOT/james-server-protocols-pop3-3.0-beta5-SNAPSHOT.pom
[JENKINS] Archiving <https://builds.apache.org/job/james-server-trunk/ws/trunk/mailets/pom.xml>
to /home/hudson/hudson/jobs/james-server-trunk/modules/org.apache.james$james-server-mailets/builds/2012-06-22_13-32-19/archive/org.apache.james/james-server-mailets/3.0-beta5-SNAPSHOT/james-server-mailets-3.0-beta5-SNAPSHOT.pom
[JENKINS] Archiving <https://builds.apache.org/job/james-server-trunk/ws/trunk/cli/pom.xml>
to /home/hudson/hudson/jobs/james-server-trunk/modules/org.apache.james$james-server-cli/builds/2012-06-22_13-32-19/archive/org.apache.james/james-server-cli/3.0-beta5-SNAPSHOT/james-server-cli-3.0-beta5-SNAPSHOT.pom
[JENKINS] Archiving <https://builds.apache.org/job/james-server-trunk/ws/trunk/queue-file/pom.xml>
to /home/hudson/hudson/jobs/james-server-trunk/modules/org.apache.james$james-server-queue-file/builds/2012-06-22_13-32-19/archive/org.apache.james/james-server-queue-file/3.0-beta5-SNAPSHOT/james-server-queue-file-3.0-beta5-SNAPSHOT.pom
[JENKINS] Archiving <https://builds.apache.org/job/james-server-trunk/ws/trunk/protocols-smtp/pom.xml>
to /home/hudson/hudson/jobs/james-server-trunk/modules/org.apache.james$james-server-protocols-smtp/builds/2012-06-22_13-32-19/archive/org.apache.james/james-server-protocols-smtp/3.0-beta5-SNAPSHOT/james-server-protocols-smtp-3.0-beta5-SNAPSHOT.pom
[JENKINS] Archiving <https://builds.apache.org/job/james-server-trunk/ws/trunk/lifecycle-api/pom.xml>
to /home/hudson/hudson/jobs/james-server-trunk/modules/org.apache.james$james-server-lifecycle-api/builds/2012-06-22_13-32-19/archive/org.apache.james/james-server-lifecycle-api/3.0-beta5-SNAPSHOT/james-server-lifecycle-api-3.0-beta5-SNAPSHOT.pom
[JENKINS] Archiving <https://builds.apache.org/job/james-server-trunk/ws/trunk/lifecycle-api/target/james-server-lifecycle-api-3.0-beta5-SNAPSHOT.jar>
to /home/hudson/hudson/jobs/james-server-trunk/modules/org.apache.james$james-server-lifecycle-api/builds/2012-06-22_13-32-19/archive/org.apache.james/james-server-lifecycle-api/3.0-beta5-20120622.133308-288/james-server-lifecycle-api-3.0-beta5-20120622.133308-288.jar
[JENKINS] Archiving <https://builds.apache.org/job/james-server-trunk/ws/trunk/lifecycle-api/target/james-server-lifecycle-api-3.0-beta5-SNAPSHOT-tests.jar>
to /home/hudson/hudson/jobs/james-server-trunk/modules/org.apache.james$james-server-lifecycle-api/builds/2012-06-22_13-32-19/archive/org.apache.james/james-server-lifecycle-api/3.0-beta5-20120622.133308-288/james-server-lifecycle-api-3.0-beta5-20120622.133308-288-tests.jar
[JENKINS] Archiving <https://builds.apache.org/job/james-server-trunk/ws/trunk/protocols-imap4/pom.xml>
to /home/hudson/hudson/jobs/james-server-trunk/modules/org.apache.james$james-server-protocols-imap4/builds/2012-06-22_13-32-19/archive/org.apache.james/james-server-protocols-imap4/3.0-beta5-SNAPSHOT/james-server-protocols-imap4-3.0-beta5-SNAPSHOT.pom
[JENKINS] Archiving <https://builds.apache.org/job/james-server-trunk/ws/trunk/filesystem-api/pom.xml>
to /home/hudson/hudson/jobs/james-server-trunk/modules/org.apache.james$james-server-filesystem-api/builds/2012-06-22_13-32-18/archive/org.apache.james/james-server-filesystem-api/3.0-beta5-SNAPSHOT/james-server-filesystem-api-3.0-beta5-SNAPSHOT.pom
[JENKINS] Archiving <https://builds.apache.org/job/james-server-trunk/ws/trunk/filesystem-api/target/james-server-filesystem-api-3.0-beta5-SNAPSHOT.jar>
to /home/hudson/hudson/jobs/james-server-trunk/modules/org.apache.james$james-server-filesystem-api/builds/2012-06-22_13-32-18/archive/org.apache.james/james-server-filesystem-api/3.0-beta5-20120622.133316-288/james-server-filesystem-api-3.0-beta5-20120622.133316-288.jar
[JENKINS] Archiving <https://builds.apache.org/job/james-server-trunk/ws/trunk/filesystem-api/target/james-server-filesystem-api-3.0-beta5-SNAPSHOT-tests.jar>
to /home/hudson/hudson/jobs/james-server-trunk/modules/org.apache.james$james-server-filesystem-api/builds/2012-06-22_13-32-18/archive/org.apache.james/james-server-filesystem-api/3.0-beta5-20120622.133316-288/james-server-filesystem-api-3.0-beta5-20120622.133316-288-tests.jar
[JENKINS] Archiving <https://builds.apache.org/job/james-server-trunk/ws/trunk/data-hbase/pom.xml>
to /home/hudson/hudson/jobs/james-server-trunk/modules/org.apache.james$james-server-data-hbase/builds/2012-06-22_13-32-18/archive/org.apache.james/james-server-data-hbase/3.0-beta5-SNAPSHOT/james-server-data-hbase-3.0-beta5-SNAPSHOT.pom
[JENKINS] Archiving <https://builds.apache.org/job/james-server-trunk/ws/trunk/data-ldap/pom.xml>
to /home/hudson/hudson/jobs/james-server-trunk/modules/org.apache.james$james-server-data-ldap/builds/2012-06-22_13-32-19/archive/org.apache.james/james-server-data-ldap/3.0-beta5-SNAPSHOT/james-server-data-ldap-3.0-beta5-SNAPSHOT.pom
[JENKINS] Archiving <https://builds.apache.org/job/james-server-trunk/ws/trunk/queue-api/pom.xml>
to /home/hudson/hudson/jobs/james-server-trunk/modules/org.apache.james$james-server-queue-api/builds/2012-06-22_13-32-19/archive/org.apache.james/james-server-queue-api/3.0-beta5-SNAPSHOT/james-server-queue-api-3.0-beta5-SNAPSHOT.pom
[JENKINS] Archiving <https://builds.apache.org/job/james-server-trunk/ws/trunk/queue-api/target/james-server-queue-api-3.0-beta5-SNAPSHOT.jar>
to /home/hudson/hudson/jobs/james-server-trunk/modules/org.apache.james$james-server-queue-api/builds/2012-06-22_13-32-19/archive/org.apache.james/james-server-queue-api/3.0-beta5-20120622.133507-285/james-server-queue-api-3.0-beta5-20120622.133507-285.jar
[JENKINS] Archiving <https://builds.apache.org/job/james-server-trunk/ws/trunk/queue-api/target/james-server-queue-api-3.0-beta5-SNAPSHOT-tests.jar>
to /home/hudson/hudson/jobs/james-server-trunk/modules/org.apache.james$james-server-queue-api/builds/2012-06-22_13-32-19/archive/org.apache.james/james-server-queue-api/3.0-beta5-20120622.133507-285/james-server-queue-api-3.0-beta5-20120622.133507-285-tests.jar
[JENKINS] Archiving <https://builds.apache.org/job/james-server-trunk/ws/trunk/mailetcontainer-camel/pom.xml>
to /home/hudson/hudson/jobs/james-server-trunk/modules/org.apache.james$james-server-mailetcontainer-camel/builds/2012-06-22_13-32-19/archive/org.apache.james/james-server-mailetcontainer-camel/3.0-beta5-SNAPSHOT/james-server-mailetcontainer-camel-3.0-beta5-SNAPSHOT.pom
[JENKINS] Archiving <https://builds.apache.org/job/james-server-trunk/ws/trunk/queue-activemq/pom.xml>
to /home/hudson/hudson/jobs/james-server-trunk/modules/org.apache.james$james-server-queue-activemq/builds/2012-06-22_13-32-19/archive/org.apache.james/james-server-queue-activemq/3.0-beta5-SNAPSHOT/james-server-queue-activemq-3.0-beta5-SNAPSHOT.pom
[JENKINS] Archiving <https://builds.apache.org/job/james-server-trunk/ws/trunk/mailetcontainer-api/pom.xml>
to /home/hudson/hudson/jobs/james-server-trunk/modules/org.apache.james$james-server-mailetcontainer-api/builds/2012-06-22_13-32-19/archive/org.apache.james/james-server-mailetcontainer-api/3.0-beta5-SNAPSHOT/james-server-mailetcontainer-api-3.0-beta5-SNAPSHOT.pom
[JENKINS] Archiving <https://builds.apache.org/job/james-server-trunk/ws/trunk/mailetcontainer-api/target/james-server-mailetcontainer-api-3.0-beta5-SNAPSHOT.jar>
to /home/hudson/hudson/jobs/james-server-trunk/modules/org.apache.james$james-server-mailetcontainer-api/builds/2012-06-22_13-32-19/archive/org.apache.james/james-server-mailetcontainer-api/3.0-beta5-20120622.133336-285/james-server-mailetcontainer-api-3.0-beta5-20120622.133336-285.jar
[JENKINS] Archiving <https://builds.apache.org/job/james-server-trunk/ws/trunk/mailetcontainer-api/target/james-server-mailetcontainer-api-3.0-beta5-SNAPSHOT-tests.jar>
to /home/hudson/hudson/jobs/james-server-trunk/modules/org.apache.james$james-server-mailetcontainer-api/builds/2012-06-22_13-32-19/archive/org.apache.james/james-server-mailetcontainer-api/3.0-beta5-20120622.133336-285/james-server-mailetcontainer-api-3.0-beta5-20120622.133336-285-tests.jar
[JENKINS] Archiving <https://builds.apache.org/job/james-server-trunk/ws/trunk/data-library/pom.xml>
to /home/hudson/hudson/jobs/james-server-trunk/modules/org.apache.james$james-server-data-library/builds/2012-06-22_13-32-18/archive/org.apache.james/james-server-data-library/3.0-beta5-SNAPSHOT/james-server-data-library-3.0-beta5-SNAPSHOT.pom
[JENKINS] Archiving <https://builds.apache.org/job/james-server-trunk/ws/trunk/data-library/target/james-server-data-library-3.0-beta5-SNAPSHOT.jar>
to /home/hudson/hudson/jobs/james-server-trunk/modules/org.apache.james$james-server-data-library/builds/2012-06-22_13-32-18/archive/org.apache.james/james-server-data-library/3.0-beta5-20120622.133522-285/james-server-data-library-3.0-beta5-20120622.133522-285.jar
[JENKINS] Archiving <https://builds.apache.org/job/james-server-trunk/ws/trunk/data-library/target/james-server-data-library-3.0-beta5-SNAPSHOT-tests.jar>
to /home/hudson/hudson/jobs/james-server-trunk/modules/org.apache.james$james-server-data-library/builds/2012-06-22_13-32-18/archive/org.apache.james/james-server-data-library/3.0-beta5-20120622.133522-285/james-server-data-library-3.0-beta5-20120622.133522-285-tests.jar
[JENKINS] Archiving <https://builds.apache.org/job/james-server-trunk/ws/trunk/dnsservice-dnsjava/pom.xml>
to /home/hudson/hudson/jobs/james-server-trunk/modules/org.apache.james$james-server-dnsservice-dnsjava/builds/2012-06-22_13-32-18/archive/org.apache.james/james-server-dnsservice-dnsjava/3.0-beta5-SNAPSHOT/james-server-dnsservice-dnsjava-3.0-beta5-SNAPSHOT.pom
[JENKINS] Archiving <https://builds.apache.org/job/james-server-trunk/ws/trunk/dnsservice-dnsjava/target/james-server-dnsservice-dnsjava-3.0-beta5-SNAPSHOT.jar>
to /home/hudson/hudson/jobs/james-server-trunk/modules/org.apache.james$james-server-dnsservice-dnsjava/builds/2012-06-22_13-32-18/archive/org.apache.james/james-server-dnsservice-dnsjava/3.0-beta5-20120622.133443-285/james-server-dnsservice-dnsjava-3.0-beta5-20120622.133443-285.jar
[JENKINS] Archiving <https://builds.apache.org/job/james-server-trunk/ws/trunk/dnsservice-dnsjava/target/james-server-dnsservice-dnsjava-3.0-beta5-SNAPSHOT-tests.jar>
to /home/hudson/hudson/jobs/james-server-trunk/modules/org.apache.james$james-server-dnsservice-dnsjava/builds/2012-06-22_13-32-18/archive/org.apache.james/james-server-dnsservice-dnsjava/3.0-beta5-20120622.133443-285/james-server-dnsservice-dnsjava-3.0-beta5-20120622.133443-285-tests.jar
[JENKINS] Archiving <https://builds.apache.org/job/james-server-trunk/ws/trunk/queue-jms/pom.xml>
to /home/hudson/hudson/jobs/james-server-trunk/modules/org.apache.james$james-server-queue-jms/builds/2012-06-22_13-32-19/archive/org.apache.james/james-server-queue-jms/3.0-beta5-SNAPSHOT/james-server-queue-jms-3.0-beta5-SNAPSHOT.pom
[JENKINS] Archiving <https://builds.apache.org/job/james-server-trunk/ws/trunk/core/pom.xml>
to /home/hudson/hudson/jobs/james-server-trunk/modules/org.apache.james$james-server-core/builds/2012-06-22_13-32-18/archive/org.apache.james/james-server-core/3.0-beta5-SNAPSHOT/james-server-core-3.0-beta5-SNAPSHOT.pom
[JENKINS] Archiving <https://builds.apache.org/job/james-server-trunk/ws/trunk/core/target/james-server-core-3.0-beta5-SNAPSHOT.jar>
to /home/hudson/hudson/jobs/james-server-trunk/modules/org.apache.james$james-server-core/builds/2012-06-22_13-32-18/archive/org.apache.james/james-server-core/3.0-beta5-20120622.133417-285/james-server-core-3.0-beta5-20120622.133417-285.jar
[JENKINS] Archiving <https://builds.apache.org/job/james-server-trunk/ws/trunk/core/target/james-server-core-3.0-beta5-SNAPSHOT-tests.jar>
to /home/hudson/hudson/jobs/james-server-trunk/modules/org.apache.james$james-server-core/builds/2012-06-22_13-32-18/archive/org.apache.james/james-server-core/3.0-beta5-20120622.133417-285/james-server-core-3.0-beta5-20120622.133417-285-tests.jar
[JENKINS] Archiving <https://builds.apache.org/job/james-server-trunk/ws/trunk/mailbox-adapter/pom.xml>
to /home/hudson/hudson/jobs/james-server-trunk/modules/org.apache.james$james-server-mailbox-adapter/builds/2012-06-22_13-32-19/archive/org.apache.james/james-server-mailbox-adapter/3.0-beta5-SNAPSHOT/james-server-mailbox-adapter-3.0-beta5-SNAPSHOT.pom
[JENKINS] Archiving <https://builds.apache.org/job/james-server-trunk/ws/trunk/lifecycle-spring/pom.xml>
to /home/hudson/hudson/jobs/james-server-trunk/modules/org.apache.james$james-server-lifecycle-spring/builds/2012-06-22_13-32-19/archive/org.apache.james/james-server-lifecycle-spring/3.0-beta5-SNAPSHOT/james-server-lifecycle-spring-3.0-beta5-SNAPSHOT.pom
[JENKINS] Archiving <https://builds.apache.org/job/james-server-trunk/ws/trunk/lifecycle-spring/target/james-server-lifecycle-spring-3.0-beta5-SNAPSHOT.jar>
to /home/hudson/hudson/jobs/james-server-trunk/modules/org.apache.james$james-server-lifecycle-spring/builds/2012-06-22_13-32-19/archive/org.apache.james/james-server-lifecycle-spring/3.0-beta5-20120622.133331-285/james-server-lifecycle-spring-3.0-beta5-20120622.133331-285.jar
[JENKINS] Archiving <https://builds.apache.org/job/james-server-trunk/ws/trunk/lifecycle-spring/target/james-server-lifecycle-spring-3.0-beta5-SNAPSHOT-tests.jar>
to /home/hudson/hudson/jobs/james-server-trunk/modules/org.apache.james$james-server-lifecycle-spring/builds/2012-06-22_13-32-19/archive/org.apache.james/james-server-lifecycle-spring/3.0-beta5-20120622.133331-285/james-server-lifecycle-spring-3.0-beta5-20120622.133331-285-tests.jar
[JENKINS] Archiving <https://builds.apache.org/job/james-server-trunk/ws/trunk/data-jpa/pom.xml>
to /home/hudson/hudson/jobs/james-server-trunk/modules/org.apache.james$james-server-data-jpa/builds/2012-06-22_13-32-18/archive/org.apache.james/james-server-data-jpa/3.0-beta5-SNAPSHOT/james-server-data-jpa-3.0-beta5-SNAPSHOT.pom
Waiting for Jenkins to finish collecting data
mavenExecutionResult exceptions not empty
message : Failed to execute goal org.apache.maven.plugins:maven-surefire-plugin:2.10:test
(default-test) on project james-server-data-hbase: There are test failures.

Please refer to <https://builds.apache.org/job/james-server-trunk/ws/trunk/data-hbase/target/surefire-reports>
for the individual test results.
cause : There are test failures.

Please refer to <https://builds.apache.org/job/james-server-trunk/ws/trunk/data-hbase/target/surefire-reports>
for the individual test results.
Stack trace : 
org.apache.maven.lifecycle.LifecycleExecutionException: Failed to execute goal org.apache.maven.plugins:maven-surefire-plugin:2.10:test
(default-test) on project james-server-data-hbase: There are test failures.

Please refer to <https://builds.apache.org/job/james-server-trunk/ws/trunk/data-hbase/target/surefire-reports>
for the individual test results.
	at org.apache.maven.lifecycle.internal.MojoExecutor.execute(MojoExecutor.java:213)
	at org.apache.maven.lifecycle.internal.MojoExecutor.execute(MojoExecutor.java:153)
	at org.apache.maven.lifecycle.internal.MojoExecutor.execute(MojoExecutor.java:145)
	at org.apache.maven.lifecycle.internal.LifecycleModuleBuilder.buildProject(LifecycleModuleBuilder.java:84)
	at org.apache.maven.lifecycle.internal.LifecycleModuleBuilder.buildProject(LifecycleModuleBuilder.java:59)
	at org.apache.maven.lifecycle.internal.LifecycleStarter.singleThreadedBuild(LifecycleStarter.java:183)
	at org.apache.maven.lifecycle.internal.LifecycleStarter.execute(LifecycleStarter.java:161)
	at org.apache.maven.DefaultMaven.doExecute(DefaultMaven.java:319)
	at org.apache.maven.DefaultMaven.execute(DefaultMaven.java:156)
	at org.jvnet.hudson.maven3.launcher.Maven3Launcher.main(Maven3Launcher.java:79)
	at sun.reflect.NativeMethodAccessorImpl.invoke0(Native Method)
	at sun.reflect.NativeMethodAccessorImpl.invoke(NativeMethodAccessorImpl.java:39)
	at sun.reflect.DelegatingMethodAccessorImpl.invoke(DelegatingMethodAccessorImpl.java:25)
	at java.lang.reflect.Method.invoke(Method.java:597)
	at org.codehaus.plexus.classworlds.launcher.Launcher.launchStandard(Launcher.java:329)
	at org.codehaus.plexus.classworlds.launcher.Launcher.launch(Launcher.java:239)
	at org.jvnet.hudson.maven3.agent.Maven3Main.launch(Maven3Main.java:158)
	at hudson.maven.Maven3Builder.call(Maven3Builder.java:98)
	at hudson.maven.Maven3Builder.call(Maven3Builder.java:64)
	at hudson.remoting.UserRequest.perform(UserRequest.java:118)
	at hudson.remoting.UserRequest.perform(UserRequest.java:48)
	at hudson.remoting.Request$2.run(Request.java:287)
	at hudson.remoting.InterceptingExecutorService$1.call(InterceptingExecutorService.java:72)
	at java.util.concurrent.FutureTask$Sync.innerRun(FutureTask.java:303)
	at java.util.concurrent.FutureTask.run(FutureTask.java:138)
	at java.util.concurrent.ThreadPoolExecutor$Worker.runTask(ThreadPoolExecutor.java:886)
	at java.util.concurrent.ThreadPoolExecutor$Worker.run(ThreadPoolExecutor.java:908)
	at java.lang.Thread.run(Thread.java:662)
Caused by: org.apache.maven.plugin.MojoFailureException: There are test failures.

Please refer to <https://builds.apache.org/job/james-server-trunk/ws/trunk/data-hbase/target/surefire-reports>
for the individual test results.
	at org.apache.maven.plugin.surefire.SurefireHelper.reportExecution(SurefireHelper.java:87)
	at org.apache.maven.plugin.surefire.SurefirePlugin.writeSummary(SurefirePlugin.java:641)
	at org.apache.maven.plugin.surefire.SurefirePlugin.handleSummary(SurefirePlugin.java:615)
	at org.apache.maven.plugin.surefire.AbstractSurefireMojo.executeAfterPreconditionsChecked(AbstractSurefireMojo.java:137)
	at org.apache.maven.plugin.surefire.AbstractSurefireMojo.execute(AbstractSurefireMojo.java:98)
	at org.apache.maven.plugin.DefaultBuildPluginManager.executeMojo(DefaultBuildPluginManager.java:101)
	at org.apache.maven.lifecycle.internal.MojoExecutor.execute(MojoExecutor.java:209)
	... 27 more
channel stopped

---------------------------------------------------------------------
To unsubscribe, e-mail: server-dev-unsubscribe@james.apache.org
For additional commands, e-mail: server-dev-help@james.apache.org


Mime
View raw message