james-server-dev mailing list archives

Site index · List index
Message view « Date » · « Thread »
Top « Date » · « Thread »
From Apache Jenkins Server <jenk...@builds.apache.org>
Subject Build failed in Jenkins: james-server-trunk #3125
Date Mon, 13 Aug 2012 07:41:20 GMT
See <https://builds.apache.org/job/james-server-trunk/3125/changes>

Changes:

[eric] Move AbstractBeanFactory to a package lower

[eric] Remove unneeded dependency in james-server-queue-file

[eric] Ensure FileMailQueue survive James restart (JAMES-1429) + Code format

------------------------------------------
[...truncated 2080 lines...]
	at org.apache.zookeeper.ZooKeeper.delete(ZooKeeper.java:868)
	at org.apache.hadoop.hbase.zookeeper.RecoverableZooKeeper.delete(RecoverableZooKeeper.java:107)
	at org.apache.hadoop.hbase.zookeeper.ZKUtil.deleteNode(ZKUtil.java:962)
	at org.apache.hadoop.hbase.zookeeper.ZKUtil.deleteNode(ZKUtil.java:951)
	at org.apache.hadoop.hbase.regionserver.HRegionServer.deleteMyEphemeralNode(HRegionServer.java:950)
	at org.apache.hadoop.hbase.regionserver.HRegionServer.run(HRegionServer.java:748)
	at org.apache.hadoop.hbase.MiniHBaseCluster$MiniHBaseClusterRegionServer.runRegionServer(MiniHBaseCluster.java:136)
	at org.apache.hadoop.hbase.MiniHBaseCluster$MiniHBaseClusterRegionServer.access$000(MiniHBaseCluster.java:89)
	at org.apache.hadoop.hbase.MiniHBaseCluster$MiniHBaseClusterRegionServer$1.run(MiniHBaseCluster.java:120)
	at java.security.AccessController.doPrivileged(Native Method)
	at javax.security.auth.Subject.doAs(Subject.java:337)
	at org.apache.hadoop.security.UserGroupInformation.doAs(UserGroupInformation.java:1075)
	at sun.reflect.NativeMethodAccessorImpl.invoke0(Native Method)
	at sun.reflect.NativeMethodAccessorImpl.invoke(NativeMethodAccessorImpl.java:39)
	at sun.reflect.DelegatingMethodAccessorImpl.invoke(DelegatingMethodAccessorImpl.java:25)
	at java.lang.reflect.Method.invoke(Method.java:597)
	at org.apache.hadoop.hbase.util.Methods.call(Methods.java:37)
	at org.apache.hadoop.hbase.security.User.call(User.java:586)
	at org.apache.hadoop.hbase.security.User.access$700(User.java:50)
	at org.apache.hadoop.hbase.security.User$SecureHadoopUser.runAs(User.java:426)
	at org.apache.hadoop.hbase.MiniHBaseCluster$MiniHBaseClusterRegionServer.run(MiniHBaseCluster.java:118)
	at java.lang.Thread.run(Thread.java:662)
2012-08-13 07:39:29,026 [RegionServer:0;janus.apache.org,59081,1344842967267] ERROR org.apache.hadoop.hbase.regionserver.HRegionServer
- Exception in run
java.lang.NullPointerException
	at org.apache.hadoop.hbase.regionserver.HRegionServer.join(HRegionServer.java:1587)
	at org.apache.hadoop.hbase.regionserver.HRegionServer.run(HRegionServer.java:757)
	at org.apache.hadoop.hbase.MiniHBaseCluster$MiniHBaseClusterRegionServer.runRegionServer(MiniHBaseCluster.java:136)
	at org.apache.hadoop.hbase.MiniHBaseCluster$MiniHBaseClusterRegionServer.access$000(MiniHBaseCluster.java:89)
	at org.apache.hadoop.hbase.MiniHBaseCluster$MiniHBaseClusterRegionServer$1.run(MiniHBaseCluster.java:120)
	at java.security.AccessController.doPrivileged(Native Method)
	at javax.security.auth.Subject.doAs(Subject.java:337)
	at org.apache.hadoop.security.UserGroupInformation.doAs(UserGroupInformation.java:1075)
	at sun.reflect.NativeMethodAccessorImpl.invoke0(Native Method)
	at sun.reflect.NativeMethodAccessorImpl.invoke(NativeMethodAccessorImpl.java:39)
	at sun.reflect.DelegatingMethodAccessorImpl.invoke(DelegatingMethodAccessorImpl.java:25)
	at java.lang.reflect.Method.invoke(Method.java:597)
	at org.apache.hadoop.hbase.util.Methods.call(Methods.java:37)
	at org.apache.hadoop.hbase.security.User.call(User.java:586)
	at org.apache.hadoop.hbase.security.User.access$700(User.java:50)
	at org.apache.hadoop.hbase.security.User$SecureHadoopUser.runAs(User.java:426)
	at org.apache.hadoop.hbase.MiniHBaseCluster$MiniHBaseClusterRegionServer.run(MiniHBaseCluster.java:118)
	at java.lang.Thread.run(Thread.java:662)
Running org.apache.james.domainlist.hbase.HBaseDomainListTest
2012-08-13 07:39:30,679 [main] WARN  org.apache.hadoop.metrics2.impl.MetricsSystemImpl - Source
name ugi already exists!
2012-08-13 07:39:30,706 [main] WARN  org.apache.hadoop.metrics2.impl.MetricsSystemImpl - Source
name ugi already exists!
Starting DataNode 0 with dfs.data.dir: <https://builds.apache.org/job/james-server-trunk/ws/trunk/data-hbase/target/test-data/86e4c51c-cc5c-466a-8c53-299b19d47573/dfscluster_51e60ca6-e407-40db-aadf-5984136e17cb/dfs/data/data1,/home/jenkins/jenkins-slave/workspace/james-server-trunk/trunk/data-hbase/target/test-data/86e4c51c-cc5c-466a-8c53-299b19d47573/dfscluster_51e60ca6-e407-40db-aadf-5984136e17cb/dfs/data/data2>
2012-08-13 07:39:31,400 [main] WARN  org.apache.hadoop.metrics2.impl.MetricsSystemImpl - NameNode
metrics system already initialized!
2012-08-13 07:39:31,400 [main] WARN  org.apache.hadoop.metrics2.impl.MetricsSystemImpl - Source
name ugi already exists!
2012-08-13 07:39:31,709 [main] WARN  org.apache.hadoop.metrics2.impl.MetricsSystemImpl - Source
name jvm already exists!
2012-08-13 07:39:40,730 [Master:0;janus.apache.org,34119,1344843572786] WARN  org.apache.hadoop.hbase.zookeeper.RecoverableZooKeeper
- Node /hbase/root-region-server already deleted, and this is not a retry
Tests run: 5, Failures: 0, Errors: 0, Skipped: 0, Time elapsed: 18.068 sec
2012-08-13 07:39:50,409 [RegionServer:0;janus.apache.org,56779,1344843572966] WARN  org.apache.hadoop.hbase.regionserver.HRegionServer
- Received close for region we are already opening or closing; 70236052
Running org.apache.james.system.hbase.TablePoolTest
2012-08-13 07:39:53,487 [main] WARN  org.apache.hadoop.metrics2.impl.MetricsSystemImpl - Source
name ugi already exists!
2012-08-13 07:39:53,513 [main] WARN  org.apache.hadoop.metrics2.impl.MetricsSystemImpl - Source
name ugi already exists!
Starting DataNode 0 with dfs.data.dir: <https://builds.apache.org/job/james-server-trunk/ws/trunk/data-hbase/target/test-data/3585d0b7-46bc-4a96-8673-b333f9b98dde/dfscluster_eb1374dc-153c-47f8-ab8e-fc33ce89b611/dfs/data/data1,/home/jenkins/jenkins-slave/workspace/james-server-trunk/trunk/data-hbase/target/test-data/3585d0b7-46bc-4a96-8673-b333f9b98dde/dfscluster_eb1374dc-153c-47f8-ab8e-fc33ce89b611/dfs/data/data2>
2012-08-13 07:39:54,210 [main] WARN  org.apache.hadoop.metrics2.impl.MetricsSystemImpl - NameNode
metrics system already initialized!
2012-08-13 07:39:54,210 [main] WARN  org.apache.hadoop.metrics2.impl.MetricsSystemImpl - Source
name ugi already exists!
2012-08-13 07:39:54,553 [main] WARN  org.apache.hadoop.metrics2.impl.MetricsSystemImpl - Source
name jvm already exists!
2012-08-13 07:40:04,298 [Master:0;janus.apache.org,56429,1344843595570] WARN  org.apache.hadoop.hbase.zookeeper.RecoverableZooKeeper
- Node /hbase/root-region-server already deleted, and this is not a retry
Tests run: 4, Failures: 0, Errors: 0, Skipped: 0, Time elapsed: 19.228 sec
2012-08-13 07:40:13,982 [RegionServer:0;janus.apache.org,39745,1344843595735] WARN  org.apache.hadoop.hbase.regionserver.HRegionServer
- Received close for region we are already opening or closing; 70236052
Running org.apache.james.user.hbase.HBaseUsersRepositoryTest
2012-08-13 07:40:16,678 [main] WARN  org.apache.hadoop.metrics2.impl.MetricsSystemImpl - Source
name ugi already exists!
2012-08-13 07:40:16,703 [main] WARN  org.apache.hadoop.metrics2.impl.MetricsSystemImpl - Source
name ugi already exists!
Starting DataNode 0 with dfs.data.dir: <https://builds.apache.org/job/james-server-trunk/ws/trunk/data-hbase/target/test-data/a30ff5f0-fdf4-4982-8c09-06ad075e2ece/dfscluster_be91478f-b98a-460d-9e2e-df94f8823f00/dfs/data/data1,/home/jenkins/jenkins-slave/workspace/james-server-trunk/trunk/data-hbase/target/test-data/a30ff5f0-fdf4-4982-8c09-06ad075e2ece/dfscluster_be91478f-b98a-460d-9e2e-df94f8823f00/dfs/data/data2>
2012-08-13 07:40:17,383 [main] WARN  org.apache.hadoop.metrics2.impl.MetricsSystemImpl - NameNode
metrics system already initialized!
2012-08-13 07:40:17,384 [main] WARN  org.apache.hadoop.metrics2.impl.MetricsSystemImpl - Source
name ugi already exists!
2012-08-13 07:40:17,690 [main] WARN  org.apache.hadoop.metrics2.impl.MetricsSystemImpl - Source
name jvm already exists!
2012-08-13 07:40:31,461 [Master:0;janus.apache.org,51040,1344843623537] WARN  org.apache.hadoop.hbase.zookeeper.RecoverableZooKeeper
- Node /hbase/root-region-server already deleted, and this is not a retry
Tests run: 7, Failures: 0, Errors: 0, Skipped: 0, Time elapsed: 25.385 sec
2012-08-13 07:40:41,146 [RegionServer:0;janus.apache.org,60879,1344843623714] WARN  org.apache.hadoop.hbase.regionserver.HRegionServer
- Received close for region we are already opening or closing; 70236052

Results :

Tests in error: 
  testStoreAndRetrieveRegexMapping(org.apache.james.rrt.hbase.HBaseRecipientRewriteTableTest)
  testStoreAndRetrieveAddressMapping(org.apache.james.rrt.hbase.HBaseRecipientRewriteTableTest):
Could not initialize class org.apache.james.rrt.hbase.HBaseRecipientRewriteTableTest
  testStoreAndRetrieveErrorMapping(org.apache.james.rrt.hbase.HBaseRecipientRewriteTableTest):
Could not initialize class org.apache.james.rrt.hbase.HBaseRecipientRewriteTableTest
  testStoreAndRetrieveWildCardAddressMapping(org.apache.james.rrt.hbase.HBaseRecipientRewriteTableTest):
Could not initialize class org.apache.james.rrt.hbase.HBaseRecipientRewriteTableTest
  testRecursiveMapping(org.apache.james.rrt.hbase.HBaseRecipientRewriteTableTest): Could not
initialize class org.apache.james.rrt.hbase.HBaseRecipientRewriteTableTest
  testAliasDomainMapping(org.apache.james.rrt.hbase.HBaseRecipientRewriteTableTest): Could
not initialize class org.apache.james.rrt.hbase.HBaseRecipientRewriteTableTest

Tests run: 22, Failures: 0, Errors: 6, Skipped: 0

mojoFailed org.apache.maven.plugins:maven-surefire-plugin:2.10(default-test)
[JENKINS] Recording test results
projectFailed org.apache.james:james-server-data-hbase:3.0-beta5-SNAPSHOT
sessionEnded
[INFO] ------------------------------------------------------------------------
[INFO] Reactor Summary:
[INFO] 
[INFO] Apache James Server ............................... SUCCESS [29.267s]
[INFO] Apache James Server Lifecycle API ................. SUCCESS [12.205s]
[INFO] Apache James Server Filesystem API ................ SUCCESS [13.978s]
[INFO] Apache James Server Data API ...................... SUCCESS [7.523s]
[INFO] Apache James Server Lifecycle Spring .............. SUCCESS [9.925s]
[INFO] Apache James Server Mailetcontainer API ........... SUCCESS [7.204s]
[INFO] Apache James Server Common Utilities .............. SUCCESS [19.209s]
[INFO] Apache James Server Protocols Library ............. SUCCESS [10.988s]
[INFO] Apache James Server Core .......................... SUCCESS [16.718s]
[INFO] Apache James Server Container Spring .............. SUCCESS [14.331s]
[INFO] Apache James Server DNS Server API ................ SUCCESS [8.957s]
[INFO] Apache James Server DNSService Implementation ..... SUCCESS [8.266s]
[INFO] Apache James Server DNSService Library ............ SUCCESS [10.720s]
[INFO] Apache James Server Queue API ..................... SUCCESS [7.379s]
[INFO] Apache James Server FetchMail ..................... SUCCESS [8.299s]
[INFO] Apache James Server Data Library .................. SUCCESS [7.994s]
[INFO] Apache James Server HBase Data Persistence ........ FAILURE [11:39.755s]
[INFO] Apache James Server JPA Data Persistence .......... SKIPPED
[INFO] Apache James Server JCR Data Persistence .......... SKIPPED
[INFO] Apache James Server JDBC Data Persistence ......... SKIPPED
[INFO] Apache James Server File Data Persistence ......... SKIPPED
[INFO] Apache James Server LDAP Data Implementation ...... SKIPPED
[INFO] Apache James Server Mailbox Adapter ............... SKIPPED
[INFO] Apache James Server Mailetcontainer Camel ......... SKIPPED
[INFO] Apache James Server Mailets ....................... SKIPPED
[INFO] Apache James Server IMAP .......................... SKIPPED
[INFO] Apache James Server SMTP .......................... SKIPPED
[INFO] Apache James Server LMTP .......................... SKIPPED
[INFO] Apache James Server POP3 .......................... SKIPPED
[INFO] Apache James Server File Mail Queue ............... SKIPPED
[INFO] Apache James Server JMS Mail Queue ................ SKIPPED
[INFO] Apache James Server ActiveMQ Queue ................ SKIPPED
[INFO] Apache James Server Client ........................ SKIPPED
[INFO] ------------------------------------------------------------------------
[INFO] BUILD FAILURE
[INFO] ------------------------------------------------------------------------
[INFO] Total time: 15:02.382s
[INFO] Finished at: Mon Aug 13 07:40:44 UTC 2012
[INFO] Final Memory: 67M/247M
[INFO] ------------------------------------------------------------------------
Projects to build: [MavenProject: org.apache.james:james-server:3.0-beta5-SNAPSHOT @ <https://builds.apache.org/job/james-server-trunk/ws/trunk/pom.xml,>
MavenProject: org.apache.james:james-server-lifecycle-api:3.0-beta5-SNAPSHOT @ <https://builds.apache.org/job/james-server-trunk/ws/trunk/lifecycle-api/pom.xml,>
MavenProject: org.apache.james:james-server-filesystem-api:3.0-beta5-SNAPSHOT @ <https://builds.apache.org/job/james-server-trunk/ws/trunk/filesystem-api/pom.xml,>
MavenProject: org.apache.james:james-server-data-api:3.0-beta5-SNAPSHOT @ <https://builds.apache.org/job/james-server-trunk/ws/trunk/data-api/pom.xml,>
MavenProject: org.apache.james:james-server-lifecycle-spring:3.0-beta5-SNAPSHOT @ <https://builds.apache.org/job/james-server-trunk/ws/trunk/lifecycle-spring/pom.xml,>
MavenProject: org.apache.james:james-server-mailetcontainer-api:3.0-beta5-SNAPSHOT @ <https://builds.apache.org/job/james-server-trunk/ws/trunk/mailetcontainer-api/pom.xml,>
MavenProject: org.apache.james:james-server-util:3.0-beta5-SNAPSHOT @ <https://builds.apache.org/job/james-server-trunk/ws/trunk/util/pom.xml,>
MavenProject: org.apache.james:james-server-protocols-library:3.0-beta5-SNAPSHOT @ <https://builds.apache.org/job/james-server-trunk/ws/trunk/protocols-library/pom.xml,>
MavenProject: org.apache.james:james-server-core:3.0-beta5-SNAPSHOT @ <https://builds.apache.org/job/james-server-trunk/ws/trunk/core/pom.xml,>
MavenProject: org.apache.james:james-server-container-spring:3.0-beta5-SNAPSHOT @ <https://builds.apache.org/job/james-server-trunk/ws/trunk/container-spring/pom.xml,>
MavenProject: org.apache.james:james-server-dnsservice-api:3.0-beta5-SNAPSHOT @ <https://builds.apache.org/job/james-server-trunk/ws/trunk/dnsservice-api/pom.xml,>
MavenProject: org.apache.james:james-server-dnsservice-dnsjava:3.0-beta5-SNAPSHOT @ <https://builds.apache.org/job/james-server-trunk/ws/trunk/dnsservice-dnsjava/pom.xml,>
MavenProject: org.apache.james:james-server-dnsservice-library:3.0-beta5-SNAPSHOT @ <https://builds.apache.org/job/james-server-trunk/ws/trunk/dnsservice-library/pom.xml,>
MavenProject: org.apache.james:james-server-queue-api:3.0-beta5-SNAPSHOT @ <https://builds.apache.org/job/james-server-trunk/ws/trunk/queue-api/pom.xml,>
MavenProject: org.apache.james:james-server-fetchmail:3.0-beta5-SNAPSHOT @ <https://builds.apache.org/job/james-server-trunk/ws/trunk/fetchmail/pom.xml,>
MavenProject: org.apache.james:james-server-data-library:3.0-beta5-SNAPSHOT @ <https://builds.apache.org/job/james-server-trunk/ws/trunk/data-library/pom.xml,>
MavenProject: org.apache.james:james-server-data-hbase:3.0-beta5-SNAPSHOT @ <https://builds.apache.org/job/james-server-trunk/ws/trunk/data-hbase/pom.xml,>
MavenProject: org.apache.james:james-server-data-jpa:3.0-beta5-SNAPSHOT @ <https://builds.apache.org/job/james-server-trunk/ws/trunk/data-jpa/pom.xml,>
MavenProject: org.apache.james:james-server-data-jcr:3.0-beta5-SNAPSHOT @ <https://builds.apache.org/job/james-server-trunk/ws/trunk/data-jcr/pom.xml,>
MavenProject: org.apache.james:james-server-data-jdbc:3.0-beta5-SNAPSHOT @ <https://builds.apache.org/job/james-server-trunk/ws/trunk/data-jdbc/pom.xml,>
MavenProject: org.apache.james:james-server-data-file:3.0-beta5-SNAPSHOT @ <https://builds.apache.org/job/james-server-trunk/ws/trunk/data-file/pom.xml,>
MavenProject: org.apache.james:james-server-data-ldap:3.0-beta5-SNAPSHOT @ <https://builds.apache.org/job/james-server-trunk/ws/trunk/data-ldap/pom.xml,>
MavenProject: org.apache.james:james-server-mailbox-adapter:3.0-beta5-SNAPSHOT @ <https://builds.apache.org/job/james-server-trunk/ws/trunk/mailbox-adapter/pom.xml,>
MavenProject: org.apache.james:james-server-mailetcontainer-camel:3.0-beta5-SNAPSHOT @ <https://builds.apache.org/job/james-server-trunk/ws/trunk/mailetcontainer-camel/pom.xml,>
MavenProject: org.apache.james:james-server-mailets:3.0-beta5-SNAPSHOT @ <https://builds.apache.org/job/james-server-trunk/ws/trunk/mailets/pom.xml,>
MavenProject: org.apache.james:james-server-protocols-imap4:3.0-beta5-SNAPSHOT @ <https://builds.apache.org/job/james-server-trunk/ws/trunk/protocols-imap4/pom.xml,>
MavenProject: org.apache.james:james-server-protocols-smtp:3.0-beta5-SNAPSHOT @ <https://builds.apache.org/job/james-server-trunk/ws/trunk/protocols-smtp/pom.xml,>
MavenProject: org.apache.james:james-server-protocols-lmtp:3.0-beta5-SNAPSHOT @ <https://builds.apache.org/job/james-server-trunk/ws/trunk/protocols-lmtp/pom.xml,>
MavenProject: org.apache.james:james-server-protocols-pop3:3.0-beta5-SNAPSHOT @ <https://builds.apache.org/job/james-server-trunk/ws/trunk/protocols-pop3/pom.xml,>
MavenProject: org.apache.james:james-server-queue-file:3.0-beta5-SNAPSHOT @ <https://builds.apache.org/job/james-server-trunk/ws/trunk/queue-file/pom.xml,>
MavenProject: org.apache.james:james-server-queue-jms:3.0-beta5-SNAPSHOT @ <https://builds.apache.org/job/james-server-trunk/ws/trunk/queue-jms/pom.xml,>
MavenProject: org.apache.james:james-server-queue-activemq:3.0-beta5-SNAPSHOT @ <https://builds.apache.org/job/james-server-trunk/ws/trunk/queue-activemq/pom.xml,>
MavenProject: org.apache.james:james-server-cli:3.0-beta5-SNAPSHOT @ <https://builds.apache.org/job/james-server-trunk/ws/trunk/cli/pom.xml]>
[JENKINS] Archiving <https://builds.apache.org/job/james-server-trunk/ws/trunk/data-file/pom.xml>
to /home/hudson/hudson/jobs/james-server-trunk/modules/org.apache.james$james-server-data-file/builds/2012-08-13_07-25-24/archive/org.apache.james/james-server-data-file/3.0-beta5-SNAPSHOT/james-server-data-file-3.0-beta5-SNAPSHOT.pom
[JENKINS] Archiving <https://builds.apache.org/job/james-server-trunk/ws/trunk/protocols-lmtp/pom.xml>
to /home/hudson/hudson/jobs/james-server-trunk/modules/org.apache.james$james-server-protocols-lmtp/builds/2012-08-13_07-25-24/archive/org.apache.james/james-server-protocols-lmtp/3.0-beta5-SNAPSHOT/james-server-protocols-lmtp-3.0-beta5-SNAPSHOT.pom
[JENKINS] Archiving <https://builds.apache.org/job/james-server-trunk/ws/trunk/data-jcr/pom.xml>
to /home/hudson/hudson/jobs/james-server-trunk/modules/org.apache.james$james-server-data-jcr/builds/2012-08-13_07-25-24/archive/org.apache.james/james-server-data-jcr/3.0-beta5-SNAPSHOT/james-server-data-jcr-3.0-beta5-SNAPSHOT.pom
[JENKINS] Archiving <https://builds.apache.org/job/james-server-trunk/ws/trunk/fetchmail/pom.xml>
to /home/hudson/hudson/jobs/james-server-trunk/modules/org.apache.james$james-server-fetchmail/builds/2012-08-13_07-25-23/archive/org.apache.james/james-server-fetchmail/3.0-beta5-SNAPSHOT/james-server-fetchmail-3.0-beta5-SNAPSHOT.pom
[JENKINS] Archiving <https://builds.apache.org/job/james-server-trunk/ws/trunk/fetchmail/target/james-server-fetchmail-3.0-beta5-SNAPSHOT.jar>
to /home/hudson/hudson/jobs/james-server-trunk/modules/org.apache.james$james-server-fetchmail/builds/2012-08-13_07-25-23/archive/org.apache.james/james-server-fetchmail/3.0-beta5-20120813.072851-425/james-server-fetchmail-3.0-beta5-20120813.072851-425.jar
[JENKINS] Archiving <https://builds.apache.org/job/james-server-trunk/ws/trunk/fetchmail/target/james-server-fetchmail-3.0-beta5-SNAPSHOT-tests.jar>
to /home/hudson/hudson/jobs/james-server-trunk/modules/org.apache.james$james-server-fetchmail/builds/2012-08-13_07-25-23/archive/org.apache.james/james-server-fetchmail/3.0-beta5-20120813.072851-425/james-server-fetchmail-3.0-beta5-20120813.072851-425-tests.jar
[JENKINS] Archiving <https://builds.apache.org/job/james-server-trunk/ws/trunk/data-jdbc/pom.xml>
to /home/hudson/hudson/jobs/james-server-trunk/modules/org.apache.james$james-server-data-jdbc/builds/2012-08-13_07-25-24/archive/org.apache.james/james-server-data-jdbc/3.0-beta5-SNAPSHOT/james-server-data-jdbc-3.0-beta5-SNAPSHOT.pom
[JENKINS] Archiving <https://builds.apache.org/job/james-server-trunk/ws/trunk/dnsservice-api/pom.xml>
to /home/hudson/hudson/jobs/james-server-trunk/modules/org.apache.james$james-server-dnsservice-api/builds/2012-08-13_07-25-23/archive/org.apache.james/james-server-dnsservice-api/3.0-beta5-SNAPSHOT/james-server-dnsservice-api-3.0-beta5-SNAPSHOT.pom
[JENKINS] Archiving <https://builds.apache.org/job/james-server-trunk/ws/trunk/dnsservice-api/target/james-server-dnsservice-api-3.0-beta5-SNAPSHOT.jar>
to /home/hudson/hudson/jobs/james-server-trunk/modules/org.apache.james$james-server-dnsservice-api/builds/2012-08-13_07-25-23/archive/org.apache.james/james-server-dnsservice-api/3.0-beta5-20120813.072815-425/james-server-dnsservice-api-3.0-beta5-20120813.072815-425.jar
[JENKINS] Archiving <https://builds.apache.org/job/james-server-trunk/ws/trunk/dnsservice-api/target/james-server-dnsservice-api-3.0-beta5-SNAPSHOT-tests.jar>
to /home/hudson/hudson/jobs/james-server-trunk/modules/org.apache.james$james-server-dnsservice-api/builds/2012-08-13_07-25-23/archive/org.apache.james/james-server-dnsservice-api/3.0-beta5-20120813.072815-425/james-server-dnsservice-api-3.0-beta5-20120813.072815-425-tests.jar
[JENKINS] Archiving <https://builds.apache.org/job/james-server-trunk/ws/trunk/pom.xml>
to /home/hudson/hudson/jobs/james-server-trunk/modules/org.apache.james$james-server/builds/2012-08-13_07-25-23/archive/org.apache.james/james-server/3.0-beta5-SNAPSHOT/james-server-3.0-beta5-SNAPSHOT.pom
[JENKINS] Archiving <https://builds.apache.org/job/james-server-trunk/ws/trunk/target/james-server-3.0-beta5-SNAPSHOT-site.xml>
to /home/hudson/hudson/jobs/james-server-trunk/modules/org.apache.james$james-server/builds/2012-08-13_07-25-23/archive/org.apache.james/james-server/3.0-beta5-20120813.072614-428/james-server-3.0-beta5-20120813.072614-428-site.xml
[JENKINS] Archiving <https://builds.apache.org/job/james-server-trunk/ws/trunk/data-api/pom.xml>
to /home/hudson/hudson/jobs/james-server-trunk/modules/org.apache.james$james-server-data-api/builds/2012-08-13_07-25-23/archive/org.apache.james/james-server-data-api/3.0-beta5-SNAPSHOT/james-server-data-api-3.0-beta5-SNAPSHOT.pom
[JENKINS] Archiving <https://builds.apache.org/job/james-server-trunk/ws/trunk/data-api/target/james-server-data-api-3.0-beta5-SNAPSHOT.jar>
to /home/hudson/hudson/jobs/james-server-trunk/modules/org.apache.james$james-server-data-api/builds/2012-08-13_07-25-23/archive/org.apache.james/james-server-data-api/3.0-beta5-20120813.072648-428/james-server-data-api-3.0-beta5-20120813.072648-428.jar
[JENKINS] Archiving <https://builds.apache.org/job/james-server-trunk/ws/trunk/data-api/target/james-server-data-api-3.0-beta5-SNAPSHOT-tests.jar>
to /home/hudson/hudson/jobs/james-server-trunk/modules/org.apache.james$james-server-data-api/builds/2012-08-13_07-25-23/archive/org.apache.james/james-server-data-api/3.0-beta5-20120813.072648-428/james-server-data-api-3.0-beta5-20120813.072648-428-tests.jar
[JENKINS] Archiving <https://builds.apache.org/job/james-server-trunk/ws/trunk/container-spring/pom.xml>
to /home/hudson/hudson/jobs/james-server-trunk/modules/org.apache.james$james-server-container-spring/builds/2012-08-13_07-25-23/archive/org.apache.james/james-server-container-spring/3.0-beta5-SNAPSHOT/james-server-container-spring-3.0-beta5-SNAPSHOT.pom
[JENKINS] Archiving <https://builds.apache.org/job/james-server-trunk/ws/trunk/container-spring/target/james-server-container-spring-3.0-beta5-SNAPSHOT.jar>
to /home/hudson/hudson/jobs/james-server-trunk/modules/org.apache.james$james-server-container-spring/builds/2012-08-13_07-25-23/archive/org.apache.james/james-server-container-spring/3.0-beta5-20120813.072808-425/james-server-container-spring-3.0-beta5-20120813.072808-425.jar
[JENKINS] Archiving <https://builds.apache.org/job/james-server-trunk/ws/trunk/container-spring/target/james-server-container-spring-3.0-beta5-SNAPSHOT-tests.jar>
to /home/hudson/hudson/jobs/james-server-trunk/modules/org.apache.james$james-server-container-spring/builds/2012-08-13_07-25-23/archive/org.apache.james/james-server-container-spring/3.0-beta5-20120813.072808-425/james-server-container-spring-3.0-beta5-20120813.072808-425-tests.jar
[JENKINS] Archiving <https://builds.apache.org/job/james-server-trunk/ws/trunk/protocols-library/pom.xml>
to /home/hudson/hudson/jobs/james-server-trunk/modules/org.apache.james$james-server-protocols-library/builds/2012-08-13_07-25-24/archive/org.apache.james/james-server-protocols-library/3.0-beta5-SNAPSHOT/james-server-protocols-library-3.0-beta5-SNAPSHOT.pom
[JENKINS] Archiving <https://builds.apache.org/job/james-server-trunk/ws/trunk/protocols-library/target/james-server-protocols-library-3.0-beta5-SNAPSHOT.jar>
to /home/hudson/hudson/jobs/james-server-trunk/modules/org.apache.james$james-server-protocols-library/builds/2012-08-13_07-25-24/archive/org.apache.james/james-server-protocols-library/3.0-beta5-20120813.072736-425/james-server-protocols-library-3.0-beta5-20120813.072736-425.jar
[JENKINS] Archiving <https://builds.apache.org/job/james-server-trunk/ws/trunk/protocols-library/target/james-server-protocols-library-3.0-beta5-SNAPSHOT-tests.jar>
to /home/hudson/hudson/jobs/james-server-trunk/modules/org.apache.james$james-server-protocols-library/builds/2012-08-13_07-25-24/archive/org.apache.james/james-server-protocols-library/3.0-beta5-20120813.072736-425/james-server-protocols-library-3.0-beta5-20120813.072736-425-tests.jar
[JENKINS] Archiving <https://builds.apache.org/job/james-server-trunk/ws/trunk/dnsservice-library/pom.xml>
to /home/hudson/hudson/jobs/james-server-trunk/modules/org.apache.james$james-server-dnsservice-library/builds/2012-08-13_07-25-23/archive/org.apache.james/james-server-dnsservice-library/3.0-beta5-SNAPSHOT/james-server-dnsservice-library-3.0-beta5-SNAPSHOT.pom
[JENKINS] Archiving <https://builds.apache.org/job/james-server-trunk/ws/trunk/dnsservice-library/target/james-server-dnsservice-library-3.0-beta5-SNAPSHOT.jar>
to /home/hudson/hudson/jobs/james-server-trunk/modules/org.apache.james$james-server-dnsservice-library/builds/2012-08-13_07-25-23/archive/org.apache.james/james-server-dnsservice-library/3.0-beta5-20120813.072836-425/james-server-dnsservice-library-3.0-beta5-20120813.072836-425.jar
[JENKINS] Archiving <https://builds.apache.org/job/james-server-trunk/ws/trunk/dnsservice-library/target/james-server-dnsservice-library-3.0-beta5-SNAPSHOT-tests.jar>
to /home/hudson/hudson/jobs/james-server-trunk/modules/org.apache.james$james-server-dnsservice-library/builds/2012-08-13_07-25-23/archive/org.apache.james/james-server-dnsservice-library/3.0-beta5-20120813.072836-425/james-server-dnsservice-library-3.0-beta5-20120813.072836-425-tests.jar
[JENKINS] Archiving <https://builds.apache.org/job/james-server-trunk/ws/trunk/util/pom.xml>
to /home/hudson/hudson/jobs/james-server-trunk/modules/org.apache.james$james-server-util/builds/2012-08-13_07-25-25/archive/org.apache.james/james-server-util/3.0-beta5-SNAPSHOT/james-server-util-3.0-beta5-SNAPSHOT.pom
[JENKINS] Archiving <https://builds.apache.org/job/james-server-trunk/ws/trunk/util/target/james-server-util-3.0-beta5-SNAPSHOT.jar>
to /home/hudson/hudson/jobs/james-server-trunk/modules/org.apache.james$james-server-util/builds/2012-08-13_07-25-25/archive/org.apache.james/james-server-util/3.0-beta5-20120813.072724-425/james-server-util-3.0-beta5-20120813.072724-425.jar
[JENKINS] Archiving <https://builds.apache.org/job/james-server-trunk/ws/trunk/util/target/james-server-util-3.0-beta5-SNAPSHOT-tests.jar>
to /home/hudson/hudson/jobs/james-server-trunk/modules/org.apache.james$james-server-util/builds/2012-08-13_07-25-25/archive/org.apache.james/james-server-util/3.0-beta5-20120813.072724-425/james-server-util-3.0-beta5-20120813.072724-425-tests.jar
[JENKINS] Archiving <https://builds.apache.org/job/james-server-trunk/ws/trunk/protocols-pop3/pom.xml>
to /home/hudson/hudson/jobs/james-server-trunk/modules/org.apache.james$james-server-protocols-pop3/builds/2012-08-13_07-25-24/archive/org.apache.james/james-server-protocols-pop3/3.0-beta5-SNAPSHOT/james-server-protocols-pop3-3.0-beta5-SNAPSHOT.pom
[JENKINS] Archiving <https://builds.apache.org/job/james-server-trunk/ws/trunk/mailets/pom.xml>
to /home/hudson/hudson/jobs/james-server-trunk/modules/org.apache.james$james-server-mailets/builds/2012-08-13_07-25-24/archive/org.apache.james/james-server-mailets/3.0-beta5-SNAPSHOT/james-server-mailets-3.0-beta5-SNAPSHOT.pom
[JENKINS] Archiving <https://builds.apache.org/job/james-server-trunk/ws/trunk/cli/pom.xml>
to /home/hudson/hudson/jobs/james-server-trunk/modules/org.apache.james$james-server-cli/builds/2012-08-13_07-25-25/archive/org.apache.james/james-server-cli/3.0-beta5-SNAPSHOT/james-server-cli-3.0-beta5-SNAPSHOT.pom
[JENKINS] Archiving <https://builds.apache.org/job/james-server-trunk/ws/trunk/queue-file/pom.xml>
to /home/hudson/hudson/jobs/james-server-trunk/modules/org.apache.james$james-server-queue-file/builds/2012-08-13_07-25-24/archive/org.apache.james/james-server-queue-file/3.0-beta5-SNAPSHOT/james-server-queue-file-3.0-beta5-SNAPSHOT.pom
[JENKINS] Archiving <https://builds.apache.org/job/james-server-trunk/ws/trunk/protocols-smtp/pom.xml>
to /home/hudson/hudson/jobs/james-server-trunk/modules/org.apache.james$james-server-protocols-smtp/builds/2012-08-13_07-25-24/archive/org.apache.james/james-server-protocols-smtp/3.0-beta5-SNAPSHOT/james-server-protocols-smtp-3.0-beta5-SNAPSHOT.pom
[JENKINS] Archiving <https://builds.apache.org/job/james-server-trunk/ws/trunk/lifecycle-api/pom.xml>
to /home/hudson/hudson/jobs/james-server-trunk/modules/org.apache.james$james-server-lifecycle-api/builds/2012-08-13_07-25-24/archive/org.apache.james/james-server-lifecycle-api/3.0-beta5-SNAPSHOT/james-server-lifecycle-api-3.0-beta5-SNAPSHOT.pom
[JENKINS] Archiving <https://builds.apache.org/job/james-server-trunk/ws/trunk/lifecycle-api/target/james-server-lifecycle-api-3.0-beta5-SNAPSHOT.jar>
to /home/hudson/hudson/jobs/james-server-trunk/modules/org.apache.james$james-server-lifecycle-api/builds/2012-08-13_07-25-24/archive/org.apache.james/james-server-lifecycle-api/3.0-beta5-20120813.072625-428/james-server-lifecycle-api-3.0-beta5-20120813.072625-428.jar
[JENKINS] Archiving <https://builds.apache.org/job/james-server-trunk/ws/trunk/lifecycle-api/target/james-server-lifecycle-api-3.0-beta5-SNAPSHOT-tests.jar>
to /home/hudson/hudson/jobs/james-server-trunk/modules/org.apache.james$james-server-lifecycle-api/builds/2012-08-13_07-25-24/archive/org.apache.james/james-server-lifecycle-api/3.0-beta5-20120813.072625-428/james-server-lifecycle-api-3.0-beta5-20120813.072625-428-tests.jar
[JENKINS] Archiving <https://builds.apache.org/job/james-server-trunk/ws/trunk/protocols-imap4/pom.xml>
to /home/hudson/hudson/jobs/james-server-trunk/modules/org.apache.james$james-server-protocols-imap4/builds/2012-08-13_07-25-24/archive/org.apache.james/james-server-protocols-imap4/3.0-beta5-SNAPSHOT/james-server-protocols-imap4-3.0-beta5-SNAPSHOT.pom
[JENKINS] Archiving <https://builds.apache.org/job/james-server-trunk/ws/trunk/filesystem-api/pom.xml>
to /home/hudson/hudson/jobs/james-server-trunk/modules/org.apache.james$james-server-filesystem-api/builds/2012-08-13_07-25-23/archive/org.apache.james/james-server-filesystem-api/3.0-beta5-SNAPSHOT/james-server-filesystem-api-3.0-beta5-SNAPSHOT.pom
[JENKINS] Archiving <https://builds.apache.org/job/james-server-trunk/ws/trunk/filesystem-api/target/james-server-filesystem-api-3.0-beta5-SNAPSHOT.jar>
to /home/hudson/hudson/jobs/james-server-trunk/modules/org.apache.james$james-server-filesystem-api/builds/2012-08-13_07-25-23/archive/org.apache.james/james-server-filesystem-api/3.0-beta5-20120813.072637-428/james-server-filesystem-api-3.0-beta5-20120813.072637-428.jar
[JENKINS] Archiving <https://builds.apache.org/job/james-server-trunk/ws/trunk/filesystem-api/target/james-server-filesystem-api-3.0-beta5-SNAPSHOT-tests.jar>
to /home/hudson/hudson/jobs/james-server-trunk/modules/org.apache.james$james-server-filesystem-api/builds/2012-08-13_07-25-23/archive/org.apache.james/james-server-filesystem-api/3.0-beta5-20120813.072637-428/james-server-filesystem-api-3.0-beta5-20120813.072637-428-tests.jar
[JENKINS] Archiving <https://builds.apache.org/job/james-server-trunk/ws/trunk/data-hbase/pom.xml>
to /home/hudson/hudson/jobs/james-server-trunk/modules/org.apache.james$james-server-data-hbase/builds/2012-08-13_07-25-23/archive/org.apache.james/james-server-data-hbase/3.0-beta5-SNAPSHOT/james-server-data-hbase-3.0-beta5-SNAPSHOT.pom
[JENKINS] Archiving <https://builds.apache.org/job/james-server-trunk/ws/trunk/data-ldap/pom.xml>
to /home/hudson/hudson/jobs/james-server-trunk/modules/org.apache.james$james-server-data-ldap/builds/2012-08-13_07-25-24/archive/org.apache.james/james-server-data-ldap/3.0-beta5-SNAPSHOT/james-server-data-ldap-3.0-beta5-SNAPSHOT.pom
[JENKINS] Archiving <https://builds.apache.org/job/james-server-trunk/ws/trunk/queue-api/pom.xml>
to /home/hudson/hudson/jobs/james-server-trunk/modules/org.apache.james$james-server-queue-api/builds/2012-08-13_07-25-24/archive/org.apache.james/james-server-queue-api/3.0-beta5-SNAPSHOT/james-server-queue-api-3.0-beta5-SNAPSHOT.pom
[JENKINS] Archiving <https://builds.apache.org/job/james-server-trunk/ws/trunk/queue-api/target/james-server-queue-api-3.0-beta5-SNAPSHOT.jar>
to /home/hudson/hudson/jobs/james-server-trunk/modules/org.apache.james$james-server-queue-api/builds/2012-08-13_07-25-24/archive/org.apache.james/james-server-queue-api/3.0-beta5-20120813.072845-425/james-server-queue-api-3.0-beta5-20120813.072845-425.jar
[JENKINS] Archiving <https://builds.apache.org/job/james-server-trunk/ws/trunk/queue-api/target/james-server-queue-api-3.0-beta5-SNAPSHOT-tests.jar>
to /home/hudson/hudson/jobs/james-server-trunk/modules/org.apache.james$james-server-queue-api/builds/2012-08-13_07-25-24/archive/org.apache.james/james-server-queue-api/3.0-beta5-20120813.072845-425/james-server-queue-api-3.0-beta5-20120813.072845-425-tests.jar
[JENKINS] Archiving <https://builds.apache.org/job/james-server-trunk/ws/trunk/mailetcontainer-camel/pom.xml>
to /home/hudson/hudson/jobs/james-server-trunk/modules/org.apache.james$james-server-mailetcontainer-camel/builds/2012-08-13_07-25-24/archive/org.apache.james/james-server-mailetcontainer-camel/3.0-beta5-SNAPSHOT/james-server-mailetcontainer-camel-3.0-beta5-SNAPSHOT.pom
[JENKINS] Archiving <https://builds.apache.org/job/james-server-trunk/ws/trunk/queue-activemq/pom.xml>
to /home/hudson/hudson/jobs/james-server-trunk/modules/org.apache.james$james-server-queue-activemq/builds/2012-08-13_07-25-25/archive/org.apache.james/james-server-queue-activemq/3.0-beta5-SNAPSHOT/james-server-queue-activemq-3.0-beta5-SNAPSHOT.pom
[JENKINS] Archiving <https://builds.apache.org/job/james-server-trunk/ws/trunk/mailetcontainer-api/pom.xml>
to /home/hudson/hudson/jobs/james-server-trunk/modules/org.apache.james$james-server-mailetcontainer-api/builds/2012-08-13_07-25-24/archive/org.apache.james/james-server-mailetcontainer-api/3.0-beta5-SNAPSHOT/james-server-mailetcontainer-api-3.0-beta5-SNAPSHOT.pom
[JENKINS] Archiving <https://builds.apache.org/job/james-server-trunk/ws/trunk/mailetcontainer-api/target/james-server-mailetcontainer-api-3.0-beta5-SNAPSHOT.jar>
to /home/hudson/hudson/jobs/james-server-trunk/modules/org.apache.james$james-server-mailetcontainer-api/builds/2012-08-13_07-25-24/archive/org.apache.james/james-server-mailetcontainer-api/3.0-beta5-20120813.072706-425/james-server-mailetcontainer-api-3.0-beta5-20120813.072706-425.jar
[JENKINS] Archiving <https://builds.apache.org/job/james-server-trunk/ws/trunk/mailetcontainer-api/target/james-server-mailetcontainer-api-3.0-beta5-SNAPSHOT-tests.jar>
to /home/hudson/hudson/jobs/james-server-trunk/modules/org.apache.james$james-server-mailetcontainer-api/builds/2012-08-13_07-25-24/archive/org.apache.james/james-server-mailetcontainer-api/3.0-beta5-20120813.072706-425/james-server-mailetcontainer-api-3.0-beta5-20120813.072706-425-tests.jar
[JENKINS] Archiving <https://builds.apache.org/job/james-server-trunk/ws/trunk/data-library/pom.xml>
to /home/hudson/hudson/jobs/james-server-trunk/modules/org.apache.james$james-server-data-library/builds/2012-08-13_07-25-23/archive/org.apache.james/james-server-data-library/3.0-beta5-SNAPSHOT/james-server-data-library-3.0-beta5-SNAPSHOT.pom
[JENKINS] Archiving <https://builds.apache.org/job/james-server-trunk/ws/trunk/data-library/target/james-server-data-library-3.0-beta5-SNAPSHOT.jar>
to /home/hudson/hudson/jobs/james-server-trunk/modules/org.apache.james$james-server-data-library/builds/2012-08-13_07-25-23/archive/org.apache.james/james-server-data-library/3.0-beta5-20120813.072902-425/james-server-data-library-3.0-beta5-20120813.072902-425.jar
[JENKINS] Archiving <https://builds.apache.org/job/james-server-trunk/ws/trunk/data-library/target/james-server-data-library-3.0-beta5-SNAPSHOT-tests.jar>
to /home/hudson/hudson/jobs/james-server-trunk/modules/org.apache.james$james-server-data-library/builds/2012-08-13_07-25-23/archive/org.apache.james/james-server-data-library/3.0-beta5-20120813.072902-425/james-server-data-library-3.0-beta5-20120813.072902-425-tests.jar
[JENKINS] Archiving <https://builds.apache.org/job/james-server-trunk/ws/trunk/dnsservice-dnsjava/pom.xml>
to /home/hudson/hudson/jobs/james-server-trunk/modules/org.apache.james$james-server-dnsservice-dnsjava/builds/2012-08-13_07-25-23/archive/org.apache.james/james-server-dnsservice-dnsjava/3.0-beta5-SNAPSHOT/james-server-dnsservice-dnsjava-3.0-beta5-SNAPSHOT.pom
[JENKINS] Archiving <https://builds.apache.org/job/james-server-trunk/ws/trunk/dnsservice-dnsjava/target/james-server-dnsservice-dnsjava-3.0-beta5-SNAPSHOT.jar>
to /home/hudson/hudson/jobs/james-server-trunk/modules/org.apache.james$james-server-dnsservice-dnsjava/builds/2012-08-13_07-25-23/archive/org.apache.james/james-server-dnsservice-dnsjava/3.0-beta5-20120813.072825-425/james-server-dnsservice-dnsjava-3.0-beta5-20120813.072825-425.jar
[JENKINS] Archiving <https://builds.apache.org/job/james-server-trunk/ws/trunk/dnsservice-dnsjava/target/james-server-dnsservice-dnsjava-3.0-beta5-SNAPSHOT-tests.jar>
to /home/hudson/hudson/jobs/james-server-trunk/modules/org.apache.james$james-server-dnsservice-dnsjava/builds/2012-08-13_07-25-23/archive/org.apache.james/james-server-dnsservice-dnsjava/3.0-beta5-20120813.072825-425/james-server-dnsservice-dnsjava-3.0-beta5-20120813.072825-425-tests.jar
[JENKINS] Archiving <https://builds.apache.org/job/james-server-trunk/ws/trunk/queue-jms/pom.xml>
to /home/hudson/hudson/jobs/james-server-trunk/modules/org.apache.james$james-server-queue-jms/builds/2012-08-13_07-25-24/archive/org.apache.james/james-server-queue-jms/3.0-beta5-SNAPSHOT/james-server-queue-jms-3.0-beta5-SNAPSHOT.pom
[JENKINS] Archiving <https://builds.apache.org/job/james-server-trunk/ws/trunk/core/pom.xml>
to /home/hudson/hudson/jobs/james-server-trunk/modules/org.apache.james$james-server-core/builds/2012-08-13_07-25-23/archive/org.apache.james/james-server-core/3.0-beta5-SNAPSHOT/james-server-core-3.0-beta5-SNAPSHOT.pom
[JENKINS] Archiving <https://builds.apache.org/job/james-server-trunk/ws/trunk/core/target/james-server-core-3.0-beta5-SNAPSHOT.jar>
to /home/hudson/hudson/jobs/james-server-trunk/modules/org.apache.james$james-server-core/builds/2012-08-13_07-25-23/archive/org.apache.james/james-server-core/3.0-beta5-20120813.072753-425/james-server-core-3.0-beta5-20120813.072753-425.jar
[JENKINS] Archiving <https://builds.apache.org/job/james-server-trunk/ws/trunk/core/target/james-server-core-3.0-beta5-SNAPSHOT-tests.jar>
to /home/hudson/hudson/jobs/james-server-trunk/modules/org.apache.james$james-server-core/builds/2012-08-13_07-25-23/archive/org.apache.james/james-server-core/3.0-beta5-20120813.072753-425/james-server-core-3.0-beta5-20120813.072753-425-tests.jar
[JENKINS] Archiving <https://builds.apache.org/job/james-server-trunk/ws/trunk/mailbox-adapter/pom.xml>
to /home/hudson/hudson/jobs/james-server-trunk/modules/org.apache.james$james-server-mailbox-adapter/builds/2012-08-13_07-25-24/archive/org.apache.james/james-server-mailbox-adapter/3.0-beta5-SNAPSHOT/james-server-mailbox-adapter-3.0-beta5-SNAPSHOT.pom
[JENKINS] Archiving <https://builds.apache.org/job/james-server-trunk/ws/trunk/lifecycle-spring/pom.xml>
to /home/hudson/hudson/jobs/james-server-trunk/modules/org.apache.james$james-server-lifecycle-spring/builds/2012-08-13_07-25-24/archive/org.apache.james/james-server-lifecycle-spring/3.0-beta5-SNAPSHOT/james-server-lifecycle-spring-3.0-beta5-SNAPSHOT.pom
[JENKINS] Archiving <https://builds.apache.org/job/james-server-trunk/ws/trunk/lifecycle-spring/target/james-server-lifecycle-spring-3.0-beta5-SNAPSHOT.jar>
to /home/hudson/hudson/jobs/james-server-trunk/modules/org.apache.james$james-server-lifecycle-spring/builds/2012-08-13_07-25-24/archive/org.apache.james/james-server-lifecycle-spring/3.0-beta5-20120813.072658-425/james-server-lifecycle-spring-3.0-beta5-20120813.072658-425.jar
[JENKINS] Archiving <https://builds.apache.org/job/james-server-trunk/ws/trunk/lifecycle-spring/target/james-server-lifecycle-spring-3.0-beta5-SNAPSHOT-tests.jar>
to /home/hudson/hudson/jobs/james-server-trunk/modules/org.apache.james$james-server-lifecycle-spring/builds/2012-08-13_07-25-24/archive/org.apache.james/james-server-lifecycle-spring/3.0-beta5-20120813.072658-425/james-server-lifecycle-spring-3.0-beta5-20120813.072658-425-tests.jar
[JENKINS] Archiving <https://builds.apache.org/job/james-server-trunk/ws/trunk/data-jpa/pom.xml>
to /home/hudson/hudson/jobs/james-server-trunk/modules/org.apache.james$james-server-data-jpa/builds/2012-08-13_07-25-24/archive/org.apache.james/james-server-data-jpa/3.0-beta5-SNAPSHOT/james-server-data-jpa-3.0-beta5-SNAPSHOT.pom
Waiting for Jenkins to finish collecting data
mavenExecutionResult exceptions not empty
message : Failed to execute goal org.apache.maven.plugins:maven-surefire-plugin:2.10:test
(default-test) on project james-server-data-hbase: There are test failures.

Please refer to <https://builds.apache.org/job/james-server-trunk/ws/trunk/data-hbase/target/surefire-reports>
for the individual test results.
cause : There are test failures.

Please refer to <https://builds.apache.org/job/james-server-trunk/ws/trunk/data-hbase/target/surefire-reports>
for the individual test results.
Stack trace : 
org.apache.maven.lifecycle.LifecycleExecutionException: Failed to execute goal org.apache.maven.plugins:maven-surefire-plugin:2.10:test
(default-test) on project james-server-data-hbase: There are test failures.

Please refer to <https://builds.apache.org/job/james-server-trunk/ws/trunk/data-hbase/target/surefire-reports>
for the individual test results.
	at org.apache.maven.lifecycle.internal.MojoExecutor.execute(MojoExecutor.java:213)
	at org.apache.maven.lifecycle.internal.MojoExecutor.execute(MojoExecutor.java:153)
	at org.apache.maven.lifecycle.internal.MojoExecutor.execute(MojoExecutor.java:145)
	at org.apache.maven.lifecycle.internal.LifecycleModuleBuilder.buildProject(LifecycleModuleBuilder.java:84)
	at org.apache.maven.lifecycle.internal.LifecycleModuleBuilder.buildProject(LifecycleModuleBuilder.java:59)
	at org.apache.maven.lifecycle.internal.LifecycleStarter.singleThreadedBuild(LifecycleStarter.java:183)
	at org.apache.maven.lifecycle.internal.LifecycleStarter.execute(LifecycleStarter.java:161)
	at org.apache.maven.DefaultMaven.doExecute(DefaultMaven.java:319)
	at org.apache.maven.DefaultMaven.execute(DefaultMaven.java:156)
	at org.jvnet.hudson.maven3.launcher.Maven3Launcher.main(Maven3Launcher.java:79)
	at sun.reflect.NativeMethodAccessorImpl.invoke0(Native Method)
	at sun.reflect.NativeMethodAccessorImpl.invoke(NativeMethodAccessorImpl.java:39)
	at sun.reflect.DelegatingMethodAccessorImpl.invoke(DelegatingMethodAccessorImpl.java:25)
	at java.lang.reflect.Method.invoke(Method.java:597)
	at org.codehaus.plexus.classworlds.launcher.Launcher.launchStandard(Launcher.java:329)
	at org.codehaus.plexus.classworlds.launcher.Launcher.launch(Launcher.java:239)
	at org.jvnet.hudson.maven3.agent.Maven3Main.launch(Maven3Main.java:158)
	at hudson.maven.Maven3Builder.call(Maven3Builder.java:98)
	at hudson.maven.Maven3Builder.call(Maven3Builder.java:64)
	at hudson.remoting.UserRequest.perform(UserRequest.java:118)
	at hudson.remoting.UserRequest.perform(UserRequest.java:48)
	at hudson.remoting.Request$2.run(Request.java:326)
	at hudson.remoting.InterceptingExecutorService$1.call(InterceptingExecutorService.java:72)
	at java.util.concurrent.FutureTask$Sync.innerRun(FutureTask.java:303)
	at java.util.concurrent.FutureTask.run(FutureTask.java:138)
	at java.util.concurrent.ThreadPoolExecutor$Worker.runTask(ThreadPoolExecutor.java:886)
	at java.util.concurrent.ThreadPoolExecutor$Worker.run(ThreadPoolExecutor.java:908)
	at java.lang.Thread.run(Thread.java:662)
Caused by: org.apache.maven.plugin.MojoFailureException: There are test failures.

Please refer to <https://builds.apache.org/job/james-server-trunk/ws/trunk/data-hbase/target/surefire-reports>
for the individual test results.
	at org.apache.maven.plugin.surefire.SurefireHelper.reportExecution(SurefireHelper.java:87)
	at org.apache.maven.plugin.surefire.SurefirePlugin.writeSummary(SurefirePlugin.java:641)
	at org.apache.maven.plugin.surefire.SurefirePlugin.handleSummary(SurefirePlugin.java:615)
	at org.apache.maven.plugin.surefire.AbstractSurefireMojo.executeAfterPreconditionsChecked(AbstractSurefireMojo.java:137)
	at org.apache.maven.plugin.surefire.AbstractSurefireMojo.execute(AbstractSurefireMojo.java:98)
	at org.apache.maven.plugin.DefaultBuildPluginManager.executeMojo(DefaultBuildPluginManager.java:101)
	at org.apache.maven.lifecycle.internal.MojoExecutor.execute(MojoExecutor.java:209)
	... 27 more
channel stopped

---------------------------------------------------------------------
To unsubscribe, e-mail: server-dev-unsubscribe@james.apache.org
For additional commands, e-mail: server-dev-help@james.apache.org


Mime
View raw message