james-server-dev mailing list archives

Site index · List index
Message view « Date » · « Thread »
Top « Date » · « Thread »
From Apache Jenkins Server <jenk...@builds.apache.org>
Subject Build failed in Jenkins: james-app-trunk #1122
Date Tue, 14 Aug 2012 19:23:40 GMT
See <https://builds.apache.org/job/james-app-trunk/1122/changes>

Changes:

[eric] Fix remote delivery delay in template configuration (JAMES-1429)

------------------------------------------
[...truncated 807 lines...]
[INFO] Installing /home/jenkins/jenkins-slave/maven-repositories/1/aopalliance/aopalliance/1.0/aopalliance-1.0.jar
to <https://builds.apache.org/job/james-app-trunk/ws/trunk/target/appassembler/lib/aopalliance-1.0.jar>
[INFO] Installing /home/jenkins/jenkins-slave/maven-repositories/1/org/springframework/spring-orm/3.1.0.RELEASE/spring-orm-3.1.0.RELEASE.jar
to <https://builds.apache.org/job/james-app-trunk/ws/trunk/target/appassembler/lib/spring-orm-3.1.0.RELEASE.jar>
[INFO] Installing /home/jenkins/jenkins-slave/maven-repositories/1/org/springframework/spring-tx/3.1.0.RELEASE/spring-tx-3.1.0.RELEASE.jar
to <https://builds.apache.org/job/james-app-trunk/ws/trunk/target/appassembler/lib/spring-tx-3.1.0.RELEASE.jar>
[INFO] Installing /home/jenkins/jenkins-slave/maven-repositories/1/org/springframework/spring-jdbc/3.1.0.RELEASE/spring-jdbc-3.1.0.RELEASE.jar
to <https://builds.apache.org/job/james-app-trunk/ws/trunk/target/appassembler/lib/spring-jdbc-3.1.0.RELEASE.jar>
[INFO] Installing /home/jenkins/jenkins-slave/maven-repositories/1/org/apache/james/james-server-mailetcontainer-camel/3.0-beta5-SNAPSHOT/james-server-mailetcontainer-camel-3.0-beta5-SNAPSHOT.jar
to <https://builds.apache.org/job/james-app-trunk/ws/trunk/target/appassembler/lib/james-server-mailetcontainer-camel-3.0-beta5-SNAPSHOT.jar>
[INFO] Installing /home/jenkins/jenkins-slave/maven-repositories/1/org/apache/james/james-server-mailbox-adapter/3.0-beta5-SNAPSHOT/james-server-mailbox-adapter-3.0-beta5-SNAPSHOT.jar
to <https://builds.apache.org/job/james-app-trunk/ws/trunk/target/appassembler/lib/james-server-mailbox-adapter-3.0-beta5-SNAPSHOT.jar>
[INFO] Installing /home/jenkins/jenkins-slave/maven-repositories/1/org/apache/james/apache-james-mailbox-store/0.5-SNAPSHOT/apache-james-mailbox-store-0.5-SNAPSHOT.jar
to <https://builds.apache.org/job/james-app-trunk/ws/trunk/target/appassembler/lib/apache-james-mailbox-store-0.5-SNAPSHOT.jar>
[INFO] Installing /home/jenkins/jenkins-slave/maven-repositories/1/org/apache/james/apache-james-mailbox-maildir/0.5-SNAPSHOT/apache-james-mailbox-maildir-0.5-SNAPSHOT.jar
to <https://builds.apache.org/job/james-app-trunk/ws/trunk/target/appassembler/lib/apache-james-mailbox-maildir-0.5-SNAPSHOT.jar>
[INFO] Installing /home/jenkins/jenkins-slave/maven-repositories/1/org/apache/james/james-server-dnsservice-api/3.0-beta5-SNAPSHOT/james-server-dnsservice-api-3.0-beta5-SNAPSHOT.jar
to <https://builds.apache.org/job/james-app-trunk/ws/trunk/target/appassembler/lib/james-server-dnsservice-api-3.0-beta5-SNAPSHOT.jar>
[INFO] Installing /home/jenkins/jenkins-slave/maven-repositories/1/org/apache/james/james-server-dnsservice-dnsjava/3.0-beta5-SNAPSHOT/james-server-dnsservice-dnsjava-3.0-beta5-SNAPSHOT.jar
to <https://builds.apache.org/job/james-app-trunk/ws/trunk/target/appassembler/lib/james-server-dnsservice-dnsjava-3.0-beta5-SNAPSHOT.jar>
[INFO] Installing /home/jenkins/jenkins-slave/maven-repositories/1/dnsjava/dnsjava/2.1.1/dnsjava-2.1.1.jar
to <https://builds.apache.org/job/james-app-trunk/ws/trunk/target/appassembler/lib/dnsjava-2.1.1.jar>
[INFO] Installing /home/jenkins/jenkins-slave/maven-repositories/1/org/apache/james/james-server-protocols-library/3.0-beta5-SNAPSHOT/james-server-protocols-library-3.0-beta5-SNAPSHOT.jar
to <https://builds.apache.org/job/james-app-trunk/ws/trunk/target/appassembler/lib/james-server-protocols-library-3.0-beta5-SNAPSHOT.jar>
[INFO] Installing /home/jenkins/jenkins-slave/maven-repositories/1/org/apache/james/protocols/protocols-netty/1.6.3-SNAPSHOT/protocols-netty-1.6.3-SNAPSHOT.jar
to <https://builds.apache.org/job/james-app-trunk/ws/trunk/target/appassembler/lib/protocols-netty-1.6.3-SNAPSHOT.jar>
[INFO] Installing /home/jenkins/jenkins-slave/maven-repositories/1/io/netty/netty/3.3.1.Final/netty-3.3.1.Final.jar
to <https://builds.apache.org/job/james-app-trunk/ws/trunk/target/appassembler/lib/netty-3.3.1.Final.jar>
[INFO] Installing /home/jenkins/jenkins-slave/maven-repositories/1/org/apache/james/james-server-util/3.0-beta5-SNAPSHOT/james-server-util-3.0-beta5-SNAPSHOT.jar
to <https://builds.apache.org/job/james-app-trunk/ws/trunk/target/appassembler/lib/james-server-util-3.0-beta5-SNAPSHOT.jar>
[INFO] Installing /home/jenkins/jenkins-slave/maven-repositories/1/org/apache/james/james-server-data-library/3.0-beta5-SNAPSHOT/james-server-data-library-3.0-beta5-SNAPSHOT.jar
to <https://builds.apache.org/job/james-app-trunk/ws/trunk/target/appassembler/lib/james-server-data-library-3.0-beta5-SNAPSHOT.jar>
[INFO] Installing /home/jenkins/jenkins-slave/maven-repositories/1/org/apache/james/james-server-data-ldap/3.0-beta5-SNAPSHOT/james-server-data-ldap-3.0-beta5-SNAPSHOT.jar
to <https://builds.apache.org/job/james-app-trunk/ws/trunk/target/appassembler/lib/james-server-data-ldap-3.0-beta5-SNAPSHOT.jar>
[INFO] Installing /home/jenkins/jenkins-slave/maven-repositories/1/org/apache/james/james-server-protocols-smtp/3.0-beta5-SNAPSHOT/james-server-protocols-smtp-3.0-beta5-SNAPSHOT.jar
to <https://builds.apache.org/job/james-app-trunk/ws/trunk/target/appassembler/lib/james-server-protocols-smtp-3.0-beta5-SNAPSHOT.jar>
[INFO] Installing /home/jenkins/jenkins-slave/maven-repositories/1/org/apache/james/protocols/protocols-smtp/1.6.3-SNAPSHOT/protocols-smtp-1.6.3-SNAPSHOT.jar
to <https://builds.apache.org/job/james-app-trunk/ws/trunk/target/appassembler/lib/protocols-smtp-1.6.3-SNAPSHOT.jar>
[INFO] Installing /home/jenkins/jenkins-slave/maven-repositories/1/org/apache/james/jspf/apache-jspf-resolver/1.0.0/apache-jspf-resolver-1.0.0.jar
to <https://builds.apache.org/job/james-app-trunk/ws/trunk/target/appassembler/lib/apache-jspf-resolver-1.0.0.jar>
[INFO] Installing /home/jenkins/jenkins-slave/maven-repositories/1/org/apache/james/james-server-protocols-imap4/3.0-beta5-SNAPSHOT/james-server-protocols-imap4-3.0-beta5-SNAPSHOT.jar
to <https://builds.apache.org/job/james-app-trunk/ws/trunk/target/appassembler/lib/james-server-protocols-imap4-3.0-beta5-SNAPSHOT.jar>
[INFO] Installing /home/jenkins/jenkins-slave/maven-repositories/1/org/apache/james/james-server-protocols-lmtp/3.0-beta5-SNAPSHOT/james-server-protocols-lmtp-3.0-beta5-SNAPSHOT.jar
to <https://builds.apache.org/job/james-app-trunk/ws/trunk/target/appassembler/lib/james-server-protocols-lmtp-3.0-beta5-SNAPSHOT.jar>
[INFO] Installing /home/jenkins/jenkins-slave/maven-repositories/1/org/apache/james/protocols/protocols-lmtp/1.6.3-SNAPSHOT/protocols-lmtp-1.6.3-SNAPSHOT.jar
to <https://builds.apache.org/job/james-app-trunk/ws/trunk/target/appassembler/lib/protocols-lmtp-1.6.3-SNAPSHOT.jar>
[INFO] Installing /home/jenkins/jenkins-slave/maven-repositories/1/org/apache/james/james-server-protocols-pop3/3.0-beta5-SNAPSHOT/james-server-protocols-pop3-3.0-beta5-SNAPSHOT.jar
to <https://builds.apache.org/job/james-app-trunk/ws/trunk/target/appassembler/lib/james-server-protocols-pop3-3.0-beta5-SNAPSHOT.jar>
[INFO] Installing /home/jenkins/jenkins-slave/maven-repositories/1/org/apache/james/protocols/protocols-pop3/1.6.3-SNAPSHOT/protocols-pop3-1.6.3-SNAPSHOT.jar
to <https://builds.apache.org/job/james-app-trunk/ws/trunk/target/appassembler/lib/protocols-pop3-1.6.3-SNAPSHOT.jar>
[INFO] Installing /home/jenkins/jenkins-slave/maven-repositories/1/org/apache/james/james-server-fetchmail/3.0-beta5-SNAPSHOT/james-server-fetchmail-3.0-beta5-SNAPSHOT.jar
to <https://builds.apache.org/job/james-app-trunk/ws/trunk/target/appassembler/lib/james-server-fetchmail-3.0-beta5-SNAPSHOT.jar>
[INFO] Installing /home/jenkins/jenkins-slave/maven-repositories/1/org/apache/james/james-server-queue-file/3.0-beta5-SNAPSHOT/james-server-queue-file-3.0-beta5-SNAPSHOT.jar
to <https://builds.apache.org/job/james-app-trunk/ws/trunk/target/appassembler/lib/james-server-queue-file-3.0-beta5-SNAPSHOT.jar>
[INFO] Installing /home/jenkins/jenkins-slave/maven-repositories/1/org/apache/james/james-server-queue-jms/3.0-beta5-SNAPSHOT/james-server-queue-jms-3.0-beta5-SNAPSHOT.jar
to <https://builds.apache.org/job/james-app-trunk/ws/trunk/target/appassembler/lib/james-server-queue-jms-3.0-beta5-SNAPSHOT.jar>
[INFO] Installing /home/jenkins/jenkins-slave/maven-repositories/1/org/apache/geronimo/specs/geronimo-jms_1.1_spec/1.0/geronimo-jms_1.1_spec-1.0.jar
to <https://builds.apache.org/job/james-app-trunk/ws/trunk/target/appassembler/lib/geronimo-jms_1.1_spec-1.0.jar>
[INFO] Installing /home/jenkins/jenkins-slave/maven-repositories/1/org/apache/james/james-server-queue-activemq/3.0-beta5-SNAPSHOT/james-server-queue-activemq-3.0-beta5-SNAPSHOT.jar
to <https://builds.apache.org/job/james-app-trunk/ws/trunk/target/appassembler/lib/james-server-queue-activemq-3.0-beta5-SNAPSHOT.jar>
[INFO] Installing /home/jenkins/jenkins-slave/maven-repositories/1/org/apache/activemq/activemq-core/5.4.2/activemq-core-5.4.2.jar
to <https://builds.apache.org/job/james-app-trunk/ws/trunk/target/appassembler/lib/activemq-core-5.4.2.jar>
[INFO] Installing /home/jenkins/jenkins-slave/maven-repositories/1/org/apache/activemq/activeio-core/3.1.2/activeio-core-3.1.2.jar
to <https://builds.apache.org/job/james-app-trunk/ws/trunk/target/appassembler/lib/activeio-core-3.1.2.jar>
[INFO] Installing /home/jenkins/jenkins-slave/maven-repositories/1/org/apache/activemq/kahadb/5.4.2/kahadb-5.4.2.jar
to <https://builds.apache.org/job/james-app-trunk/ws/trunk/target/appassembler/lib/kahadb-5.4.2.jar>
[INFO] Installing /home/jenkins/jenkins-slave/maven-repositories/1/org/apache/activemq/protobuf/activemq-protobuf/1.1/activemq-protobuf-1.1.jar
to <https://builds.apache.org/job/james-app-trunk/ws/trunk/target/appassembler/lib/activemq-protobuf-1.1.jar>
[INFO] Installing /home/jenkins/jenkins-slave/maven-repositories/1/org/apache/geronimo/specs/geronimo-j2ee-management_1.1_spec/1.0.1/geronimo-j2ee-management_1.1_spec-1.0.1.jar
to <https://builds.apache.org/job/james-app-trunk/ws/trunk/target/appassembler/lib/geronimo-j2ee-management_1.1_spec-1.0.1.jar>
[INFO] Installing /home/jenkins/jenkins-slave/maven-repositories/1/org/apache/james/james-server-mailets/3.0-beta5-SNAPSHOT/james-server-mailets-3.0-beta5-SNAPSHOT.jar
to <https://builds.apache.org/job/james-app-trunk/ws/trunk/target/appassembler/lib/james-server-mailets-3.0-beta5-SNAPSHOT.jar>
[INFO] Installing /home/jenkins/jenkins-slave/maven-repositories/1/org/apache/james/apache-jsieve-mailet/0.6-SNAPSHOT/apache-jsieve-mailet-0.6-SNAPSHOT.jar
to <https://builds.apache.org/job/james-app-trunk/ws/trunk/target/appassembler/lib/apache-jsieve-mailet-0.6-SNAPSHOT.jar>
[INFO] Installing /home/jenkins/jenkins-slave/maven-repositories/1/org/apache/james/apache-jsieve-core/0.6-SNAPSHOT/apache-jsieve-core-0.6-SNAPSHOT.jar
to <https://builds.apache.org/job/james-app-trunk/ws/trunk/target/appassembler/lib/apache-jsieve-core-0.6-SNAPSHOT.jar>
[INFO] Installing /home/jenkins/jenkins-slave/maven-repositories/1/org/apache/geronimo/specs/geronimo-activation_1.1_spec/1.0.2/geronimo-activation_1.1_spec-1.0.2.jar
to <https://builds.apache.org/job/james-app-trunk/ws/trunk/target/appassembler/lib/geronimo-activation_1.1_spec-1.0.2.jar>
[INFO] Installing /home/jenkins/jenkins-slave/maven-repositories/1/org/apache/james/apache-standard-mailets/1.2-SNAPSHOT/apache-standard-mailets-1.2-SNAPSHOT.jar
to <https://builds.apache.org/job/james-app-trunk/ws/trunk/target/appassembler/lib/apache-standard-mailets-1.2-SNAPSHOT.jar>
[INFO] Installing /home/jenkins/jenkins-slave/maven-repositories/1/commons-httpclient/commons-httpclient/3.1/commons-httpclient-3.1.jar
to <https://builds.apache.org/job/james-app-trunk/ws/trunk/target/appassembler/lib/commons-httpclient-3.1.jar>
[INFO] Installing /home/jenkins/jenkins-slave/maven-repositories/1/commons-collections/commons-collections/3.2.1/commons-collections-3.2.1.jar
to <https://builds.apache.org/job/james-app-trunk/ws/trunk/target/appassembler/lib/commons-collections-3.2.1.jar>
[INFO] Installing /home/jenkins/jenkins-slave/maven-repositories/1/org/apache/derby/derby/10.7.1.1/derby-10.7.1.1.jar
to <https://builds.apache.org/job/james-app-trunk/ws/trunk/target/appassembler/lib/derby-10.7.1.1.jar>
[INFO] Installing /home/jenkins/jenkins-slave/maven-repositories/1/org/apache/james/apache-james-mailbox-jpa/0.5-SNAPSHOT/apache-james-mailbox-jpa-0.5-SNAPSHOT.jar
to <https://builds.apache.org/job/james-app-trunk/ws/trunk/target/appassembler/lib/apache-james-mailbox-jpa-0.5-SNAPSHOT.jar>
[INFO] Installing /home/jenkins/jenkins-slave/maven-repositories/1/org/apache/openjpa/openjpa/2.2.0/openjpa-2.2.0.jar
to <https://builds.apache.org/job/james-app-trunk/ws/trunk/target/appassembler/lib/openjpa-2.2.0.jar>
[INFO] Installing /home/jenkins/jenkins-slave/maven-repositories/1/net/sourceforge/serp/serp/1.13.1/serp-1.13.1.jar
to <https://builds.apache.org/job/james-app-trunk/ws/trunk/target/appassembler/lib/serp-1.13.1.jar>
[INFO] Installing /home/jenkins/jenkins-slave/maven-repositories/1/org/apache/geronimo/specs/geronimo-jta_1.1_spec/1.1.1/geronimo-jta_1.1_spec-1.1.1.jar
to <https://builds.apache.org/job/james-app-trunk/ws/trunk/target/appassembler/lib/geronimo-jta_1.1_spec-1.1.1.jar>
[INFO] Installing /home/jenkins/jenkins-slave/maven-repositories/1/commons-pool/commons-pool/1.5.5/commons-pool-1.5.5.jar
to <https://builds.apache.org/job/james-app-trunk/ws/trunk/target/appassembler/lib/commons-pool-1.5.5.jar>
[INFO] Installing /home/jenkins/jenkins-slave/maven-repositories/1/asm/asm/3.2/asm-3.2.jar
to <https://builds.apache.org/job/james-app-trunk/ws/trunk/target/appassembler/lib/asm-3.2.jar>
[INFO] Installing /home/jenkins/jenkins-slave/maven-repositories/1/org/jasypt/jasypt/1.7.1/jasypt-1.7.1.jar
to <https://builds.apache.org/job/james-app-trunk/ws/trunk/target/appassembler/lib/jasypt-1.7.1.jar>
[INFO] Installing /home/jenkins/jenkins-slave/maven-repositories/1/org/apache/james/apache-james-mailbox-spring/0.5-SNAPSHOT/apache-james-mailbox-spring-0.5-SNAPSHOT.jar
to <https://builds.apache.org/job/james-app-trunk/ws/trunk/target/appassembler/lib/apache-james-mailbox-spring-0.5-SNAPSHOT.jar>
[INFO] Installing /home/jenkins/jenkins-slave/maven-repositories/1/org/apache/james/apache-james-mailbox-hbase/0.5-SNAPSHOT/apache-james-mailbox-hbase-0.5-SNAPSHOT.jar
to <https://builds.apache.org/job/james-app-trunk/ws/trunk/target/appassembler/lib/apache-james-mailbox-hbase-0.5-SNAPSHOT.jar>
[INFO] Installing /home/jenkins/jenkins-slave/maven-repositories/1/commons-dbcp/commons-dbcp/1.4/commons-dbcp-1.4.jar
to <https://builds.apache.org/job/james-app-trunk/ws/trunk/target/appassembler/lib/commons-dbcp-1.4.jar>
[INFO] Installing /home/jenkins/jenkins-slave/maven-repositories/1/javax/jcr/jcr/2.0/jcr-2.0.jar
to <https://builds.apache.org/job/james-app-trunk/ws/trunk/target/appassembler/lib/jcr-2.0.jar>
[INFO] Installing /home/jenkins/jenkins-slave/maven-repositories/1/org/apache/james/apache-james-mailbox-lucene/0.5-SNAPSHOT/apache-james-mailbox-lucene-0.5-SNAPSHOT.jar
to <https://builds.apache.org/job/james-app-trunk/ws/trunk/target/appassembler/lib/apache-james-mailbox-lucene-0.5-SNAPSHOT.jar>
[INFO] Installing /home/jenkins/jenkins-slave/maven-repositories/1/org/apache/james/apache-mime4j-core/0.7.2/apache-mime4j-core-0.7.2.jar
to <https://builds.apache.org/job/james-app-trunk/ws/trunk/target/appassembler/lib/apache-mime4j-core-0.7.2.jar>
[INFO] Installing /home/jenkins/jenkins-slave/maven-repositories/1/org/apache/james/apache-mime4j-dom/0.7.2/apache-mime4j-dom-0.7.2.jar
to <https://builds.apache.org/job/james-app-trunk/ws/trunk/target/appassembler/lib/apache-mime4j-dom-0.7.2.jar>
[INFO] Installing /home/jenkins/jenkins-slave/maven-repositories/1/org/apache/lucene/lucene-core/3.1.0/lucene-core-3.1.0.jar
to <https://builds.apache.org/job/james-app-trunk/ws/trunk/target/appassembler/lib/lucene-core-3.1.0.jar>
[INFO] Installing /home/jenkins/jenkins-slave/maven-repositories/1/org/apache/lucene/lucene-analyzers/3.1.0/lucene-analyzers-3.1.0.jar
to <https://builds.apache.org/job/james-app-trunk/ws/trunk/target/appassembler/lib/lucene-analyzers-3.1.0.jar>
[INFO] Installing /home/jenkins/jenkins-slave/maven-repositories/1/org/apache/lucene/lucene-smartcn/3.1.0/lucene-smartcn-3.1.0.jar
to <https://builds.apache.org/job/james-app-trunk/ws/trunk/target/appassembler/lib/lucene-smartcn-3.1.0.jar>
[INFO] Installing /home/jenkins/jenkins-slave/maven-repositories/1/org/apache/james/apache-james-mailbox-jcr/0.5-SNAPSHOT/apache-james-mailbox-jcr-0.5-SNAPSHOT.jar
to <https://builds.apache.org/job/james-app-trunk/ws/trunk/target/appassembler/lib/apache-james-mailbox-jcr-0.5-SNAPSHOT.jar>
[INFO] Installing /home/jenkins/jenkins-slave/maven-repositories/1/org/apache/jackrabbit/jackrabbit-jcr-commons/2.2.5/jackrabbit-jcr-commons-2.2.5.jar
to <https://builds.apache.org/job/james-app-trunk/ws/trunk/target/appassembler/lib/jackrabbit-jcr-commons-2.2.5.jar>
[INFO] Installing /home/jenkins/jenkins-slave/maven-repositories/1/org/apache/james/apache-james-mailbox-memory/0.5-SNAPSHOT/apache-james-mailbox-memory-0.5-SNAPSHOT.jar
to <https://builds.apache.org/job/james-app-trunk/ws/trunk/target/appassembler/lib/apache-james-mailbox-memory-0.5-SNAPSHOT.jar>
[INFO] Installing /home/jenkins/jenkins-slave/maven-repositories/1/org/apache/james/james-server-data-file/3.0-beta5-SNAPSHOT/james-server-data-file-3.0-beta5-SNAPSHOT.jar
to <https://builds.apache.org/job/james-app-trunk/ws/trunk/target/appassembler/lib/james-server-data-file-3.0-beta5-SNAPSHOT.jar>
[INFO] Installing /home/jenkins/jenkins-slave/maven-repositories/1/org/apache/james/james-server-data-jpa/3.0-beta5-SNAPSHOT/james-server-data-jpa-3.0-beta5-SNAPSHOT.jar
to <https://builds.apache.org/job/james-app-trunk/ws/trunk/target/appassembler/lib/james-server-data-jpa-3.0-beta5-SNAPSHOT.jar>
[INFO] Installing /home/jenkins/jenkins-slave/maven-repositories/1/commons-codec/commons-codec/1.5/commons-codec-1.5.jar
to <https://builds.apache.org/job/james-app-trunk/ws/trunk/target/appassembler/lib/commons-codec-1.5.jar>
[INFO] Installing /home/jenkins/jenkins-slave/maven-repositories/1/org/apache/james/james-server-data-jdbc/3.0-beta5-SNAPSHOT/james-server-data-jdbc-3.0-beta5-SNAPSHOT.jar
to <https://builds.apache.org/job/james-app-trunk/ws/trunk/target/appassembler/lib/james-server-data-jdbc-3.0-beta5-SNAPSHOT.jar>
[INFO] Installing /home/jenkins/jenkins-slave/maven-repositories/1/org/apache/james/james-server-data-hbase/3.0-beta5-SNAPSHOT/james-server-data-hbase-3.0-beta5-SNAPSHOT.jar
to <https://builds.apache.org/job/james-app-trunk/ws/trunk/target/appassembler/lib/james-server-data-hbase-3.0-beta5-SNAPSHOT.jar>
[INFO] Installing /home/jenkins/jenkins-slave/maven-repositories/1/org/apache/james/apache-james-mailbox-hbase/0.5-SNAPSHOT/apache-james-mailbox-hbase-0.5-SNAPSHOT-tests.jar
to <https://builds.apache.org/job/james-app-trunk/ws/trunk/target/appassembler/lib/apache-james-mailbox-hbase-0.5-SNAPSHOT-tests.jar>
[INFO] Installing /home/jenkins/jenkins-slave/maven-repositories/1/org/apache/james/james-server-data-jcr/3.0-beta5-SNAPSHOT/james-server-data-jcr-3.0-beta5-SNAPSHOT.jar
to <https://builds.apache.org/job/james-app-trunk/ws/trunk/target/appassembler/lib/james-server-data-jcr-3.0-beta5-SNAPSHOT.jar>
[INFO] Installing /home/jenkins/jenkins-slave/maven-repositories/1/org/apache/james/protocols/protocols-imap/1.6.3-SNAPSHOT/protocols-imap-1.6.3-SNAPSHOT.jar
to <https://builds.apache.org/job/james-app-trunk/ws/trunk/target/appassembler/lib/protocols-imap-1.6.3-SNAPSHOT.jar>
[INFO] Installing /home/jenkins/jenkins-slave/maven-repositories/1/org/apache/geronimo/javamail/geronimo-javamail_1.4_mail/1.6/geronimo-javamail_1.4_mail-1.6.jar
to <https://builds.apache.org/job/james-app-trunk/ws/trunk/target/appassembler/lib/geronimo-javamail_1.4_mail-1.6.jar>
[INFO] Installing /home/jenkins/jenkins-slave/maven-repositories/1/commons-lang/commons-lang/2.6/commons-lang-2.6.jar
to <https://builds.apache.org/job/james-app-trunk/ws/trunk/target/appassembler/lib/commons-lang-2.6.jar>
[INFO] Installing /home/jenkins/jenkins-slave/maven-repositories/1/com/beetstra/jutf7/jutf7/1.0.0/jutf7-1.0.0.jar
to <https://builds.apache.org/job/james-app-trunk/ws/trunk/target/appassembler/lib/jutf7-1.0.0.jar>
[INFO] Installing /home/jenkins/jenkins-slave/maven-repositories/1/fm/void/jetm/jetm/1.2.3/jetm-1.2.3.jar
to <https://builds.apache.org/job/james-app-trunk/ws/trunk/target/appassembler/lib/jetm-1.2.3.jar>
[INFO] Installing /home/jenkins/jenkins-slave/maven-repositories/1/fm/void/jetm/jetm-optional/1.2.3/jetm-optional-1.2.3.jar
to <https://builds.apache.org/job/james-app-trunk/ws/trunk/target/appassembler/lib/jetm-optional-1.2.3.jar>
[INFO] Installing <https://builds.apache.org/job/james-app-trunk/ws/trunk/target/apache-james-3.0-beta5-SNAPSHOT.jar>
to <https://builds.apache.org/job/james-app-trunk/ws/trunk/target/appassembler/lib/apache-james-3.0-beta5-SNAPSHOT.jar>
mojoSucceeded org.codehaus.mojo:appassembler-maven-plugin:1.0(make-appassemble)
mojoStarted org.codehaus.mojo:appassembler-maven-plugin:1.0(make-appassemble)
[INFO] 
[INFO] --- appassembler-maven-plugin:1.0:generate-daemons (make-appassemble) @ apache-james
---
mojoSucceeded org.codehaus.mojo:appassembler-maven-plugin:1.0(make-appassemble)
mojoStarted org.apache.maven.plugins:maven-antrun-plugin:1.2(default)
[INFO] 
[INFO] --- maven-antrun-plugin:1.2:run (default) @ apache-james ---
[INFO] Executing tasks
     [copy] Copying 1 file to <https://builds.apache.org/job/james-app-trunk/ws/trunk/target/appassembler/jsw/james/bin>
[INFO] Executed tasks
mojoSucceeded org.apache.maven.plugins:maven-antrun-plugin:1.2(default)
mojoStarted org.apache.maven.plugins:maven-assembly-plugin:2.2.1(make-assembly)
[INFO] 
[INFO] --- maven-assembly-plugin:2.2.1:attached (make-assembly) @ apache-james ---
[INFO] apache-james-3.0-beta5-SNAPSHOT/var/ already added, skipping
[INFO] apache-james-3.0-beta5-SNAPSHOT/var/README.txt already added, skipping
[INFO] apache-james-3.0-beta5-SNAPSHOT/lib/ already added, skipping
[INFO] apache-james-3.0-beta5-SNAPSHOT/conf/ already added, skipping
[INFO] apache-james-3.0-beta5-SNAPSHOT/bin/james.bat already added, skipping
[INFO] apache-james-3.0-beta5-SNAPSHOT/bin/wrapper-windows-x86-32.exe already added, skipping
[INFO] Building zip: <https://builds.apache.org/job/james-app-trunk/ws/trunk/target/apache-james-3.0-beta5-SNAPSHOT-app.zip>
[INFO] apache-james-3.0-beta5-SNAPSHOT/var/ already added, skipping
[INFO] apache-james-3.0-beta5-SNAPSHOT/var/README.txt already added, skipping
[INFO] apache-james-3.0-beta5-SNAPSHOT/lib/ already added, skipping
[INFO] apache-james-3.0-beta5-SNAPSHOT/conf/ already added, skipping
[INFO] apache-james-3.0-beta5-SNAPSHOT/bin/james.bat already added, skipping
[INFO] apache-james-3.0-beta5-SNAPSHOT/bin/wrapper-windows-x86-32.exe already added, skipping
[INFO] apache-james-3.0-beta5-SNAPSHOT/var/ already added, skipping
[INFO] apache-james-3.0-beta5-SNAPSHOT/var/README.txt already added, skipping
[INFO] apache-james-3.0-beta5-SNAPSHOT/lib/ already added, skipping
[INFO] apache-james-3.0-beta5-SNAPSHOT/conf/ already added, skipping
[INFO] apache-james-3.0-beta5-SNAPSHOT/bin/james.bat already added, skipping
[INFO] apache-james-3.0-beta5-SNAPSHOT/bin/wrapper-windows-x86-32.exe already added, skipping
[INFO] Building tar : <https://builds.apache.org/job/james-app-trunk/ws/trunk/target/apache-james-3.0-beta5-SNAPSHOT-app.tar.gz>
[INFO] apache-james-3.0-beta5-SNAPSHOT/var/ already added, skipping
[INFO] apache-james-3.0-beta5-SNAPSHOT/var/README.txt already added, skipping
[INFO] apache-james-3.0-beta5-SNAPSHOT/lib/ already added, skipping
[INFO] apache-james-3.0-beta5-SNAPSHOT/conf/ already added, skipping
[INFO] apache-james-3.0-beta5-SNAPSHOT/bin/james.bat already added, skipping
[INFO] apache-james-3.0-beta5-SNAPSHOT/bin/wrapper-windows-x86-32.exe already added, skipping
mojoSucceeded org.apache.maven.plugins:maven-assembly-plugin:2.2.1(make-assembly)
mojoStarted org.apache.maven.plugins:maven-war-plugin:2.1.1(make-war)
[INFO] 
[INFO] --- maven-war-plugin:2.1.1:war (make-war) @ apache-james ---
[INFO] Packaging webapp
[INFO] Assembling webapp [apache-james] in [<https://builds.apache.org/job/james-app-trunk/ws/trunk/target/apache-james-3.0-beta5-SNAPSHOT]>
[INFO] Processing war project
[INFO] Copying webapp webResources [<https://builds.apache.org/job/james-app-trunk/ws/trunk/src/main/resources]>
to [<https://builds.apache.org/job/james-app-trunk/ws/trunk/target/apache-james-3.0-beta5-SNAPSHOT]>
[INFO] Copying webapp webResources [<https://builds.apache.org/job/james-app-trunk/ws/trunk/src/main/resources]>
to [<https://builds.apache.org/job/james-app-trunk/ws/trunk/target/apache-james-3.0-beta5-SNAPSHOT]>
[INFO] Copying webapp webResources [<https://builds.apache.org/job/james-app-trunk/ws/trunk/src/main/config/war]>
to [<https://builds.apache.org/job/james-app-trunk/ws/trunk/target/apache-james-3.0-beta5-SNAPSHOT]>
[INFO] Copying webapp webResources [<https://builds.apache.org/job/james-app-trunk/ws/trunk/src/main/licensing/war]>
to [<https://builds.apache.org/job/james-app-trunk/ws/trunk/target/apache-james-3.0-beta5-SNAPSHOT]>
[INFO] Copying webapp webResources [<https://builds.apache.org/job/james-app-trunk/ws/trunk/.]>
to [<https://builds.apache.org/job/james-app-trunk/ws/trunk/target/apache-james-3.0-beta5-SNAPSHOT]>
[INFO] Copying webapp resources [<https://builds.apache.org/job/james-app-trunk/ws/trunk/src/main/webapp]>
[INFO] Webapp assembled in [186 msecs]
[INFO] Building war: <https://builds.apache.org/job/james-app-trunk/ws/trunk/target/apache-james-3.0-beta5-SNAPSHOT.war>
[INFO] WEB-INF/web.xml already added, skipping
mojoSucceeded org.apache.maven.plugins:maven-war-plugin:2.1.1(make-war)
mojoStarted org.apache.maven.plugins:maven-install-plugin:2.3.1(default-install)
[INFO] 
[INFO] --- maven-install-plugin:2.3.1:install (default-install) @ apache-james ---
[INFO] Installing <https://builds.apache.org/job/james-app-trunk/ws/trunk/target/apache-james-3.0-beta5-SNAPSHOT.war>
to /home/jenkins/jenkins-slave/maven-repositories/1/org/apache/james/apache-james/3.0-beta5-SNAPSHOT/apache-james-3.0-beta5-SNAPSHOT.jar
[INFO] Installing <https://builds.apache.org/job/james-app-trunk/ws/trunk/pom.xml> to
/home/jenkins/jenkins-slave/maven-repositories/1/org/apache/james/apache-james/3.0-beta5-SNAPSHOT/apache-james-3.0-beta5-SNAPSHOT.pom
[INFO] Installing <https://builds.apache.org/job/james-app-trunk/ws/trunk/target/apache-james-3.0-beta5-SNAPSHOT-app.zip>
to /home/jenkins/jenkins-slave/maven-repositories/1/org/apache/james/apache-james/3.0-beta5-SNAPSHOT/apache-james-3.0-beta5-SNAPSHOT-app.zip
[INFO] Installing <https://builds.apache.org/job/james-app-trunk/ws/trunk/target/apache-james-3.0-beta5-SNAPSHOT-app.tar.gz>
to /home/jenkins/jenkins-slave/maven-repositories/1/org/apache/james/apache-james/3.0-beta5-SNAPSHOT/apache-james-3.0-beta5-SNAPSHOT-app.tar.gz
mojoSucceeded org.apache.maven.plugins:maven-install-plugin:2.3.1(default-install)
mojoStarted org.apache.maven.plugins:maven-deploy-plugin:2.7(default-deploy)
[INFO] 
[INFO] --- maven-deploy-plugin:2.7:deploy (default-deploy) @ apache-james ---
Downloading: https://repository.apache.org/content/repositories/snapshots/org/apache/james/apache-james/3.0-beta5-SNAPSHOT/maven-metadata.xml
[WARNING] Could not transfer metadata org.apache.james:apache-james:3.0-beta5-SNAPSHOT/maven-metadata.xml
from/to apache.snapshots.https (https://repository.apache.org/content/repositories/snapshots):
Error transferring file: Server returned HTTP response code: 503 for URL: https://repository.apache.org/content/repositories/snapshots/org/apache/james/apache-james/3.0-beta5-SNAPSHOT/maven-metadata.xml
mojoFailed org.apache.maven.plugins:maven-deploy-plugin:2.7(default-deploy)
projectFailed org.apache.james:apache-james:3.0-beta5-SNAPSHOT
sessionEnded
[INFO] ------------------------------------------------------------------------
[INFO] BUILD FAILURE
[INFO] ------------------------------------------------------------------------
[INFO] Total time: 51.817s
[INFO] Finished at: Tue Aug 14 19:23:04 UTC 2012
[INFO] Final Memory: 27M/146M
[INFO] ------------------------------------------------------------------------
Projects to build: [MavenProject: org.apache.james:apache-james:3.0-beta5-SNAPSHOT @ <https://builds.apache.org/job/james-app-trunk/ws/trunk/pom.xml]>
[JENKINS] Archiving <https://builds.apache.org/job/james-app-trunk/ws/trunk/pom.xml>
to /home/hudson/hudson/jobs/james-app-trunk/modules/org.apache.james$apache-james/builds/2012-08-14_19-22-08/archive/org.apache.james/apache-james/3.0-beta5-SNAPSHOT/apache-james-3.0-beta5-SNAPSHOT.pom
[JENKINS] Archiving <https://builds.apache.org/job/james-app-trunk/ws/trunk/target/apache-james-3.0-beta5-SNAPSHOT.war>
to /home/hudson/hudson/jobs/james-app-trunk/modules/org.apache.james$apache-james/builds/2012-08-14_19-22-08/archive/org.apache.james/apache-james/3.0-beta5-SNAPSHOT/apache-james-3.0-beta5-SNAPSHOT.jar
[JENKINS] Archiving <https://builds.apache.org/job/james-app-trunk/ws/trunk/target/apache-james-3.0-beta5-SNAPSHOT-app.zip>
to /home/hudson/hudson/jobs/james-app-trunk/modules/org.apache.james$apache-james/builds/2012-08-14_19-22-08/archive/org.apache.james/apache-james/3.0-beta5-SNAPSHOT/apache-james-3.0-beta5-SNAPSHOT-app.zip
[JENKINS] Archiving <https://builds.apache.org/job/james-app-trunk/ws/trunk/target/apache-james-3.0-beta5-SNAPSHOT-app.tar.gz>
to /home/hudson/hudson/jobs/james-app-trunk/modules/org.apache.james$apache-james/builds/2012-08-14_19-22-08/archive/org.apache.james/apache-james/3.0-beta5-SNAPSHOT/apache-james-3.0-beta5-SNAPSHOT-app.tar.gz
Waiting for Jenkins to finish collecting data
mavenExecutionResult exceptions not empty
message : Failed to execute goal org.apache.maven.plugins:maven-deploy-plugin:2.7:deploy (default-deploy)
on project apache-james: Failed to retrieve remote metadata org.apache.james:apache-james:3.0-beta5-SNAPSHOT/maven-metadata.xml:
Could not transfer metadata org.apache.james:apache-james:3.0-beta5-SNAPSHOT/maven-metadata.xml
from/to apache.snapshots.https (https://repository.apache.org/content/repositories/snapshots):
Error transferring file: Server returned HTTP response code: 503 for URL: https://repository.apache.org/content/repositories/snapshots/org/apache/james/apache-james/3.0-beta5-SNAPSHOT/maven-metadata.xml
cause : Failed to retrieve remote metadata org.apache.james:apache-james:3.0-beta5-SNAPSHOT/maven-metadata.xml:
Could not transfer metadata org.apache.james:apache-james:3.0-beta5-SNAPSHOT/maven-metadata.xml
from/to apache.snapshots.https (https://repository.apache.org/content/repositories/snapshots):
Error transferring file: Server returned HTTP response code: 503 for URL: https://repository.apache.org/content/repositories/snapshots/org/apache/james/apache-james/3.0-beta5-SNAPSHOT/maven-metadata.xml
Stack trace : 
org.apache.maven.lifecycle.LifecycleExecutionException: Failed to execute goal org.apache.maven.plugins:maven-deploy-plugin:2.7:deploy
(default-deploy) on project apache-james: Failed to retrieve remote metadata org.apache.james:apache-james:3.0-beta5-SNAPSHOT/maven-metadata.xml:
Could not transfer metadata org.apache.james:apache-james:3.0-beta5-SNAPSHOT/maven-metadata.xml
from/to apache.snapshots.https (https://repository.apache.org/content/repositories/snapshots):
Error transferring file: Server returned HTTP response code: 503 for URL: https://repository.apache.org/content/repositories/snapshots/org/apache/james/apache-james/3.0-beta5-SNAPSHOT/maven-metadata.xml
	at org.apache.maven.lifecycle.internal.MojoExecutor.execute(MojoExecutor.java:217)
	at org.apache.maven.lifecycle.internal.MojoExecutor.execute(MojoExecutor.java:153)
	at org.apache.maven.lifecycle.internal.MojoExecutor.execute(MojoExecutor.java:145)
	at org.apache.maven.lifecycle.internal.LifecycleModuleBuilder.buildProject(LifecycleModuleBuilder.java:84)
	at org.apache.maven.lifecycle.internal.LifecycleModuleBuilder.buildProject(LifecycleModuleBuilder.java:59)
	at org.apache.maven.lifecycle.internal.LifecycleStarter.singleThreadedBuild(LifecycleStarter.java:183)
	at org.apache.maven.lifecycle.internal.LifecycleStarter.execute(LifecycleStarter.java:161)
	at org.apache.maven.DefaultMaven.doExecute(DefaultMaven.java:319)
	at org.apache.maven.DefaultMaven.execute(DefaultMaven.java:156)
	at org.jvnet.hudson.maven3.launcher.Maven3Launcher.main(Maven3Launcher.java:79)
	at sun.reflect.NativeMethodAccessorImpl.invoke0(Native Method)
	at sun.reflect.NativeMethodAccessorImpl.invoke(NativeMethodAccessorImpl.java:39)
	at sun.reflect.DelegatingMethodAccessorImpl.invoke(DelegatingMethodAccessorImpl.java:25)
	at java.lang.reflect.Method.invoke(Method.java:597)
	at org.codehaus.plexus.classworlds.launcher.Launcher.launchStandard(Launcher.java:329)
	at org.codehaus.plexus.classworlds.launcher.Launcher.launch(Launcher.java:239)
	at org.jvnet.hudson.maven3.agent.Maven3Main.launch(Maven3Main.java:158)
	at hudson.maven.Maven3Builder.call(Maven3Builder.java:98)
	at hudson.maven.Maven3Builder.call(Maven3Builder.java:64)
	at hudson.remoting.UserRequest.perform(UserRequest.java:118)
	at hudson.remoting.UserRequest.perform(UserRequest.java:48)
	at hudson.remoting.Request$2.run(Request.java:326)
	at hudson.remoting.InterceptingExecutorService$1.call(InterceptingExecutorService.java:72)
	at java.util.concurrent.FutureTask$Sync.innerRun(FutureTask.java:303)
	at java.util.concurrent.FutureTask.run(FutureTask.java:138)
	at java.util.concurrent.ThreadPoolExecutor$Worker.runTask(ThreadPoolExecutor.java:886)
	at java.util.concurrent.ThreadPoolExecutor$Worker.run(ThreadPoolExecutor.java:908)
	at java.lang.Thread.run(Thread.java:662)
Caused by: org.apache.maven.plugin.MojoExecutionException: Failed to retrieve remote metadata
org.apache.james:apache-james:3.0-beta5-SNAPSHOT/maven-metadata.xml: Could not transfer metadata
org.apache.james:apache-james:3.0-beta5-SNAPSHOT/maven-metadata.xml from/to apache.snapshots.https
(https://repository.apache.org/content/repositories/snapshots): Error transferring file: Server
returned HTTP response code: 503 for URL: https://repository.apache.org/content/repositories/snapshots/org/apache/james/apache-james/3.0-beta5-SNAPSHOT/maven-metadata.xml
	at org.apache.maven.plugin.deploy.DeployMojo.execute(DeployMojo.java:193)
	at org.apache.maven.plugin.DefaultBuildPluginManager.executeMojo(DefaultBuildPluginManager.java:101)
	at org.apache.maven.lifecycle.internal.MojoExecutor.execute(MojoExecutor.java:209)
	... 27 more
Caused by: org.apache.maven.artifact.deployer.ArtifactDeploymentException: Failed to retrieve
remote metadata org.apache.james:apache-james:3.0-beta5-SNAPSHOT/maven-metadata.xml: Could
not transfer metadata org.apache.james:apache-james:3.0-beta5-SNAPSHOT/maven-metadata.xml
from/to apache.snapshots.https (https://repository.apache.org/content/repositories/snapshots):
Error transferring file: Server returned HTTP response code: 503 for URL: https://repository.apache.org/content/repositories/snapshots/org/apache/james/apache-james/3.0-beta5-SNAPSHOT/maven-metadata.xml
	at org.apache.maven.artifact.deployer.DefaultArtifactDeployer.deploy(DefaultArtifactDeployer.java:141)
	at org.apache.maven.plugin.deploy.AbstractDeployMojo.deploy(AbstractDeployMojo.java:167)
	at org.apache.maven.plugin.deploy.DeployMojo.execute(DeployMojo.java:157)
	... 29 more
Caused by: org.sonatype.aether.deployment.DeploymentException: Failed to retrieve remote metadata
org.apache.james:apache-james:3.0-beta5-SNAPSHOT/maven-metadata.xml: Could not transfer metadata
org.apache.james:apache-james:3.0-beta5-SNAPSHOT/maven-metadata.xml from/to apache.snapshots.https
(https://repository.apache.org/content/repositories/snapshots): Error transferring file: Server
returned HTTP response code: 503 for URL: https://repository.apache.org/content/repositories/snapshots/org/apache/james/apache-james/3.0-beta5-SNAPSHOT/maven-metadata.xml
	at org.sonatype.aether.impl.internal.DefaultDeployer.upload(DefaultDeployer.java:407)
	at org.sonatype.aether.impl.internal.DefaultDeployer.deploy(DefaultDeployer.java:260)
	at org.sonatype.aether.impl.internal.DefaultDeployer.deploy(DefaultDeployer.java:215)
	at org.sonatype.aether.impl.internal.DefaultRepositorySystem.deploy(DefaultRepositorySystem.java:480)
	at org.apache.maven.artifact.deployer.DefaultArtifactDeployer.deploy(DefaultArtifactDeployer.java:137)
	... 31 more
Caused by: org.sonatype.aether.transfer.MetadataTransferException: Could not transfer metadata
org.apache.james:apache-james:3.0-beta5-SNAPSHOT/maven-metadata.xml from/to apache.snapshots.https
(https://repository.apache.org/content/repositories/snapshots): Error transferring file: Server
returned HTTP response code: 503 for URL: https://repository.apache.org/content/repositories/snapshots/org/apache/james/apache-james/3.0-beta5-SNAPSHOT/maven-metadata.xml
	at org.sonatype.aether.connector.wagon.WagonRepositoryConnector$3.wrap(WagonRepositoryConnector.java:932)
	at org.sonatype.aether.connector.wagon.WagonRepositoryConnector$3.wrap(WagonRepositoryConnector.java:923)
	at org.sonatype.aether.connector.wagon.WagonRepositoryConnector$GetTask.flush(WagonRepositoryConnector.java:695)
	at org.sonatype.aether.connector.wagon.WagonRepositoryConnector$GetTask.flush(WagonRepositoryConnector.java:689)
	at org.sonatype.aether.connector.wagon.WagonRepositoryConnector.get(WagonRepositoryConnector.java:445)
	at org.sonatype.aether.impl.internal.DefaultDeployer.upload(DefaultDeployer.java:379)
	... 35 more
Caused by: org.apache.maven.wagon.TransferFailedException: Error transferring file: Server
returned HTTP response code: 503 for URL: https://repository.apache.org/content/repositories/snapshots/org/apache/james/apache-james/3.0-beta5-SNAPSHOT/maven-metadata.xml
	at org.apache.maven.wagon.providers.http.LightweightHttpWagon.fillInputData(LightweightHttpWagon.java:143)
	at org.apache.maven.wagon.StreamWagon.getInputStream(StreamWagon.java:116)
	at org.apache.maven.wagon.StreamWagon.getIfNewer(StreamWagon.java:88)
	at org.apache.maven.wagon.StreamWagon.get(StreamWagon.java:61)
	at org.sonatype.aether.connector.wagon.WagonRepositoryConnector$GetTask.run(WagonRepositoryConnector.java:608)
	at org.sonatype.aether.util.concurrency.RunnableErrorForwarder$1.run(RunnableErrorForwarder.java:64)
	... 3 more
Caused by: java.io.IOException: Server returned HTTP response code: 503 for URL: https://repository.apache.org/content/repositories/snapshots/org/apache/james/apache-james/3.0-beta5-SNAPSHOT/maven-metadata.xml
	at sun.reflect.NativeConstructorAccessorImpl.newInstance0(Native Method)
	at sun.reflect.NativeConstructorAccessorImpl.newInstance(NativeConstructorAccessorImpl.java:39)
	at sun.reflect.DelegatingConstructorAccessorImpl.newInstance(DelegatingConstructorAccessorImpl.java:27)
	at java.lang.reflect.Constructor.newInstance(Constructor.java:513)
	at sun.net.www.protocol.http.HttpURLConnection$6.run(HttpURLConnection.java:1491)
	at java.security.AccessController.doPrivileged(Native Method)
	at sun.net.www.protocol.http.HttpURLConnection.getChainedException(HttpURLConnection.java:1485)
	at sun.net.www.protocol.http.HttpURLConnection.getInputStream(HttpURLConnection.java:1139)
	at sun.net.www.protocol.https.HttpsURLConnectionImpl.getInputStream(HttpsURLConnectionImpl.java:234)
	at org.apache.maven.wagon.providers.http.LightweightHttpWagon.fillInputData(LightweightHttpWagon.java:122)
	... 8 more
Caused by: java.io.IOException: Server returned HTTP response code: 503 for URL: https://repository.apache.org/content/repositories/snapshots/org/apache/james/apache-james/3.0-beta5-SNAPSHOT/maven-metadata.xml
	at sun.net.www.protocol.http.HttpURLConnection.getInputStream(HttpURLConnection.java:1436)
	at java.net.HttpURLConnection.getResponseCode(HttpURLConnection.java:379)
	at sun.net.www.protocol.https.HttpsURLConnectionImpl.getResponseCode(HttpsURLConnectionImpl.java:318)
	at org.apache.maven.wagon.providers.http.LightweightHttpWagon.fillInputData(LightweightHttpWagon.java:115)
	... 8 more
channel stopped

---------------------------------------------------------------------
To unsubscribe, e-mail: server-dev-unsubscribe@james.apache.org
For additional commands, e-mail: server-dev-help@james.apache.org


Mime
View raw message