james-server-dev mailing list archives

Site index · List index
Message view « Date » · « Thread »
Top « Date » · « Thread »
From Apache Jenkins Server <jenk...@builds.apache.org>
Subject Build failed in Jenkins: james-server-trunk #3185
Date Sat, 01 Sep 2012 11:48:32 GMT
See <https://builds.apache.org/job/james-server-trunk/3185/>

------------------------------------------
[...truncated 2148 lines...]
	at org.junit.runners.ParentRunner.runChildren(ParentRunner.java:229)
	at org.junit.runners.ParentRunner.access$000(ParentRunner.java:50)
	at org.junit.runners.ParentRunner$2.evaluate(ParentRunner.java:222)
	at org.junit.runners.ParentRunner.run(ParentRunner.java:300)
	at org.apache.maven.surefire.junit4.JUnit4TestSet.execute(JUnit4TestSet.java:53)
	at org.apache.maven.surefire.junit4.JUnit4Provider.executeTestSet(JUnit4Provider.java:123)
	at org.apache.maven.surefire.junit4.JUnit4Provider.invoke(JUnit4Provider.java:104)
	at sun.reflect.NativeMethodAccessorImpl.invoke0(Native Method)
	at sun.reflect.NativeMethodAccessorImpl.invoke(NativeMethodAccessorImpl.java:39)
	at sun.reflect.DelegatingMethodAccessorImpl.invoke(DelegatingMethodAccessorImpl.java:25)
	at java.lang.reflect.Method.invoke(Method.java:597)
	at org.apache.maven.surefire.util.ReflectionUtils.invokeMethodWithArray(ReflectionUtils.java:164)
	at org.apache.maven.surefire.booter.ProviderFactory$ProviderProxy.invoke(ProviderFactory.java:110)
	at org.apache.maven.surefire.booter.SurefireStarter.invokeProvider(SurefireStarter.java:175)
	at org.apache.maven.surefire.booter.SurefireStarter.runSuitesInProcessWhenForked(SurefireStarter.java:81)
	at org.apache.maven.surefire.booter.ForkedBooter.main(ForkedBooter.java:68)
2012-09-01 11:47:09,404 [main] ERROR MockLog - Exception during regexMap processing: 
java.util.regex.PatternSyntaxException: Regex should be formatted as regex:<regular-expression>:<parameterized-string>
near index 0
regex:(.+)@test
^
	at org.apache.james.rrt.lib.RecipientRewriteTableUtil.regexMap(RecipientRewriteTableUtil.java:67)
	at org.apache.james.rrt.lib.AbstractRecipientRewriteTable.getMappings(AbstractRecipientRewriteTable.java:137)
	at org.apache.james.rrt.lib.AbstractRecipientRewriteTable.getMappings(AbstractRecipientRewriteTable.java:111)
	at org.apache.james.rrt.lib.AbstractRecipientRewriteTableTest.testStoreAndRetrieveRegexMapping(AbstractRecipientRewriteTableTest.java:101)
	at sun.reflect.NativeMethodAccessorImpl.invoke0(Native Method)
	at sun.reflect.NativeMethodAccessorImpl.invoke(NativeMethodAccessorImpl.java:39)
	at sun.reflect.DelegatingMethodAccessorImpl.invoke(DelegatingMethodAccessorImpl.java:25)
	at java.lang.reflect.Method.invoke(Method.java:597)
	at org.junit.runners.model.FrameworkMethod$1.runReflectiveCall(FrameworkMethod.java:45)
	at org.junit.internal.runners.model.ReflectiveCallable.run(ReflectiveCallable.java:15)
	at org.junit.runners.model.FrameworkMethod.invokeExplosively(FrameworkMethod.java:42)
	at org.junit.internal.runners.statements.InvokeMethod.evaluate(InvokeMethod.java:20)
	at org.junit.internal.runners.statements.RunBefores.evaluate(RunBefores.java:28)
	at org.junit.internal.runners.statements.RunAfters.evaluate(RunAfters.java:30)
	at org.junit.runners.ParentRunner.runLeaf(ParentRunner.java:263)
	at org.junit.runners.BlockJUnit4ClassRunner.runChild(BlockJUnit4ClassRunner.java:68)
	at org.junit.runners.BlockJUnit4ClassRunner.runChild(BlockJUnit4ClassRunner.java:47)
	at org.junit.runners.ParentRunner$3.run(ParentRunner.java:231)
	at org.junit.runners.ParentRunner$1.schedule(ParentRunner.java:60)
	at org.junit.runners.ParentRunner.runChildren(ParentRunner.java:229)
	at org.junit.runners.ParentRunner.access$000(ParentRunner.java:50)
	at org.junit.runners.ParentRunner$2.evaluate(ParentRunner.java:222)
	at org.junit.runners.ParentRunner.run(ParentRunner.java:300)
	at org.apache.maven.surefire.junit4.JUnit4TestSet.execute(JUnit4TestSet.java:53)
	at org.apache.maven.surefire.junit4.JUnit4Provider.executeTestSet(JUnit4Provider.java:123)
	at org.apache.maven.surefire.junit4.JUnit4Provider.invoke(JUnit4Provider.java:104)
	at sun.reflect.NativeMethodAccessorImpl.invoke0(Native Method)
	at sun.reflect.NativeMethodAccessorImpl.invoke(NativeMethodAccessorImpl.java:39)
	at sun.reflect.DelegatingMethodAccessorImpl.invoke(DelegatingMethodAccessorImpl.java:25)
	at java.lang.reflect.Method.invoke(Method.java:597)
	at org.apache.maven.surefire.util.ReflectionUtils.invokeMethodWithArray(ReflectionUtils.java:164)
	at org.apache.maven.surefire.booter.ProviderFactory$ProviderProxy.invoke(ProviderFactory.java:110)
	at org.apache.maven.surefire.booter.SurefireStarter.invokeProvider(SurefireStarter.java:175)
	at org.apache.maven.surefire.booter.SurefireStarter.runSuitesInProcessWhenForked(SurefireStarter.java:81)
	at org.apache.maven.surefire.booter.ForkedBooter.main(ForkedBooter.java:68)
Tests run: 6, Failures: 0, Errors: 0, Skipped: 0, Time elapsed: 21.336 sec
2012-09-01 11:47:13,582 [RegionServer:0;juno.apache.org,59265,1346500012745] WARN  org.apache.hadoop.hbase.regionserver.HRegionServer
- Received close for region we are already opening or closing; 70236052
Running org.apache.james.domainlist.hbase.HBaseDomainListTest
2012-09-01 11:47:16,705 [main] WARN  org.apache.hadoop.metrics2.impl.MetricsSystemImpl - Source
name ugi already exists!
2012-09-01 11:47:16,730 [main] WARN  org.apache.hadoop.metrics2.impl.MetricsSystemImpl - Source
name ugi already exists!
Starting DataNode 0 with dfs.data.dir: <https://builds.apache.org/job/james-server-trunk/ws/trunk/data-hbase/target/test-data/3a4073ce-5a30-45cc-947c-21b4904ece97/dfscluster_6133e28e-7043-4f16-9936-def844ff704d/dfs/data/data1,/home/jenkins/jenkins-slave/workspace/james-server-trunk/trunk/data-hbase/target/test-data/3a4073ce-5a30-45cc-947c-21b4904ece97/dfscluster_6133e28e-7043-4f16-9936-def844ff704d/dfs/data/data2>
2012-09-01 11:47:17,394 [main] WARN  org.apache.hadoop.metrics2.impl.MetricsSystemImpl - NameNode
metrics system already initialized!
2012-09-01 11:47:17,394 [main] WARN  org.apache.hadoop.metrics2.impl.MetricsSystemImpl - Source
name ugi already exists!
2012-09-01 11:47:17,697 [main] WARN  org.apache.hadoop.metrics2.impl.MetricsSystemImpl - Source
name jvm already exists!
2012-09-01 11:47:27,700 [Master:0;juno.apache.org,52656,1346500038794] WARN  org.apache.hadoop.hbase.zookeeper.RecoverableZooKeeper
- Node /hbase/root-region-server already deleted, and this is not a retry
Tests run: 5, Failures: 0, Errors: 0, Skipped: 0, Time elapsed: 20.074 sec
2012-09-01 11:47:37,375 [RegionServer:0;juno.apache.org,36395,1346500038968] WARN  org.apache.hadoop.hbase.regionserver.HRegionServer
- Received close for region we are already opening or closing; 70236052
Running org.apache.james.user.hbase.HBaseUsersRepositoryTest
2012-09-01 11:47:41,465 [main] WARN  org.apache.hadoop.metrics2.impl.MetricsSystemImpl - Source
name ugi already exists!
2012-09-01 11:47:41,490 [main] WARN  org.apache.hadoop.metrics2.impl.MetricsSystemImpl - Source
name ugi already exists!
Starting DataNode 0 with dfs.data.dir: <https://builds.apache.org/job/james-server-trunk/ws/trunk/data-hbase/target/test-data/91740479-5acb-41c0-bdb4-5526f1e04894/dfscluster_18f51317-ecdb-4059-b776-285ebaa80f72/dfs/data/data1,/home/jenkins/jenkins-slave/workspace/james-server-trunk/trunk/data-hbase/target/test-data/91740479-5acb-41c0-bdb4-5526f1e04894/dfscluster_18f51317-ecdb-4059-b776-285ebaa80f72/dfs/data/data2>
2012-09-01 11:47:42,167 [main] WARN  org.apache.hadoop.metrics2.impl.MetricsSystemImpl - NameNode
metrics system already initialized!
2012-09-01 11:47:42,167 [main] WARN  org.apache.hadoop.metrics2.impl.MetricsSystemImpl - Source
name ugi already exists!
2012-09-01 11:47:42,472 [main] WARN  org.apache.hadoop.metrics2.impl.MetricsSystemImpl - Source
name jvm already exists!
2012-09-01 11:47:52,360 [Master:0;juno.apache.org,52562,1346500063577] WARN  org.apache.hadoop.hbase.zookeeper.RecoverableZooKeeper
- Node /hbase/root-region-server already deleted, and this is not a retry
Tests run: 7, Failures: 0, Errors: 0, Skipped: 0, Time elapsed: 19.406 sec
2012-09-01 11:48:02,040 [RegionServer:0;juno.apache.org,57074,1346500063751] WARN  org.apache.hadoop.hbase.regionserver.HRegionServer
- Received close for region we are already opening or closing; 70236052

Results :

Tests in error: 
  org.apache.james.system.hbase.TablePoolTest

Tests run: 19, Failures: 0, Errors: 1, Skipped: 0

mojoFailed org.apache.maven.plugins:maven-surefire-plugin:2.10(default-test)
[JENKINS] Recording test results
projectFailed org.apache.james:james-server-data-hbase:3.0-beta5-SNAPSHOT
sessionEnded
[INFO] ------------------------------------------------------------------------
[INFO] Reactor Summary:
[INFO] 
[INFO] Apache James Server ............................... SUCCESS [26.279s]
[INFO] Apache James Server Lifecycle API ................. SUCCESS [8.284s]
[INFO] Apache James Server Filesystem API ................ SUCCESS [8.047s]
[INFO] Apache James Server Data API ...................... SUCCESS [7.509s]
[INFO] Apache James Server Lifecycle Spring .............. SUCCESS [9.554s]
[INFO] Apache James Server Mailetcontainer API ........... SUCCESS [7.578s]
[INFO] Apache James Server Common Utilities .............. SUCCESS [16.039s]
[INFO] Apache James Server Protocols Library ............. SUCCESS [9.509s]
[INFO] Apache James Server Core .......................... SUCCESS [17.886s]
[INFO] Apache James Server Container Spring .............. SUCCESS [17.698s]
[INFO] Apache James Server DNS Server API ................ SUCCESS [6.165s]
[INFO] Apache James Server DNSService Implementation ..... SUCCESS [7.977s]
[INFO] Apache James Server DNSService Library ............ SUCCESS [8.261s]
[INFO] Apache James Server Queue API ..................... SUCCESS [5.745s]
[INFO] Apache James Server FetchMail ..................... SUCCESS [5.644s]
[INFO] Apache James Server Data Library .................. SUCCESS [6.802s]
[INFO] Apache James Server HBase Data Persistence ........ FAILURE [11:35.820s]
[INFO] Apache James Server JPA Data Persistence .......... SKIPPED
[INFO] Apache James Server JCR Data Persistence .......... SKIPPED
[INFO] Apache James Server JDBC Data Persistence ......... SKIPPED
[INFO] Apache James Server File Data Persistence ......... SKIPPED
[INFO] Apache James Server LDAP Data Implementation ...... SKIPPED
[INFO] Apache James Server Mailbox Adapter ............... SKIPPED
[INFO] Apache James Server Mailetcontainer Camel ......... SKIPPED
[INFO] Apache James Server Mailets ....................... SKIPPED
[INFO] Apache James Server IMAP .......................... SKIPPED
[INFO] Apache James Server SMTP .......................... SKIPPED
[INFO] Apache James Server LMTP .......................... SKIPPED
[INFO] Apache James Server POP3 .......................... SKIPPED
[INFO] Apache James Server File Mail Queue ............... SKIPPED
[INFO] Apache James Server JMS Mail Queue ................ SKIPPED
[INFO] Apache James Server ActiveMQ Queue ................ SKIPPED
[INFO] Apache James Server Client ........................ SKIPPED
[INFO] ------------------------------------------------------------------------
[INFO] BUILD FAILURE
[INFO] ------------------------------------------------------------------------
[INFO] Total time: 14:32.974s
[INFO] Finished at: Sat Sep 01 11:48:04 UTC 2012
[INFO] Final Memory: 75M/437M
[INFO] ------------------------------------------------------------------------
Projects to build: [MavenProject: org.apache.james:james-server:3.0-beta5-SNAPSHOT @ <https://builds.apache.org/job/james-server-trunk/ws/trunk/pom.xml,>
MavenProject: org.apache.james:james-server-lifecycle-api:3.0-beta5-SNAPSHOT @ <https://builds.apache.org/job/james-server-trunk/ws/trunk/lifecycle-api/pom.xml,>
MavenProject: org.apache.james:james-server-filesystem-api:3.0-beta5-SNAPSHOT @ <https://builds.apache.org/job/james-server-trunk/ws/trunk/filesystem-api/pom.xml,>
MavenProject: org.apache.james:james-server-data-api:3.0-beta5-SNAPSHOT @ <https://builds.apache.org/job/james-server-trunk/ws/trunk/data-api/pom.xml,>
MavenProject: org.apache.james:james-server-lifecycle-spring:3.0-beta5-SNAPSHOT @ <https://builds.apache.org/job/james-server-trunk/ws/trunk/lifecycle-spring/pom.xml,>
MavenProject: org.apache.james:james-server-mailetcontainer-api:3.0-beta5-SNAPSHOT @ <https://builds.apache.org/job/james-server-trunk/ws/trunk/mailetcontainer-api/pom.xml,>
MavenProject: org.apache.james:james-server-util:3.0-beta5-SNAPSHOT @ <https://builds.apache.org/job/james-server-trunk/ws/trunk/util/pom.xml,>
MavenProject: org.apache.james:james-server-protocols-library:3.0-beta5-SNAPSHOT @ <https://builds.apache.org/job/james-server-trunk/ws/trunk/protocols-library/pom.xml,>
MavenProject: org.apache.james:james-server-core:3.0-beta5-SNAPSHOT @ <https://builds.apache.org/job/james-server-trunk/ws/trunk/core/pom.xml,>
MavenProject: org.apache.james:james-server-container-spring:3.0-beta5-SNAPSHOT @ <https://builds.apache.org/job/james-server-trunk/ws/trunk/container-spring/pom.xml,>
MavenProject: org.apache.james:james-server-dnsservice-api:3.0-beta5-SNAPSHOT @ <https://builds.apache.org/job/james-server-trunk/ws/trunk/dnsservice-api/pom.xml,>
MavenProject: org.apache.james:james-server-dnsservice-dnsjava:3.0-beta5-SNAPSHOT @ <https://builds.apache.org/job/james-server-trunk/ws/trunk/dnsservice-dnsjava/pom.xml,>
MavenProject: org.apache.james:james-server-dnsservice-library:3.0-beta5-SNAPSHOT @ <https://builds.apache.org/job/james-server-trunk/ws/trunk/dnsservice-library/pom.xml,>
MavenProject: org.apache.james:james-server-queue-api:3.0-beta5-SNAPSHOT @ <https://builds.apache.org/job/james-server-trunk/ws/trunk/queue-api/pom.xml,>
MavenProject: org.apache.james:james-server-fetchmail:3.0-beta5-SNAPSHOT @ <https://builds.apache.org/job/james-server-trunk/ws/trunk/fetchmail/pom.xml,>
MavenProject: org.apache.james:james-server-data-library:3.0-beta5-SNAPSHOT @ <https://builds.apache.org/job/james-server-trunk/ws/trunk/data-library/pom.xml,>
MavenProject: org.apache.james:james-server-data-hbase:3.0-beta5-SNAPSHOT @ <https://builds.apache.org/job/james-server-trunk/ws/trunk/data-hbase/pom.xml,>
MavenProject: org.apache.james:james-server-data-jpa:3.0-beta5-SNAPSHOT @ <https://builds.apache.org/job/james-server-trunk/ws/trunk/data-jpa/pom.xml,>
MavenProject: org.apache.james:james-server-data-jcr:3.0-beta5-SNAPSHOT @ <https://builds.apache.org/job/james-server-trunk/ws/trunk/data-jcr/pom.xml,>
MavenProject: org.apache.james:james-server-data-jdbc:3.0-beta5-SNAPSHOT @ <https://builds.apache.org/job/james-server-trunk/ws/trunk/data-jdbc/pom.xml,>
MavenProject: org.apache.james:james-server-data-file:3.0-beta5-SNAPSHOT @ <https://builds.apache.org/job/james-server-trunk/ws/trunk/data-file/pom.xml,>
MavenProject: org.apache.james:james-server-data-ldap:3.0-beta5-SNAPSHOT @ <https://builds.apache.org/job/james-server-trunk/ws/trunk/data-ldap/pom.xml,>
MavenProject: org.apache.james:james-server-mailbox-adapter:3.0-beta5-SNAPSHOT @ <https://builds.apache.org/job/james-server-trunk/ws/trunk/mailbox-adapter/pom.xml,>
MavenProject: org.apache.james:james-server-mailetcontainer-camel:3.0-beta5-SNAPSHOT @ <https://builds.apache.org/job/james-server-trunk/ws/trunk/mailetcontainer-camel/pom.xml,>
MavenProject: org.apache.james:james-server-mailets:3.0-beta5-SNAPSHOT @ <https://builds.apache.org/job/james-server-trunk/ws/trunk/mailets/pom.xml,>
MavenProject: org.apache.james:james-server-protocols-imap4:3.0-beta5-SNAPSHOT @ <https://builds.apache.org/job/james-server-trunk/ws/trunk/protocols-imap4/pom.xml,>
MavenProject: org.apache.james:james-server-protocols-smtp:3.0-beta5-SNAPSHOT @ <https://builds.apache.org/job/james-server-trunk/ws/trunk/protocols-smtp/pom.xml,>
MavenProject: org.apache.james:james-server-protocols-lmtp:3.0-beta5-SNAPSHOT @ <https://builds.apache.org/job/james-server-trunk/ws/trunk/protocols-lmtp/pom.xml,>
MavenProject: org.apache.james:james-server-protocols-pop3:3.0-beta5-SNAPSHOT @ <https://builds.apache.org/job/james-server-trunk/ws/trunk/protocols-pop3/pom.xml,>
MavenProject: org.apache.james:james-server-queue-file:3.0-beta5-SNAPSHOT @ <https://builds.apache.org/job/james-server-trunk/ws/trunk/queue-file/pom.xml,>
MavenProject: org.apache.james:james-server-queue-jms:3.0-beta5-SNAPSHOT @ <https://builds.apache.org/job/james-server-trunk/ws/trunk/queue-jms/pom.xml,>
MavenProject: org.apache.james:james-server-queue-activemq:3.0-beta5-SNAPSHOT @ <https://builds.apache.org/job/james-server-trunk/ws/trunk/queue-activemq/pom.xml,>
MavenProject: org.apache.james:james-server-cli:3.0-beta5-SNAPSHOT @ <https://builds.apache.org/job/james-server-trunk/ws/trunk/cli/pom.xml]>
[JENKINS] Archiving <https://builds.apache.org/job/james-server-trunk/ws/trunk/data-file/pom.xml>
to /home/hudson/hudson/jobs/james-server-trunk/modules/org.apache.james$james-server-data-file/builds/2012-09-01_11-33-18/archive/org.apache.james/james-server-data-file/3.0-beta5-SNAPSHOT/james-server-data-file-3.0-beta5-SNAPSHOT.pom
[JENKINS] Archiving <https://builds.apache.org/job/james-server-trunk/ws/trunk/protocols-lmtp/pom.xml>
to /home/hudson/hudson/jobs/james-server-trunk/modules/org.apache.james$james-server-protocols-lmtp/builds/2012-09-01_11-33-19/archive/org.apache.james/james-server-protocols-lmtp/3.0-beta5-SNAPSHOT/james-server-protocols-lmtp-3.0-beta5-SNAPSHOT.pom
[JENKINS] Archiving <https://builds.apache.org/job/james-server-trunk/ws/trunk/data-jcr/pom.xml>
to /home/hudson/hudson/jobs/james-server-trunk/modules/org.apache.james$james-server-data-jcr/builds/2012-09-01_11-33-18/archive/org.apache.james/james-server-data-jcr/3.0-beta5-SNAPSHOT/james-server-data-jcr-3.0-beta5-SNAPSHOT.pom
[JENKINS] Archiving <https://builds.apache.org/job/james-server-trunk/ws/trunk/fetchmail/pom.xml>
to /home/hudson/hudson/jobs/james-server-trunk/modules/org.apache.james$james-server-fetchmail/builds/2012-09-01_11-33-18/archive/org.apache.james/james-server-fetchmail/3.0-beta5-SNAPSHOT/james-server-fetchmail-3.0-beta5-SNAPSHOT.pom
[JENKINS] Archiving <https://builds.apache.org/job/james-server-trunk/ws/trunk/fetchmail/target/james-server-fetchmail-3.0-beta5-SNAPSHOT.jar>
to /home/hudson/hudson/jobs/james-server-trunk/modules/org.apache.james$james-server-fetchmail/builds/2012-09-01_11-33-18/archive/org.apache.james/james-server-fetchmail/3.0-beta5-20120901.113619-484/james-server-fetchmail-3.0-beta5-20120901.113619-484.jar
[JENKINS] Archiving <https://builds.apache.org/job/james-server-trunk/ws/trunk/fetchmail/target/james-server-fetchmail-3.0-beta5-SNAPSHOT-tests.jar>
to /home/hudson/hudson/jobs/james-server-trunk/modules/org.apache.james$james-server-fetchmail/builds/2012-09-01_11-33-18/archive/org.apache.james/james-server-fetchmail/3.0-beta5-20120901.113619-484/james-server-fetchmail-3.0-beta5-20120901.113619-484-tests.jar
[JENKINS] Archiving <https://builds.apache.org/job/james-server-trunk/ws/trunk/data-jdbc/pom.xml>
to /home/hudson/hudson/jobs/james-server-trunk/modules/org.apache.james$james-server-data-jdbc/builds/2012-09-01_11-33-18/archive/org.apache.james/james-server-data-jdbc/3.0-beta5-SNAPSHOT/james-server-data-jdbc-3.0-beta5-SNAPSHOT.pom
[JENKINS] Archiving <https://builds.apache.org/job/james-server-trunk/ws/trunk/dnsservice-api/pom.xml>
to /home/hudson/hudson/jobs/james-server-trunk/modules/org.apache.james$james-server-dnsservice-api/builds/2012-09-01_11-33-17/archive/org.apache.james/james-server-dnsservice-api/3.0-beta5-SNAPSHOT/james-server-dnsservice-api-3.0-beta5-SNAPSHOT.pom
[JENKINS] Archiving <https://builds.apache.org/job/james-server-trunk/ws/trunk/dnsservice-api/target/james-server-dnsservice-api-3.0-beta5-SNAPSHOT.jar>
to /home/hudson/hudson/jobs/james-server-trunk/modules/org.apache.james$james-server-dnsservice-api/builds/2012-09-01_11-33-17/archive/org.apache.james/james-server-dnsservice-api/3.0-beta5-20120901.113551-484/james-server-dnsservice-api-3.0-beta5-20120901.113551-484.jar
[JENKINS] Archiving <https://builds.apache.org/job/james-server-trunk/ws/trunk/dnsservice-api/target/james-server-dnsservice-api-3.0-beta5-SNAPSHOT-tests.jar>
to /home/hudson/hudson/jobs/james-server-trunk/modules/org.apache.james$james-server-dnsservice-api/builds/2012-09-01_11-33-17/archive/org.apache.james/james-server-dnsservice-api/3.0-beta5-20120901.113551-484/james-server-dnsservice-api-3.0-beta5-20120901.113551-484-tests.jar
[JENKINS] Archiving <https://builds.apache.org/job/james-server-trunk/ws/trunk/pom.xml>
to /home/hudson/hudson/jobs/james-server-trunk/modules/org.apache.james$james-server/builds/2012-09-01_11-33-17/archive/org.apache.james/james-server/3.0-beta5-SNAPSHOT/james-server-3.0-beta5-SNAPSHOT.pom
[JENKINS] Archiving <https://builds.apache.org/job/james-server-trunk/ws/trunk/target/james-server-3.0-beta5-SNAPSHOT-site.xml>
to /home/hudson/hudson/jobs/james-server-trunk/modules/org.apache.james$james-server/builds/2012-09-01_11-33-17/archive/org.apache.james/james-server/3.0-beta5-20120901.113400-487/james-server-3.0-beta5-20120901.113400-487-site.xml
[JENKINS] Archiving <https://builds.apache.org/job/james-server-trunk/ws/trunk/data-api/pom.xml>
to /home/hudson/hudson/jobs/james-server-trunk/modules/org.apache.james$james-server-data-api/builds/2012-09-01_11-33-18/archive/org.apache.james/james-server-data-api/3.0-beta5-SNAPSHOT/james-server-data-api-3.0-beta5-SNAPSHOT.pom
[JENKINS] Archiving <https://builds.apache.org/job/james-server-trunk/ws/trunk/data-api/target/james-server-data-api-3.0-beta5-SNAPSHOT.jar>
to /home/hudson/hudson/jobs/james-server-trunk/modules/org.apache.james$james-server-data-api/builds/2012-09-01_11-33-18/archive/org.apache.james/james-server-data-api/3.0-beta5-20120901.113425-487/james-server-data-api-3.0-beta5-20120901.113425-487.jar
[JENKINS] Archiving <https://builds.apache.org/job/james-server-trunk/ws/trunk/data-api/target/james-server-data-api-3.0-beta5-SNAPSHOT-tests.jar>
to /home/hudson/hudson/jobs/james-server-trunk/modules/org.apache.james$james-server-data-api/builds/2012-09-01_11-33-18/archive/org.apache.james/james-server-data-api/3.0-beta5-20120901.113425-487/james-server-data-api-3.0-beta5-20120901.113425-487-tests.jar
[JENKINS] Archiving <https://builds.apache.org/job/james-server-trunk/ws/trunk/container-spring/pom.xml>
to /home/hudson/hudson/jobs/james-server-trunk/modules/org.apache.james$james-server-container-spring/builds/2012-09-01_11-33-17/archive/org.apache.james/james-server-container-spring/3.0-beta5-SNAPSHOT/james-server-container-spring-3.0-beta5-SNAPSHOT.pom
[JENKINS] Archiving <https://builds.apache.org/job/james-server-trunk/ws/trunk/container-spring/target/james-server-container-spring-3.0-beta5-SNAPSHOT.jar>
to /home/hudson/hudson/jobs/james-server-trunk/modules/org.apache.james$james-server-container-spring/builds/2012-09-01_11-33-17/archive/org.apache.james/james-server-container-spring/3.0-beta5-20120901.113544-484/james-server-container-spring-3.0-beta5-20120901.113544-484.jar
[JENKINS] Archiving <https://builds.apache.org/job/james-server-trunk/ws/trunk/container-spring/target/james-server-container-spring-3.0-beta5-SNAPSHOT-tests.jar>
to /home/hudson/hudson/jobs/james-server-trunk/modules/org.apache.james$james-server-container-spring/builds/2012-09-01_11-33-17/archive/org.apache.james/james-server-container-spring/3.0-beta5-20120901.113544-484/james-server-container-spring-3.0-beta5-20120901.113544-484-tests.jar
[JENKINS] Archiving <https://builds.apache.org/job/james-server-trunk/ws/trunk/protocols-library/pom.xml>
to /home/hudson/hudson/jobs/james-server-trunk/modules/org.apache.james$james-server-protocols-library/builds/2012-09-01_11-33-19/archive/org.apache.james/james-server-protocols-library/3.0-beta5-SNAPSHOT/james-server-protocols-library-3.0-beta5-SNAPSHOT.pom
[JENKINS] Archiving <https://builds.apache.org/job/james-server-trunk/ws/trunk/protocols-library/target/james-server-protocols-library-3.0-beta5-SNAPSHOT.jar>
to /home/hudson/hudson/jobs/james-server-trunk/modules/org.apache.james$james-server-protocols-library/builds/2012-09-01_11-33-19/archive/org.apache.james/james-server-protocols-library/3.0-beta5-20120901.113508-484/james-server-protocols-library-3.0-beta5-20120901.113508-484.jar
[JENKINS] Archiving <https://builds.apache.org/job/james-server-trunk/ws/trunk/protocols-library/target/james-server-protocols-library-3.0-beta5-SNAPSHOT-tests.jar>
to /home/hudson/hudson/jobs/james-server-trunk/modules/org.apache.james$james-server-protocols-library/builds/2012-09-01_11-33-19/archive/org.apache.james/james-server-protocols-library/3.0-beta5-20120901.113508-484/james-server-protocols-library-3.0-beta5-20120901.113508-484-tests.jar
[JENKINS] Archiving <https://builds.apache.org/job/james-server-trunk/ws/trunk/dnsservice-library/pom.xml>
to /home/hudson/hudson/jobs/james-server-trunk/modules/org.apache.james$james-server-dnsservice-library/builds/2012-09-01_11-33-18/archive/org.apache.james/james-server-dnsservice-library/3.0-beta5-SNAPSHOT/james-server-dnsservice-library-3.0-beta5-SNAPSHOT.pom
[JENKINS] Archiving <https://builds.apache.org/job/james-server-trunk/ws/trunk/dnsservice-library/target/james-server-dnsservice-library-3.0-beta5-SNAPSHOT.jar>
to /home/hudson/hudson/jobs/james-server-trunk/modules/org.apache.james$james-server-dnsservice-library/builds/2012-09-01_11-33-18/archive/org.apache.james/james-server-dnsservice-library/3.0-beta5-20120901.113608-484/james-server-dnsservice-library-3.0-beta5-20120901.113608-484.jar
[JENKINS] Archiving <https://builds.apache.org/job/james-server-trunk/ws/trunk/dnsservice-library/target/james-server-dnsservice-library-3.0-beta5-SNAPSHOT-tests.jar>
to /home/hudson/hudson/jobs/james-server-trunk/modules/org.apache.james$james-server-dnsservice-library/builds/2012-09-01_11-33-18/archive/org.apache.james/james-server-dnsservice-library/3.0-beta5-20120901.113608-484/james-server-dnsservice-library-3.0-beta5-20120901.113608-484-tests.jar
[JENKINS] Archiving <https://builds.apache.org/job/james-server-trunk/ws/trunk/util/pom.xml>
to /home/hudson/hudson/jobs/james-server-trunk/modules/org.apache.james$james-server-util/builds/2012-09-01_11-33-19/archive/org.apache.james/james-server-util/3.0-beta5-SNAPSHOT/james-server-util-3.0-beta5-SNAPSHOT.pom
[JENKINS] Archiving <https://builds.apache.org/job/james-server-trunk/ws/trunk/util/target/james-server-util-3.0-beta5-SNAPSHOT.jar>
to /home/hudson/hudson/jobs/james-server-trunk/modules/org.apache.james$james-server-util/builds/2012-09-01_11-33-19/archive/org.apache.james/james-server-util/3.0-beta5-20120901.113458-484/james-server-util-3.0-beta5-20120901.113458-484.jar
[JENKINS] Archiving <https://builds.apache.org/job/james-server-trunk/ws/trunk/util/target/james-server-util-3.0-beta5-SNAPSHOT-tests.jar>
to /home/hudson/hudson/jobs/james-server-trunk/modules/org.apache.james$james-server-util/builds/2012-09-01_11-33-19/archive/org.apache.james/james-server-util/3.0-beta5-20120901.113458-484/james-server-util-3.0-beta5-20120901.113458-484-tests.jar
[JENKINS] Archiving <https://builds.apache.org/job/james-server-trunk/ws/trunk/protocols-pop3/pom.xml>
to /home/hudson/hudson/jobs/james-server-trunk/modules/org.apache.james$james-server-protocols-pop3/builds/2012-09-01_11-33-19/archive/org.apache.james/james-server-protocols-pop3/3.0-beta5-SNAPSHOT/james-server-protocols-pop3-3.0-beta5-SNAPSHOT.pom
[JENKINS] Archiving <https://builds.apache.org/job/james-server-trunk/ws/trunk/mailets/pom.xml>
to /home/hudson/hudson/jobs/james-server-trunk/modules/org.apache.james$james-server-mailets/builds/2012-09-01_11-33-19/archive/org.apache.james/james-server-mailets/3.0-beta5-SNAPSHOT/james-server-mailets-3.0-beta5-SNAPSHOT.pom
[JENKINS] Archiving <https://builds.apache.org/job/james-server-trunk/ws/trunk/cli/pom.xml>
to /home/hudson/hudson/jobs/james-server-trunk/modules/org.apache.james$james-server-cli/builds/2012-09-01_11-33-19/archive/org.apache.james/james-server-cli/3.0-beta5-SNAPSHOT/james-server-cli-3.0-beta5-SNAPSHOT.pom
[JENKINS] Archiving <https://builds.apache.org/job/james-server-trunk/ws/trunk/queue-file/pom.xml>
to /home/hudson/hudson/jobs/james-server-trunk/modules/org.apache.james$james-server-queue-file/builds/2012-09-01_11-33-19/archive/org.apache.james/james-server-queue-file/3.0-beta5-SNAPSHOT/james-server-queue-file-3.0-beta5-SNAPSHOT.pom
[JENKINS] Archiving <https://builds.apache.org/job/james-server-trunk/ws/trunk/protocols-smtp/pom.xml>
to /home/hudson/hudson/jobs/james-server-trunk/modules/org.apache.james$james-server-protocols-smtp/builds/2012-09-01_11-33-19/archive/org.apache.james/james-server-protocols-smtp/3.0-beta5-SNAPSHOT/james-server-protocols-smtp-3.0-beta5-SNAPSHOT.pom
[JENKINS] Archiving <https://builds.apache.org/job/james-server-trunk/ws/trunk/lifecycle-api/pom.xml>
to /home/hudson/hudson/jobs/james-server-trunk/modules/org.apache.james$james-server-lifecycle-api/builds/2012-09-01_11-33-18/archive/org.apache.james/james-server-lifecycle-api/3.0-beta5-SNAPSHOT/james-server-lifecycle-api-3.0-beta5-SNAPSHOT.pom
[JENKINS] Archiving <https://builds.apache.org/job/james-server-trunk/ws/trunk/lifecycle-api/target/james-server-lifecycle-api-3.0-beta5-SNAPSHOT.jar>
to /home/hudson/hudson/jobs/james-server-trunk/modules/org.apache.james$james-server-lifecycle-api/builds/2012-09-01_11-33-18/archive/org.apache.james/james-server-lifecycle-api/3.0-beta5-20120901.113409-487/james-server-lifecycle-api-3.0-beta5-20120901.113409-487.jar
[JENKINS] Archiving <https://builds.apache.org/job/james-server-trunk/ws/trunk/lifecycle-api/target/james-server-lifecycle-api-3.0-beta5-SNAPSHOT-tests.jar>
to /home/hudson/hudson/jobs/james-server-trunk/modules/org.apache.james$james-server-lifecycle-api/builds/2012-09-01_11-33-18/archive/org.apache.james/james-server-lifecycle-api/3.0-beta5-20120901.113409-487/james-server-lifecycle-api-3.0-beta5-20120901.113409-487-tests.jar
[JENKINS] Archiving <https://builds.apache.org/job/james-server-trunk/ws/trunk/protocols-imap4/pom.xml>
to /home/hudson/hudson/jobs/james-server-trunk/modules/org.apache.james$james-server-protocols-imap4/builds/2012-09-01_11-33-19/archive/org.apache.james/james-server-protocols-imap4/3.0-beta5-SNAPSHOT/james-server-protocols-imap4-3.0-beta5-SNAPSHOT.pom
[JENKINS] Archiving <https://builds.apache.org/job/james-server-trunk/ws/trunk/filesystem-api/pom.xml>
to /home/hudson/hudson/jobs/james-server-trunk/modules/org.apache.james$james-server-filesystem-api/builds/2012-09-01_11-33-18/archive/org.apache.james/james-server-filesystem-api/3.0-beta5-SNAPSHOT/james-server-filesystem-api-3.0-beta5-SNAPSHOT.pom
[JENKINS] Archiving <https://builds.apache.org/job/james-server-trunk/ws/trunk/filesystem-api/target/james-server-filesystem-api-3.0-beta5-SNAPSHOT.jar>
to /home/hudson/hudson/jobs/james-server-trunk/modules/org.apache.james$james-server-filesystem-api/builds/2012-09-01_11-33-18/archive/org.apache.james/james-server-filesystem-api/3.0-beta5-20120901.113417-487/james-server-filesystem-api-3.0-beta5-20120901.113417-487.jar
[JENKINS] Archiving <https://builds.apache.org/job/james-server-trunk/ws/trunk/filesystem-api/target/james-server-filesystem-api-3.0-beta5-SNAPSHOT-tests.jar>
to /home/hudson/hudson/jobs/james-server-trunk/modules/org.apache.james$james-server-filesystem-api/builds/2012-09-01_11-33-18/archive/org.apache.james/james-server-filesystem-api/3.0-beta5-20120901.113417-487/james-server-filesystem-api-3.0-beta5-20120901.113417-487-tests.jar
[JENKINS] Archiving <https://builds.apache.org/job/james-server-trunk/ws/trunk/data-hbase/pom.xml>
to /home/hudson/hudson/jobs/james-server-trunk/modules/org.apache.james$james-server-data-hbase/builds/2012-09-01_11-33-18/archive/org.apache.james/james-server-data-hbase/3.0-beta5-SNAPSHOT/james-server-data-hbase-3.0-beta5-SNAPSHOT.pom
[JENKINS] Archiving <https://builds.apache.org/job/james-server-trunk/ws/trunk/data-ldap/pom.xml>
to /home/hudson/hudson/jobs/james-server-trunk/modules/org.apache.james$james-server-data-ldap/builds/2012-09-01_11-33-18/archive/org.apache.james/james-server-data-ldap/3.0-beta5-SNAPSHOT/james-server-data-ldap-3.0-beta5-SNAPSHOT.pom
[JENKINS] Archiving <https://builds.apache.org/job/james-server-trunk/ws/trunk/queue-api/pom.xml>
to /home/hudson/hudson/jobs/james-server-trunk/modules/org.apache.james$james-server-queue-api/builds/2012-09-01_11-33-19/archive/org.apache.james/james-server-queue-api/3.0-beta5-SNAPSHOT/james-server-queue-api-3.0-beta5-SNAPSHOT.pom
[JENKINS] Archiving <https://builds.apache.org/job/james-server-trunk/ws/trunk/queue-api/target/james-server-queue-api-3.0-beta5-SNAPSHOT.jar>
to /home/hudson/hudson/jobs/james-server-trunk/modules/org.apache.james$james-server-queue-api/builds/2012-09-01_11-33-19/archive/org.apache.james/james-server-queue-api/3.0-beta5-20120901.113613-484/james-server-queue-api-3.0-beta5-20120901.113613-484.jar
[JENKINS] Archiving <https://builds.apache.org/job/james-server-trunk/ws/trunk/queue-api/target/james-server-queue-api-3.0-beta5-SNAPSHOT-tests.jar>
to /home/hudson/hudson/jobs/james-server-trunk/modules/org.apache.james$james-server-queue-api/builds/2012-09-01_11-33-19/archive/org.apache.james/james-server-queue-api/3.0-beta5-20120901.113613-484/james-server-queue-api-3.0-beta5-20120901.113613-484-tests.jar
[JENKINS] Archiving <https://builds.apache.org/job/james-server-trunk/ws/trunk/mailetcontainer-camel/pom.xml>
to /home/hudson/hudson/jobs/james-server-trunk/modules/org.apache.james$james-server-mailetcontainer-camel/builds/2012-09-01_11-33-18/archive/org.apache.james/james-server-mailetcontainer-camel/3.0-beta5-SNAPSHOT/james-server-mailetcontainer-camel-3.0-beta5-SNAPSHOT.pom
[JENKINS] Archiving <https://builds.apache.org/job/james-server-trunk/ws/trunk/queue-activemq/pom.xml>
to /home/hudson/hudson/jobs/james-server-trunk/modules/org.apache.james$james-server-queue-activemq/builds/2012-09-01_11-33-19/archive/org.apache.james/james-server-queue-activemq/3.0-beta5-SNAPSHOT/james-server-queue-activemq-3.0-beta5-SNAPSHOT.pom
[JENKINS] Archiving <https://builds.apache.org/job/james-server-trunk/ws/trunk/mailetcontainer-api/pom.xml>
to /home/hudson/hudson/jobs/james-server-trunk/modules/org.apache.james$james-server-mailetcontainer-api/builds/2012-09-01_11-33-18/archive/org.apache.james/james-server-mailetcontainer-api/3.0-beta5-SNAPSHOT/james-server-mailetcontainer-api-3.0-beta5-SNAPSHOT.pom
[JENKINS] Archiving <https://builds.apache.org/job/james-server-trunk/ws/trunk/mailetcontainer-api/target/james-server-mailetcontainer-api-3.0-beta5-SNAPSHOT.jar>
to /home/hudson/hudson/jobs/james-server-trunk/modules/org.apache.james$james-server-mailetcontainer-api/builds/2012-09-01_11-33-18/archive/org.apache.james/james-server-mailetcontainer-api/3.0-beta5-20120901.113441-484/james-server-mailetcontainer-api-3.0-beta5-20120901.113441-484.jar
[JENKINS] Archiving <https://builds.apache.org/job/james-server-trunk/ws/trunk/mailetcontainer-api/target/james-server-mailetcontainer-api-3.0-beta5-SNAPSHOT-tests.jar>
to /home/hudson/hudson/jobs/james-server-trunk/modules/org.apache.james$james-server-mailetcontainer-api/builds/2012-09-01_11-33-18/archive/org.apache.james/james-server-mailetcontainer-api/3.0-beta5-20120901.113441-484/james-server-mailetcontainer-api-3.0-beta5-20120901.113441-484-tests.jar
[JENKINS] Archiving <https://builds.apache.org/job/james-server-trunk/ws/trunk/data-library/pom.xml>
to /home/hudson/hudson/jobs/james-server-trunk/modules/org.apache.james$james-server-data-library/builds/2012-09-01_11-33-18/archive/org.apache.james/james-server-data-library/3.0-beta5-SNAPSHOT/james-server-data-library-3.0-beta5-SNAPSHOT.pom
[JENKINS] Archiving <https://builds.apache.org/job/james-server-trunk/ws/trunk/data-library/target/james-server-data-library-3.0-beta5-SNAPSHOT.jar>
to /home/hudson/hudson/jobs/james-server-trunk/modules/org.apache.james$james-server-data-library/builds/2012-09-01_11-33-18/archive/org.apache.james/james-server-data-library/3.0-beta5-20120901.113627-484/james-server-data-library-3.0-beta5-20120901.113627-484.jar
[JENKINS] Archiving <https://builds.apache.org/job/james-server-trunk/ws/trunk/data-library/target/james-server-data-library-3.0-beta5-SNAPSHOT-tests.jar>
to /home/hudson/hudson/jobs/james-server-trunk/modules/org.apache.james$james-server-data-library/builds/2012-09-01_11-33-18/archive/org.apache.james/james-server-data-library/3.0-beta5-20120901.113627-484/james-server-data-library-3.0-beta5-20120901.113627-484-tests.jar
[JENKINS] Archiving <https://builds.apache.org/job/james-server-trunk/ws/trunk/dnsservice-dnsjava/pom.xml>
to /home/hudson/hudson/jobs/james-server-trunk/modules/org.apache.james$james-server-dnsservice-dnsjava/builds/2012-09-01_11-33-17/archive/org.apache.james/james-server-dnsservice-dnsjava/3.0-beta5-SNAPSHOT/james-server-dnsservice-dnsjava-3.0-beta5-SNAPSHOT.pom
[JENKINS] Archiving <https://builds.apache.org/job/james-server-trunk/ws/trunk/dnsservice-dnsjava/target/james-server-dnsservice-dnsjava-3.0-beta5-SNAPSHOT.jar>
to /home/hudson/hudson/jobs/james-server-trunk/modules/org.apache.james$james-server-dnsservice-dnsjava/builds/2012-09-01_11-33-17/archive/org.apache.james/james-server-dnsservice-dnsjava/3.0-beta5-20120901.113559-484/james-server-dnsservice-dnsjava-3.0-beta5-20120901.113559-484.jar
[JENKINS] Archiving <https://builds.apache.org/job/james-server-trunk/ws/trunk/dnsservice-dnsjava/target/james-server-dnsservice-dnsjava-3.0-beta5-SNAPSHOT-tests.jar>
to /home/hudson/hudson/jobs/james-server-trunk/modules/org.apache.james$james-server-dnsservice-dnsjava/builds/2012-09-01_11-33-17/archive/org.apache.james/james-server-dnsservice-dnsjava/3.0-beta5-20120901.113559-484/james-server-dnsservice-dnsjava-3.0-beta5-20120901.113559-484-tests.jar
[JENKINS] Archiving <https://builds.apache.org/job/james-server-trunk/ws/trunk/queue-jms/pom.xml>
to /home/hudson/hudson/jobs/james-server-trunk/modules/org.apache.james$james-server-queue-jms/builds/2012-09-01_11-33-19/archive/org.apache.james/james-server-queue-jms/3.0-beta5-SNAPSHOT/james-server-queue-jms-3.0-beta5-SNAPSHOT.pom
[JENKINS] Archiving <https://builds.apache.org/job/james-server-trunk/ws/trunk/core/pom.xml>
to /home/hudson/hudson/jobs/james-server-trunk/modules/org.apache.james$james-server-core/builds/2012-09-01_11-33-17/archive/org.apache.james/james-server-core/3.0-beta5-SNAPSHOT/james-server-core-3.0-beta5-SNAPSHOT.pom
[JENKINS] Archiving <https://builds.apache.org/job/james-server-trunk/ws/trunk/core/target/james-server-core-3.0-beta5-SNAPSHOT.jar>
to /home/hudson/hudson/jobs/james-server-trunk/modules/org.apache.james$james-server-core/builds/2012-09-01_11-33-17/archive/org.apache.james/james-server-core/3.0-beta5-20120901.113526-484/james-server-core-3.0-beta5-20120901.113526-484.jar
[JENKINS] Archiving <https://builds.apache.org/job/james-server-trunk/ws/trunk/core/target/james-server-core-3.0-beta5-SNAPSHOT-tests.jar>
to /home/hudson/hudson/jobs/james-server-trunk/modules/org.apache.james$james-server-core/builds/2012-09-01_11-33-17/archive/org.apache.james/james-server-core/3.0-beta5-20120901.113526-484/james-server-core-3.0-beta5-20120901.113526-484-tests.jar
[JENKINS] Archiving <https://builds.apache.org/job/james-server-trunk/ws/trunk/mailbox-adapter/pom.xml>
to /home/hudson/hudson/jobs/james-server-trunk/modules/org.apache.james$james-server-mailbox-adapter/builds/2012-09-01_11-33-18/archive/org.apache.james/james-server-mailbox-adapter/3.0-beta5-SNAPSHOT/james-server-mailbox-adapter-3.0-beta5-SNAPSHOT.pom
[JENKINS] Archiving <https://builds.apache.org/job/james-server-trunk/ws/trunk/lifecycle-spring/pom.xml>
to /home/hudson/hudson/jobs/james-server-trunk/modules/org.apache.james$james-server-lifecycle-spring/builds/2012-09-01_11-33-18/archive/org.apache.james/james-server-lifecycle-spring/3.0-beta5-SNAPSHOT/james-server-lifecycle-spring-3.0-beta5-SNAPSHOT.pom
[JENKINS] Archiving <https://builds.apache.org/job/james-server-trunk/ws/trunk/lifecycle-spring/target/james-server-lifecycle-spring-3.0-beta5-SNAPSHOT.jar>
to /home/hudson/hudson/jobs/james-server-trunk/modules/org.apache.james$james-server-lifecycle-spring/builds/2012-09-01_11-33-18/archive/org.apache.james/james-server-lifecycle-spring/3.0-beta5-20120901.113434-484/james-server-lifecycle-spring-3.0-beta5-20120901.113434-484.jar
[JENKINS] Archiving <https://builds.apache.org/job/james-server-trunk/ws/trunk/lifecycle-spring/target/james-server-lifecycle-spring-3.0-beta5-SNAPSHOT-tests.jar>
to /home/hudson/hudson/jobs/james-server-trunk/modules/org.apache.james$james-server-lifecycle-spring/builds/2012-09-01_11-33-18/archive/org.apache.james/james-server-lifecycle-spring/3.0-beta5-20120901.113434-484/james-server-lifecycle-spring-3.0-beta5-20120901.113434-484-tests.jar
[JENKINS] Archiving <https://builds.apache.org/job/james-server-trunk/ws/trunk/data-jpa/pom.xml>
to /home/hudson/hudson/jobs/james-server-trunk/modules/org.apache.james$james-server-data-jpa/builds/2012-09-01_11-33-18/archive/org.apache.james/james-server-data-jpa/3.0-beta5-SNAPSHOT/james-server-data-jpa-3.0-beta5-SNAPSHOT.pom
Waiting for Jenkins to finish collecting data
mavenExecutionResult exceptions not empty
message : Failed to execute goal org.apache.maven.plugins:maven-surefire-plugin:2.10:test
(default-test) on project james-server-data-hbase: There are test failures.

Please refer to <https://builds.apache.org/job/james-server-trunk/ws/trunk/data-hbase/target/surefire-reports>
for the individual test results.
cause : There are test failures.

Please refer to <https://builds.apache.org/job/james-server-trunk/ws/trunk/data-hbase/target/surefire-reports>
for the individual test results.
Stack trace : 
org.apache.maven.lifecycle.LifecycleExecutionException: Failed to execute goal org.apache.maven.plugins:maven-surefire-plugin:2.10:test
(default-test) on project james-server-data-hbase: There are test failures.

Please refer to <https://builds.apache.org/job/james-server-trunk/ws/trunk/data-hbase/target/surefire-reports>
for the individual test results.
	at org.apache.maven.lifecycle.internal.MojoExecutor.execute(MojoExecutor.java:213)
	at org.apache.maven.lifecycle.internal.MojoExecutor.execute(MojoExecutor.java:153)
	at org.apache.maven.lifecycle.internal.MojoExecutor.execute(MojoExecutor.java:145)
	at org.apache.maven.lifecycle.internal.LifecycleModuleBuilder.buildProject(LifecycleModuleBuilder.java:84)
	at org.apache.maven.lifecycle.internal.LifecycleModuleBuilder.buildProject(LifecycleModuleBuilder.java:59)
	at org.apache.maven.lifecycle.internal.LifecycleStarter.singleThreadedBuild(LifecycleStarter.java:183)
	at org.apache.maven.lifecycle.internal.LifecycleStarter.execute(LifecycleStarter.java:161)
	at org.apache.maven.DefaultMaven.doExecute(DefaultMaven.java:319)
	at org.apache.maven.DefaultMaven.execute(DefaultMaven.java:156)
	at org.jvnet.hudson.maven3.launcher.Maven3Launcher.main(Maven3Launcher.java:79)
	at sun.reflect.NativeMethodAccessorImpl.invoke0(Native Method)
	at sun.reflect.NativeMethodAccessorImpl.invoke(NativeMethodAccessorImpl.java:39)
	at sun.reflect.DelegatingMethodAccessorImpl.invoke(DelegatingMethodAccessorImpl.java:25)
	at java.lang.reflect.Method.invoke(Method.java:597)
	at org.codehaus.plexus.classworlds.launcher.Launcher.launchStandard(Launcher.java:329)
	at org.codehaus.plexus.classworlds.launcher.Launcher.launch(Launcher.java:239)
	at org.jvnet.hudson.maven3.agent.Maven3Main.launch(Maven3Main.java:158)
	at hudson.maven.Maven3Builder.call(Maven3Builder.java:98)
	at hudson.maven.Maven3Builder.call(Maven3Builder.java:64)
	at hudson.remoting.UserRequest.perform(UserRequest.java:118)
	at hudson.remoting.UserRequest.perform(UserRequest.java:48)
	at hudson.remoting.Request$2.run(Request.java:326)
	at hudson.remoting.InterceptingExecutorService$1.call(InterceptingExecutorService.java:72)
	at java.util.concurrent.FutureTask$Sync.innerRun(FutureTask.java:303)
	at java.util.concurrent.FutureTask.run(FutureTask.java:138)
	at java.util.concurrent.ThreadPoolExecutor$Worker.runTask(ThreadPoolExecutor.java:886)
	at java.util.concurrent.ThreadPoolExecutor$Worker.run(ThreadPoolExecutor.java:908)
	at java.lang.Thread.run(Thread.java:662)
Caused by: org.apache.maven.plugin.MojoFailureException: There are test failures.

Please refer to <https://builds.apache.org/job/james-server-trunk/ws/trunk/data-hbase/target/surefire-reports>
for the individual test results.
	at org.apache.maven.plugin.surefire.SurefireHelper.reportExecution(SurefireHelper.java:87)
	at org.apache.maven.plugin.surefire.SurefirePlugin.writeSummary(SurefirePlugin.java:641)
	at org.apache.maven.plugin.surefire.SurefirePlugin.handleSummary(SurefirePlugin.java:615)
	at org.apache.maven.plugin.surefire.AbstractSurefireMojo.executeAfterPreconditionsChecked(AbstractSurefireMojo.java:137)
	at org.apache.maven.plugin.surefire.AbstractSurefireMojo.execute(AbstractSurefireMojo.java:98)
	at org.apache.maven.plugin.DefaultBuildPluginManager.executeMojo(DefaultBuildPluginManager.java:101)
	at org.apache.maven.lifecycle.internal.MojoExecutor.execute(MojoExecutor.java:209)
	... 27 more
channel stopped

---------------------------------------------------------------------
To unsubscribe, e-mail: server-dev-unsubscribe@james.apache.org
For additional commands, e-mail: server-dev-help@james.apache.org


Mime
View raw message