james-server-dev mailing list archives

Site index · List index
Message view « Date » · « Thread »
Top « Date » · « Thread »
From Apache Jenkins Server <jenk...@builds.apache.org>
Subject Build failed in Jenkins: james-mailet #1998
Date Tue, 05 Mar 2013 16:53:10 GMT
See <https://builds.apache.org/job/james-mailet/1998/>

------------------------------------------
[...truncated 343 lines...]
Downloading: https://repository.apache.org/content/repositories/snapshots/org/apache/james/mailetdocs-maven-plugin/maven-metadata.xml
Downloaded: https://repository.apache.org/content/repositories/snapshots/org/apache/james/mailetdocs-maven-plugin/maven-metadata.xml
(399 B at 3.2 KB/sec)
Downloading: https://repository.apache.org/content/repositories/snapshots/org/apache/james/maven-metadata.xml
Downloaded: https://repository.apache.org/content/repositories/snapshots/org/apache/james/maven-metadata.xml
(398 B at 5.2 KB/sec)
Uploading: https://repository.apache.org/content/repositories/snapshots/org/apache/james/mailetdocs-maven-plugin/2.5.1-SNAPSHOT/maven-metadata.xml
Uploaded: https://repository.apache.org/content/repositories/snapshots/org/apache/james/mailetdocs-maven-plugin/2.5.1-SNAPSHOT/maven-metadata.xml
(792 B at 13.6 KB/sec)
Uploading: https://repository.apache.org/content/repositories/snapshots/org/apache/james/mailetdocs-maven-plugin/maven-metadata.xml
Uploaded: https://repository.apache.org/content/repositories/snapshots/org/apache/james/mailetdocs-maven-plugin/maven-metadata.xml
(399 B at 4.1 KB/sec)
Uploading: https://repository.apache.org/content/repositories/snapshots/org/apache/james/maven-metadata.xml
Uploaded: https://repository.apache.org/content/repositories/snapshots/org/apache/james/maven-metadata.xml
(398 B at 7.8 KB/sec)
[INFO]                                                                         
[INFO] ------------------------------------------------------------------------
[INFO] Building Apache James :: Crypto Mailets 2.5.1-SNAPSHOT
[INFO] ------------------------------------------------------------------------
[INFO] 
[INFO] --- maven-clean-plugin:2.4.1:clean (default-clean) @ apache-mailet-crypto ---
[INFO] Deleting F:\hudson\hudson-slave\workspace\james-mailet\trunk\crypto\target
[INFO] 
[INFO] --- maven-remote-resources-plugin:1.2.1:process (default) @ apache-mailet-crypto ---
[INFO] [debug] execute contextualize
[INFO] Using 'UTF-8' encoding to copy filtered resources.

[INFO] --- maven-resources-plugin:2.5:resources (default-resources) @ apache-mailet-crypto
---
[INFO] Copying 1 resource
[INFO] Copying 3 resources
[INFO] 
[INFO] --- maven-compiler-plugin:2.3.2:compile (default-compile) @ apache-mailet-crypto ---
[INFO] Compiling 14 source files to F:\hudson\hudson-slave\workspace\james-mailet\trunk\crypto\target\classes
[debug] execute contextualize
[INFO] [INFO] Using 'UTF-8' encoding to copy filtered resources.

[INFO] --- maven-resources-plugin:2.5:testResources (default-testResources) @ apache-mailet-crypto
---
[INFO] Copying 0 resource
[INFO] Copying 3 resources
[INFO] 
[INFO] --- maven-compiler-plugin:2.3.2:testCompile (default-testCompile) @ apache-mailet-crypto
---
[INFO] Nothing to compile - all classes are up to date
[INFO] 
[INFO] --- maven-surefire-plugin:2.10:test (default-test) @ apache-mailet-crypto ---
[INFO] Surefire report directory: F:\hudson\hudson-slave\workspace\james-mailet\trunk\crypto\target\surefire-reports

-------------------------------------------------------
 T E S T S
-------------------------------------------------------

-------------------------------------------------------
 T E S T S
-------------------------------------------------------

Results :

Tests run: 0, Failures: 0, Errors: 0, Skipped: 0

[JENKINS] Recording test results
[INFO] 
[INFO] --- maven-bundle-plugin:2.3.7:bundle (default-bundle) @ apache-mailet-crypto ---
[WARNING] Bundle org.apache.james:apache-mailet-crypto:bundle:2.5.1-SNAPSHOT : Instructions
in Export-Package that are never used: org\.apache\.james\.mailet\.crypto\..*|org\.apache\.james\.mailet\.crypto
Classpath: Jar:.,Jar:mail,Jar:activation,Jar:bcmail-jdk16,Jar:bcprov-jdk16,Jar:apache-mailet-base,Jar:apache-mailet-api

[WARNING] Bundle org.apache.james:apache-mailet-crypto:bundle:2.5.1-SNAPSHOT : Superfluous
export-package instructions: [org.apache.james.mailet.crypto.*]
[INFO] 
[INFO] --- maven-site-plugin:3.2:attach-descriptor (attach-descriptor) @ apache-mailet-crypto
---
[INFO] 
[INFO] --- apache-rat-plugin:0.8:check (default) @ apache-mailet-crypto ---
[INFO] Exclude: NOTICE.*
[INFO] Exclude: LICENSE.*
[INFO] Exclude: release.properties
[INFO] Exclude: dist/**/*
[INFO] Exclude: **/.*
[INFO] Exclude: .*/**/*
[INFO] Exclude: **/.*/**/*
[INFO] Exclude: **/LICENSE*
[INFO] Exclude: **/target/**
[INFO] Exclude: **/*.iml
[INFO] Exclude: src/site/**
[INFO] 
[INFO] --- maven-install-plugin:2.3.1:install (default-install) @ apache-mailet-crypto ---
[INFO] Installing F:\hudson\hudson-slave\workspace\james-mailet\trunk\crypto\target\apache-mailet-crypto-2.5.1-SNAPSHOT.jar
to f:\hudson\hudson-slave\maven-repositories\1\org\apache\james\apache-mailet-crypto\2.5.1-SNAPSHOT\apache-mailet-crypto-2.5.1-SNAPSHOT.jar
[INFO] Installing F:\hudson\hudson-slave\workspace\james-mailet\trunk\crypto\pom.xml to f:\hudson\hudson-slave\maven-repositories\1\org\apache\james\apache-mailet-crypto\2.5.1-SNAPSHOT\apache-mailet-crypto-2.5.1-SNAPSHOT.pom
[INFO] 
[INFO] --- maven-bundle-plugin:2.3.7:install (default-install) @ apache-mailet-crypto ---
[INFO] Installing org/apache/james/apache-mailet-crypto/2.5.1-SNAPSHOT/apache-mailet-crypto-2.5.1-SNAPSHOT.jar
[INFO] Writing OBR metadata
[INFO] Downloading: https://repository.apache.org/content/repositories/snapshots/org/apache/james/apache-mailet-crypto/2.5.1-SNAPSHOT/maven-metadata.xml

[INFO] --- maven-deploy-plugin:2.7:deploy (default-deploy) @ apache-mailet-crypto ---
Downloaded: https://repository.apache.org/content/repositories/snapshots/org/apache/james/apache-mailet-crypto/2.5.1-SNAPSHOT/maven-metadata.xml
(789 B at 1.4 KB/sec)
Uploading: https://repository.apache.org/content/repositories/snapshots/org/apache/james/apache-mailet-crypto/2.5.1-SNAPSHOT/apache-mailet-crypto-2.5.1-20130305.165248-78.jar
Uploaded: https://repository.apache.org/content/repositories/snapshots/org/apache/james/apache-mailet-crypto/2.5.1-SNAPSHOT/apache-mailet-crypto-2.5.1-20130305.165248-78.jar
(39 KB at 224.1 KB/sec)
Uploading: https://repository.apache.org/content/repositories/snapshots/org/apache/james/apache-mailet-crypto/2.5.1-SNAPSHOT/apache-mailet-crypto-2.5.1-20130305.165248-78.pom
Uploaded: https://repository.apache.org/content/repositories/snapshots/org/apache/james/apache-mailet-crypto/2.5.1-SNAPSHOT/apache-mailet-crypto-2.5.1-20130305.165248-78.pom
(3 KB at 60.2 KB/sec)
Downloading: https://repository.apache.org/content/repositories/snapshots/org/apache/james/apache-mailet-crypto/maven-metadata.xml
Downloaded: https://repository.apache.org/content/repositories/snapshots/org/apache/james/apache-mailet-crypto/maven-metadata.xml
(396 B at 4.6 KB/sec)
Uploading: https://repository.apache.org/content/repositories/snapshots/org/apache/james/apache-mailet-crypto/2.5.1-SNAPSHOT/maven-metadata.xml
Uploaded: https://repository.apache.org/content/repositories/snapshots/org/apache/james/apache-mailet-crypto/2.5.1-SNAPSHOT/maven-metadata.xml
(789 B at 14.0 KB/sec)
Uploading: https://repository.apache.org/content/repositories/snapshots/org/apache/james/apache-mailet-crypto/maven-metadata.xml
Uploaded: https://repository.apache.org/content/repositories/snapshots/org/apache/james/apache-mailet-crypto/maven-metadata.xml
(396 B at 4.5 KB/sec)
[INFO] [INFO] Remote OBR update disabled (enable with -DremoteOBR)

[INFO] --- maven-bundle-plugin:2.3.7:deploy (default-deploy) @ apache-mailet-crypto ---
[INFO]                                                                         
[INFO] ------------------------------------------------------------------------
[INFO] Building Apache James :: Standard Mailets 2.5.1-SNAPSHOT
[INFO] ------------------------------------------------------------------------
[INFO] 
[INFO] --- maven-clean-plugin:2.4.1:clean (default-clean) @ apache-mailet-standard ---
[INFO] Deleting F:\hudson\hudson-slave\workspace\james-mailet\trunk\standard\target
[INFO] 
[INFO] --- maven-remote-resources-plugin:1.2.1:process (default) @ apache-mailet-standard
---
[INFO] [debug] execute contextualize

[INFO] Using 'UTF-8' encoding to copy filtered resources.
[INFO] skip non existing resourceDirectory F:\hudson\hudson-slave\workspace\james-mailet\trunk\standard\src\main\resources
[INFO] --- maven-resources-plugin:2.5:resources (default-resources) @ apache-mailet-standard
---
[INFO] Copying 3 resources
[INFO] 
[INFO] --- maven-compiler-plugin:2.3.2:compile (default-compile) @ apache-mailet-standard
---
[INFO] Compiling 69 source files to F:\hudson\hudson-slave\workspace\james-mailet\trunk\standard\target\classes
[debug] execute contextualize
[INFO] [INFO] Using 'UTF-8' encoding to copy filtered resources.

[INFO] --- maven-resources-plugin:2.5:testResources (default-testResources) @ apache-mailet-standard
---
[INFO] Copying 1 resource
[INFO] Copying 3 resources
[INFO] 
[INFO] --- maven-compiler-plugin:2.3.2:testCompile (default-testCompile) @ apache-mailet-standard
---
[INFO] Compiling 40 source files to F:\hudson\hudson-slave\workspace\james-mailet\trunk\standard\target\test-classes
[INFO] 
[INFO] --- maven-surefire-plugin:2.10:test (default-test) @ apache-mailet-standard ---
[INFO] Surefire report directory: F:\hudson\hudson-slave\workspace\james-mailet\trunk\standard\target\surefire-reports

-------------------------------------------------------
 T E S T S
-------------------------------------------------------

-------------------------------------------------------
 T E S T S
-------------------------------------------------------
Error loading: f:\hudson\tools\java\latest-1.6-64\jre\bin\server\jvm.dll
Error loading: f:\hudson\tools\java\latest-1.6-64\jre\bin\server\jvm.dll
Error loading: f:\hudson\tools\java\latest-1.6-64\jre\bin\server\jvm.dll
Error loading: f:\hudson\tools\java\latest-1.6-64\jre\bin\server\jvm.dll
Error loading: f:\hudson\tools\java\latest-1.6-64\jre\bin\server\jvm.dll
Error loading: f:\hudson\tools\java\latest-1.6-64\jre\bin\server\jvm.dll
Error loading: f:\hudson\tools\java\latest-1.6-64\jre\bin\server\jvm.dll
Error loading: f:\hudson\tools\java\latest-1.6-64\jre\bin\server\jvm.dll
Error loading: f:\hudson\tools\java\latest-1.6-64\jre\bin\server\jvm.dll

Results :

Tests run: 0, Failures: 0, Errors: 0, Skipped: 0

[JENKINS] Recording test results
[INFO] ------------------------------------------------------------------------
[INFO] Reactor Summary:
[INFO] 
[INFO] Apache James :: Mailets parent and aggregator ..... SUCCESS [11.690s]
[INFO] Apache James :: Mailet API ........................ SUCCESS [7.987s]
[INFO] Apache James :: Basic Mailet Toolkit .............. SUCCESS [6.562s]
[INFO] Apache James :: Mailetdocs Maven Plugin ........... SUCCESS [10.913s]
[INFO] Apache James :: Crypto Mailets .................... SUCCESS [4.378s]
[INFO] Apache James :: Standard Mailets .................. FAILURE [6.139s]
[INFO] Apache James :: AI Mailets ........................ SKIPPED
[INFO] ------------------------------------------------------------------------
[INFO] BUILD FAILURE
[INFO] ------------------------------------------------------------------------
[INFO] Total time: 50.507s
[INFO] Finished at: Tue Mar 05 16:52:55 GMT 2013
[INFO] Final Memory: 45M/186M
[INFO] ------------------------------------------------------------------------
[JENKINS] Archiving F:\hudson\hudson-slave\workspace\james-mailet\trunk\crypto\pom.xml to
/home/hudson/hudson/jobs/james-mailet/modules/org.apache.james$apache-mailet-crypto/builds/2013-03-05_16-51-46/archive/org.apache.james/apache-mailet-crypto/2.5.1-SNAPSHOT/apache-mailet-crypto-2.5.1-SNAPSHOT.pom
[JENKINS] Archiving F:\hudson\hudson-slave\workspace\james-mailet\trunk\crypto\target\apache-mailet-crypto-2.5.1-SNAPSHOT.jar
to /home/hudson/hudson/jobs/james-mailet/modules/org.apache.james$apache-mailet-crypto/builds/2013-03-05_16-51-46/archive/org.apache.james/apache-mailet-crypto/2.5.1-20130305.165248-78/apache-mailet-crypto-2.5.1-20130305.165248-78.jar
[JENKINS] Archiving <https://builds.apache.org/job/james-mailet/ws/trunk\pom.xml> to
/home/hudson/hudson/jobs/james-mailet/modules/org.apache.james$apache-mailet/builds/2013-03-05_16-51-46/archive/org.apache.james/apache-mailet/2.5.1-SNAPSHOT/apache-mailet-2.5.1-SNAPSHOT.pom
[JENKINS] Archiving <https://builds.apache.org/job/james-mailet/ws/trunk\target\apache-mailet-2.5.1-SNAPSHOT-site.xml>
to /home/hudson/hudson/jobs/james-mailet/modules/org.apache.james$apache-mailet/builds/2013-03-05_16-51-46/archive/org.apache.james/apache-mailet/2.5.1-20130305.165218-79/apache-mailet-2.5.1-20130305.165218-79-site.xml
[JENKINS] Archiving F:\hudson\hudson-slave\workspace\james-mailet\trunk\base\pom.xml to /home/hudson/hudson/jobs/james-mailet/modules/org.apache.james$apache-mailet-base/builds/2013-03-05_16-51-46/archive/org.apache.james/apache-mailet-base/2.5.1-SNAPSHOT/apache-mailet-base-2.5.1-SNAPSHOT.pom
[JENKINS] Archiving F:\hudson\hudson-slave\workspace\james-mailet\trunk\base\target\apache-mailet-base-2.5.1-SNAPSHOT.jar
to /home/hudson/hudson/jobs/james-mailet/modules/org.apache.james$apache-mailet-base/builds/2013-03-05_16-51-46/archive/org.apache.james/apache-mailet-base/2.5.1-20130305.165233-78/apache-mailet-base-2.5.1-20130305.165233-78.jar
[JENKINS] Archiving F:\hudson\hudson-slave\workspace\james-mailet\trunk\base\target\apache-mailet-base-2.5.1-SNAPSHOT-tests.jar
to /home/hudson/hudson/jobs/james-mailet/modules/org.apache.james$apache-mailet-base/builds/2013-03-05_16-51-46/archive/org.apache.james/apache-mailet-base/2.5.1-20130305.165233-78/apache-mailet-base-2.5.1-20130305.165233-78-tests.jar
[JENKINS] Archiving F:\hudson\hudson-slave\workspace\james-mailet\trunk\standard\pom.xml to
/home/hudson/hudson/jobs/james-mailet/modules/org.apache.james$apache-mailet-standard/builds/2013-03-05_16-51-46/archive/org.apache.james/apache-mailet-standard/2.5.1-SNAPSHOT/apache-mailet-standard-2.5.1-SNAPSHOT.pom
[JENKINS] Archiving F:\hudson\hudson-slave\workspace\james-mailet\trunk\mailetdocs-maven-plugin\pom.xml
to /home/hudson/hudson/jobs/james-mailet/modules/org.apache.james$mailetdocs-maven-plugin/builds/2013-03-05_16-51-46/archive/org.apache.james/mailetdocs-maven-plugin/2.5.1-SNAPSHOT/mailetdocs-maven-plugin-2.5.1-SNAPSHOT.pom
[JENKINS] Archiving F:\hudson\hudson-slave\workspace\james-mailet\trunk\mailetdocs-maven-plugin\target\mailetdocs-maven-plugin-2.5.1-SNAPSHOT.jar
to /home/hudson/hudson/jobs/james-mailet/modules/org.apache.james$mailetdocs-maven-plugin/builds/2013-03-05_16-51-46/archive/org.apache.james/mailetdocs-maven-plugin/2.5.1-20130305.165244-78/mailetdocs-maven-plugin-2.5.1-20130305.165244-78.jar
[JENKINS] Archiving F:\hudson\hudson-slave\workspace\james-mailet\trunk\api\pom.xml to /home/hudson/hudson/jobs/james-mailet/modules/org.apache.james$apache-mailet-api/builds/2013-03-05_16-51-46/archive/org.apache.james/apache-mailet-api/2.5.1-SNAPSHOT/apache-mailet-api-2.5.1-SNAPSHOT.pom
[JENKINS] Archiving F:\hudson\hudson-slave\workspace\james-mailet\trunk\api\target\apache-mailet-api-2.5.1-SNAPSHOT.jar
to /home/hudson/hudson/jobs/james-mailet/modules/org.apache.james$apache-mailet-api/builds/2013-03-05_16-51-46/archive/org.apache.james/apache-mailet-api/2.5.1-20130305.165226-79/apache-mailet-api-2.5.1-20130305.165226-79.jar
[JENKINS] Archiving F:\hudson\hudson-slave\workspace\james-mailet\trunk\ai\pom.xml to /home/hudson/hudson/jobs/james-mailet/modules/org.apache.james$apache-mailet-ai/builds/2013-03-05_16-51-46/archive/org.apache.james/apache-mailet-ai/2.5.1-SNAPSHOT/apache-mailet-ai-2.5.1-SNAPSHOT.pom
Waiting for Jenkins to finish collecting data
mavenExecutionResult exceptions not empty
message : Failed to execute goal org.apache.maven.plugins:maven-surefire-plugin:2.10:test
(default-test) on project apache-mailet-standard: Error while executing forked tests.; nested
exception is java.io.IOException: Cannot run program "cmd.exe" (in directory "F:\hudson\hudson-slave\workspace\james-mailet\trunk\standard"):
CreateProcess error=1455, The paging file is too small for this operation to complete
cause : Error while executing forked tests.; nested exception is java.io.IOException: Cannot
run program "cmd.exe" (in directory "F:\hudson\hudson-slave\workspace\james-mailet\trunk\standard"):
CreateProcess error=1455, The paging file is too small for this operation to complete
Stack trace : 
org.apache.maven.lifecycle.LifecycleExecutionException: Failed to execute goal org.apache.maven.plugins:maven-surefire-plugin:2.10:test
(default-test) on project apache-mailet-standard: Error while executing forked tests.; nested
exception is java.io.IOException: Cannot run program "cmd.exe" (in directory "F:\hudson\hudson-slave\workspace\james-mailet\trunk\standard"):
CreateProcess error=1455, The paging file is too small for this operation to complete
	at org.apache.maven.lifecycle.internal.MojoExecutor.execute(MojoExecutor.java:217)
	at org.apache.maven.lifecycle.internal.MojoExecutor.execute(MojoExecutor.java:153)
	at org.apache.maven.lifecycle.internal.MojoExecutor.execute(MojoExecutor.java:145)
	at org.apache.maven.lifecycle.internal.LifecycleModuleBuilder.buildProject(LifecycleModuleBuilder.java:84)
	at org.apache.maven.lifecycle.internal.LifecycleModuleBuilder.buildProject(LifecycleModuleBuilder.java:59)
	at org.apache.maven.lifecycle.internal.LifecycleStarter.singleThreadedBuild(LifecycleStarter.java:183)
	at org.apache.maven.lifecycle.internal.LifecycleStarter.execute(LifecycleStarter.java:161)
	at org.apache.maven.DefaultMaven.doExecute(DefaultMaven.java:319)
	at org.apache.maven.DefaultMaven.execute(DefaultMaven.java:156)
	at org.jvnet.hudson.maven3.launcher.Maven3Launcher.main(Maven3Launcher.java:79)
	at sun.reflect.NativeMethodAccessorImpl.invoke0(Native Method)
	at sun.reflect.NativeMethodAccessorImpl.invoke(NativeMethodAccessorImpl.java:39)
	at sun.reflect.DelegatingMethodAccessorImpl.invoke(DelegatingMethodAccessorImpl.java:25)
	at java.lang.reflect.Method.invoke(Method.java:597)
	at org.codehaus.plexus.classworlds.launcher.Launcher.launchStandard(Launcher.java:329)
	at org.codehaus.plexus.classworlds.launcher.Launcher.launch(Launcher.java:239)
	at org.jvnet.hudson.maven3.agent.Maven3Main.launch(Maven3Main.java:158)
	at hudson.maven.Maven3Builder.call(Maven3Builder.java:100)
	at hudson.maven.Maven3Builder.call(Maven3Builder.java:66)
	at hudson.remoting.UserRequest.perform(UserRequest.java:118)
	at hudson.remoting.UserRequest.perform(UserRequest.java:48)
	at hudson.remoting.Request$2.run(Request.java:326)
	at hudson.remoting.InterceptingExecutorService$1.call(InterceptingExecutorService.java:72)
	at java.util.concurrent.FutureTask$Sync.innerRun(FutureTask.java:303)
	at java.util.concurrent.FutureTask.run(FutureTask.java:138)
	at java.util.concurrent.ThreadPoolExecutor$Worker.runTask(ThreadPoolExecutor.java:886)
	at java.util.concurrent.ThreadPoolExecutor$Worker.run(ThreadPoolExecutor.java:908)
	at java.lang.Thread.run(Thread.java:662)
Caused by: org.apache.maven.plugin.MojoExecutionException: Error while executing forked tests.;
nested exception is java.io.IOException: Cannot run program "cmd.exe" (in directory "F:\hudson\hudson-slave\workspace\james-mailet\trunk\standard"):
CreateProcess error=1455, The paging file is too small for this operation to complete
	at org.apache.maven.plugin.surefire.SurefirePlugin.assertNoException(SurefirePlugin.java:624)
	at org.apache.maven.plugin.surefire.SurefirePlugin.handleSummary(SurefirePlugin.java:613)
	at org.apache.maven.plugin.surefire.AbstractSurefireMojo.executeAfterPreconditionsChecked(AbstractSurefireMojo.java:137)
	at org.apache.maven.plugin.surefire.AbstractSurefireMojo.execute(AbstractSurefireMojo.java:98)
	at org.apache.maven.plugin.DefaultBuildPluginManager.executeMojo(DefaultBuildPluginManager.java:107)
	at org.apache.maven.lifecycle.internal.MojoExecutor.execute(MojoExecutor.java:209)
	... 27 more
Caused by: org.apache.maven.surefire.booter.SurefireBooterForkException: Error while executing
forked tests.; nested exception is java.io.IOException: Cannot run program "cmd.exe" (in directory
"F:\hudson\hudson-slave\workspace\james-mailet\trunk\standard"): CreateProcess error=1455,
The paging file is too small for this operation to complete
	at org.apache.maven.plugin.surefire.booterclient.ForkStarter.fork(ForkStarter.java:206)
	at org.apache.maven.plugin.surefire.booterclient.ForkStarter.runSuitesForkPerTestSet(ForkStarter.java:128)
	at org.apache.maven.plugin.surefire.booterclient.ForkStarter.run(ForkStarter.java:102)
	at org.apache.maven.plugin.surefire.AbstractSurefireMojo.executeProvider(AbstractSurefireMojo.java:200)
	at org.apache.maven.plugin.surefire.AbstractSurefireMojo.executeAllProviders(AbstractSurefireMojo.java:177)
	at org.apache.maven.plugin.surefire.AbstractSurefireMojo.executeAfterPreconditionsChecked(AbstractSurefireMojo.java:135)
	... 30 more
Caused by: java.io.IOException: Cannot run program "cmd.exe" (in directory "F:\hudson\hudson-slave\workspace\james-mailet\trunk\standard"):
CreateProcess error=1455, The paging file is too small for this operation to complete
	at java.lang.ProcessBuilder.start(ProcessBuilder.java:460)
	at java.lang.Runtime.exec(Runtime.java:593)
	at org.codehaus.plexus.util.cli.Commandline.execute(Commandline.java:651)
	at org.codehaus.plexus.util.cli.CommandLineUtils.executeCommandLine(CommandLineUtils.java:119)
	at org.codehaus.plexus.util.cli.CommandLineUtils.executeCommandLine(CommandLineUtils.java:88)
	at org.apache.maven.plugin.surefire.booterclient.ForkStarter.fork(ForkStarter.java:191)
	... 35 more
Caused by: java.io.IOException: CreateProcess error=1455, The paging file is too small for
this operation to complete
	at java.lang.ProcessImpl.create(Native Method)
	at java.lang.ProcessImpl.<init>(ProcessImpl.java:81)
	at java.lang.ProcessImpl.start(ProcessImpl.java:30)
	at java.lang.ProcessBuilder.start(ProcessBuilder.java:453)
	... 40 more
Sending e-mails to: server-dev@james.apache.org
channel stopped

---------------------------------------------------------------------
To unsubscribe, e-mail: server-dev-unsubscribe@james.apache.org
For additional commands, e-mail: server-dev-help@james.apache.org


Mime
View raw message