james-server-dev mailing list archives

Site index · List index
Message view « Date » · « Thread »
Top « Date » · « Thread »
From Apache Jenkins Server <jenk...@builds.apache.org>
Subject Build failed in Jenkins: james-server-trunk #3712
Date Mon, 04 Mar 2013 14:17:50 GMT
See <https://builds.apache.org/job/james-server-trunk/3712/>

------------------------------------------
Started by an SCM change
Building remotely on ubuntu3 in workspace <https://builds.apache.org/job/james-server-trunk/ws/>
Updating http://svn.apache.org/repos/asf/james/server/trunk
D         mailetcontainer-api
D         core
D         filesystem-api
D         fetchmail
D         mailetcontainer-camel
D         mailets
D         spring
D         lifecycle-api
D         cli
D         mailbox-adapter
D         util
U         queue/queue-file/src/main/java/org/apache/james/queue/file/FileMailQueueFactory.java
U         queue/queue-file/src/main/java/org/apache/james/queue/file/FileMailQueue.java
U         queue/queue-activemq/src/test/java/org/apache/james/queue/activemq/ActiveMQMailQueueBlobTest.java
U         queue/queue-activemq/src/test/java/org/apache/james/queue/activemq/ActiveMQMailQueueTest.java
U         queue/queue-activemq/src/main/java/org/apache/james/queue/activemq/ActiveMQMailQueue.java
U         queue/queue-api/src/main/java/org/apache/james/queue/api/MailQueue.java
U         queue/queue-jms/src/test/java/org/apache/james/queue/jms/JMSMailQueueTest.java
A         queue/queue-jms/src/test/java/org/apache/james/queue/jms/AbstractJMSMailQueueTest.java
U         queue/queue-jms/src/main/java/org/apache/james/queue/library/AbstractMailQueueFactory.java
U         queue/queue-jms/src/main/java/org/apache/james/queue/library/MailQueueManagement.java
U         queue/queue-jms/src/main/java/org/apache/james/queue/jms/JMSMailQueueItem.java
U         queue/queue-jms/src/main/java/org/apache/james/queue/jms/JMSMailQueue.java
U         queue/queue-jms/src/main/java/org/apache/james/queue/jms/JMSMailQueueFactory.java
U         queue/queue-jms/src/main/java/org/apache/james/queue/jms/MimeMessageObjectMessageSource.java
U         queue/queue-jms/pom.xml
U         Overview.md
At revision 1452317
no revision recorded for http://svn.apache.org/repos/asf/james/server/trunk in the previous
build
Parsing POMs
ERROR: Failed to parse POMs
hudson.util.IOException2: remote file operation failed: <https://builds.apache.org/job/james-server-trunk/ws/trunk>
at hudson.remoting.Channel@2bb3796f:ubuntu3
	at hudson.FilePath.act(FilePath.java:861)
	at hudson.FilePath.act(FilePath.java:838)
	at hudson.maven.MavenModuleSetBuild$MavenModuleSetBuildExecution.parsePoms(MavenModuleSetBuild.java:862)
	at hudson.maven.MavenModuleSetBuild$MavenModuleSetBuildExecution.doRun(MavenModuleSetBuild.java:620)
	at hudson.model.AbstractBuild$AbstractBuildExecution.run(AbstractBuild.java:592)
	at hudson.model.Run.execute(Run.java:1568)
	at hudson.maven.MavenModuleSetBuild.run(MavenModuleSetBuild.java:477)
	at hudson.model.ResourceController.execute(ResourceController.java:88)
	at hudson.model.Executor.run(Executor.java:236)
Caused by: hudson.remoting.ProxyException: hudson.maven.MavenModuleSetBuild$MavenExecutionException:
org.apache.maven.project.ProjectBuildingException: Some problems were encountered while processing
the POMs:
[FATAL] Non-resolvable parent POM: Could not find artifact org.apache.james:james-server:pom:3.0.0-beta5-SNAPSHOT
and 'parent.relativePath' points at wrong local POM @ line 24, column 13
[FATAL] Non-resolvable parent POM: Could not find artifact org.apache.james:james-server:pom:3.0.0-beta5-SNAPSHOT
and 'parent.relativePath' points at wrong local POM @ line 24, column 13
[FATAL] Non-resolvable parent POM: Could not find artifact org.apache.james:james-server:pom:3.0.0-beta5-SNAPSHOT
and 'parent.relativePath' points at wrong local POM @ line 24, column 13
[FATAL] Non-resolvable parent POM: Could not find artifact org.apache.james:james-server:pom:3.0.0-beta5-SNAPSHOT
and 'parent.relativePath' points at wrong local POM @ line 24, column 13
[FATAL] Non-resolvable parent POM: Could not find artifact org.apache.james:james-server:pom:3.0.0-beta5-SNAPSHOT
and 'parent.relativePath' points at wrong local POM @ line 24, column 13
[FATAL] Non-resolvable parent POM: Could not find artifact org.apache.james:james-server:pom:3.0.0-beta5-SNAPSHOT
and 'parent.relativePath' points at wrong local POM @ line 24, column 13
[FATAL] Non-resolvable parent POM: Could not find artifact org.apache.james:james-server:pom:3.0.0-beta5-SNAPSHOT
and 'parent.relativePath' points at wrong local POM @ line 24, column 13
[FATAL] Non-resolvable parent POM: Could not find artifact org.apache.james:james-server:pom:3.0.0-beta5-SNAPSHOT
and 'parent.relativePath' points at wrong local POM @ line 24, column 13
[FATAL] Non-resolvable parent POM: Could not find artifact org.apache.james:james-server:pom:3.0.0-beta5-SNAPSHOT
and 'parent.relativePath' points at wrong local POM @ line 24, column 13
[FATAL] Non-resolvable parent POM: Could not find artifact org.apache.james:james-server:pom:3.0.0-beta5-SNAPSHOT
and 'parent.relativePath' points at wrong local POM @ line 24, column 13
[FATAL] Non-resolvable parent POM: Could not find artifact org.apache.james:james-server:pom:3.0.0-beta5-SNAPSHOT
and 'parent.relativePath' points at wrong local POM @ line 24, column 13

	at hudson.maven.MavenModuleSetBuild$PomParser.invoke(MavenModuleSetBuild.java:1229)
	at hudson.maven.MavenModuleSetBuild$PomParser.invoke(MavenModuleSetBuild.java:997)
	at hudson.FilePath$FileCallableWrapper.call(FilePath.java:2348)
	at hudson.remoting.UserRequest.perform(UserRequest.java:118)
	at hudson.remoting.UserRequest.perform(UserRequest.java:48)
	at hudson.remoting.Request$2.run(Request.java:326)
	at hudson.remoting.InterceptingExecutorService$1.call(InterceptingExecutorService.java:72)
	at java.util.concurrent.FutureTask$Sync.innerRun(FutureTask.java:334)
	at java.util.concurrent.FutureTask.run(FutureTask.java:166)
	at java.util.concurrent.ThreadPoolExecutor.runWorker(ThreadPoolExecutor.java:1146)
	at java.util.concurrent.ThreadPoolExecutor$Worker.run(ThreadPoolExecutor.java:615)
	at java.lang.Thread.run(Thread.java:679)
Caused by: hudson.remoting.ProxyException: org.apache.maven.project.ProjectBuildingException:
Some problems were encountered while processing the POMs:
[FATAL] Non-resolvable parent POM: Could not find artifact org.apache.james:james-server:pom:3.0.0-beta5-SNAPSHOT
and 'parent.relativePath' points at wrong local POM @ line 24, column 13
[FATAL] Non-resolvable parent POM: Could not find artifact org.apache.james:james-server:pom:3.0.0-beta5-SNAPSHOT
and 'parent.relativePath' points at wrong local POM @ line 24, column 13
[FATAL] Non-resolvable parent POM: Could not find artifact org.apache.james:james-server:pom:3.0.0-beta5-SNAPSHOT
and 'parent.relativePath' points at wrong local POM @ line 24, column 13
[FATAL] Non-resolvable parent POM: Could not find artifact org.apache.james:james-server:pom:3.0.0-beta5-SNAPSHOT
and 'parent.relativePath' points at wrong local POM @ line 24, column 13
[FATAL] Non-resolvable parent POM: Could not find artifact org.apache.james:james-server:pom:3.0.0-beta5-SNAPSHOT
and 'parent.relativePath' points at wrong local POM @ line 24, column 13
[FATAL] Non-resolvable parent POM: Could not find artifact org.apache.james:james-server:pom:3.0.0-beta5-SNAPSHOT
and 'parent.relativePath' points at wrong local POM @ line 24, column 13
[FATAL] Non-resolvable parent POM: Could not find artifact org.apache.james:james-server:pom:3.0.0-beta5-SNAPSHOT
and 'parent.relativePath' points at wrong local POM @ line 24, column 13
[FATAL] Non-resolvable parent POM: Could not find artifact org.apache.james:james-server:pom:3.0.0-beta5-SNAPSHOT
and 'parent.relativePath' points at wrong local POM @ line 24, column 13
[FATAL] Non-resolvable parent POM: Could not find artifact org.apache.james:james-server:pom:3.0.0-beta5-SNAPSHOT
and 'parent.relativePath' points at wrong local POM @ line 24, column 13
[FATAL] Non-resolvable parent POM: Could not find artifact org.apache.james:james-server:pom:3.0.0-beta5-SNAPSHOT
and 'parent.relativePath' points at wrong local POM @ line 24, column 13
[FATAL] Non-resolvable parent POM: Could not find artifact org.apache.james:james-server:pom:3.0.0-beta5-SNAPSHOT
and 'parent.relativePath' points at wrong local POM @ line 24, column 13

	at org.apache.maven.project.DefaultProjectBuilder.build(DefaultProjectBuilder.java:363)
	at hudson.maven.MavenEmbedder.buildProjects(MavenEmbedder.java:361)
	at hudson.maven.MavenEmbedder.readProjects(MavenEmbedder.java:331)
	at hudson.maven.MavenModuleSetBuild$PomParser.invoke(MavenModuleSetBuild.java:1179)
	... 11 more

---------------------------------------------------------------------
To unsubscribe, e-mail: server-dev-unsubscribe@james.apache.org
For additional commands, e-mail: server-dev-help@james.apache.org


Mime
View raw message