james-server-dev mailing list archives

Site index · List index
Message view « Date » · « Thread »
Top « Date » · « Thread »
From Apache Jenkins Server <jenk...@builds.apache.org>
Subject Build failed in Jenkins: jdkim-trunk #1656
Date Sat, 27 Apr 2013 11:35:02 GMT
See <https://builds.apache.org/job/jdkim-trunk/1656/>

------------------------------------------
Started by timer
Building remotely on solaris1 in workspace <https://builds.apache.org/job/jdkim-trunk/ws/>
Updating http://svn.apache.org/repos/asf/james/jdkim/trunk
At revision 1476555
no change for http://svn.apache.org/repos/asf/james/jdkim/trunk since the previous build
[locks-and-latches] Checking to see if we really have the locks
[locks-and-latches] Have all the locks, build can start
Parsing POMs
[trunk] $ /zonestorage/hudson_solaris/home/hudson/hudson-slave/tools/jdk6-u26-auto-install//bin/java
-cp /export/home/hudson/hudson-slave/maven3-agent.jar:/home/hudson/tools/maven/apache-maven-3.0.4/boot/plexus-classworlds-2.4.jar
org.jvnet.hudson.maven3.agent.Maven3Main /home/hudson/tools/maven/apache-maven-3.0.4 /zonestorage/hudson_solaris/home/hudson/hudson-slave/slave.jar
/export/home/hudson/hudson-slave/maven3-interceptor.jar 32974
<===[JENKINS REMOTING CAPACITY]===>   channel started
log4j:WARN No appenders could be found for logger (org.apache.commons.beanutils.converters.BooleanConverter).
log4j:WARN Please initialize the log4j system properly.
Executing Maven:  -B -f <https://builds.apache.org/job/jdkim-trunk/ws/trunk/pom.xml>
-Dmaven.repo.local=/export/home/hudson/hudson-slave/maven-repositories/0 -U clean deploy
[INFO] Scanning for projects...
[INFO] ------------------------------------------------------------------------
[INFO] Reactor Build Order:
[INFO] 
[INFO] Apache James :: jDKIM :: DomainKey Project
[INFO] Apache James :: jDKIM
[INFO] Apache James :: jDKIM :: Mailets
[INFO] Apache James :: jDKIM :: Assembly
[INFO]                                                                         
[INFO] ------------------------------------------------------------------------
[INFO] Building Apache James :: jDKIM :: DomainKey Project 0.3-SNAPSHOT
[INFO] ------------------------------------------------------------------------
[INFO] 
[INFO] --- maven-clean-plugin:2.4.1:clean (default-clean) @ apache-jdkim-project ---[INFO]
Deleting <https://builds.apache.org/job/jdkim-trunk/ws/trunk/target>

[TASKS] Scanning folder '<https://builds.apache.org/job/jdkim-trunk/ws/trunk'> for files
matching the pattern '**/*.java' - excludes: main/**/*, mailets/**/*, assemble/**/*
[TASKS] Found 0 files to scan for tasks
Found 0 open tasks.
[TASKS] Computing warning deltas based on reference build #1655
[INFO] 
[INFO] --- maven-remote-resources-plugin:1.2.1:process (default) @ apache-jdkim-project ---
[INFO] 
[INFO] --- maven-site-plugin:3.0:attach-descriptor (attach-descriptor) @ apache-jdkim-project
---
[INFO] 
[INFO] --- maven-install-plugin:2.3.1:install (default-install) @ apache-jdkim-project ---
[INFO] Installing <https://builds.apache.org/job/jdkim-trunk/ws/trunk/pom.xml> to /export/home/hudson/hudson-slave/maven-repositories/0/org/apache/james/jdkim/apache-jdkim-project/0.3-SNAPSHOT/apache-jdkim-project-0.3-SNAPSHOT.pom
[INFO] Installing <https://builds.apache.org/job/jdkim-trunk/ws/trunk/target/apache-jdkim-project-0.3-SNAPSHOT-site.xml>
to /export/home/hudson/hudson-slave/maven-repositories/0/org/apache/james/jdkim/apache-jdkim-project/0.3-SNAPSHOT/apache-jdkim-project-0.3-SNAPSHOT-site.xml
[INFO] 
[INFO] --- maven-deploy-plugin:2.7:deploy (default-deploy) @ apache-jdkim-project ---
Downloading: https://repository.apache.org/content/repositories/snapshots/org/apache/james/jdkim/apache-jdkim-project/0.3-SNAPSHOT/maven-metadata.xml
Downloaded: https://repository.apache.org/content/repositories/snapshots/org/apache/james/jdkim/apache-jdkim-project/0.3-SNAPSHOT/maven-metadata.xml
(830 B at 0.4 KB/sec)
Uploading: https://repository.apache.org/content/repositories/snapshots/org/apache/james/jdkim/apache-jdkim-project/0.3-SNAPSHOT/apache-jdkim-project-0.3-20130427.113243-488.pom
Uploaded: https://repository.apache.org/content/repositories/snapshots/org/apache/james/jdkim/apache-jdkim-project/0.3-SNAPSHOT/apache-jdkim-project-0.3-20130427.113243-488.pom
(11 KB at 6.7 KB/sec)
Downloading: https://repository.apache.org/content/repositories/snapshots/org/apache/james/jdkim/apache-jdkim-project/maven-metadata.xml
Downloaded: https://repository.apache.org/content/repositories/snapshots/org/apache/james/jdkim/apache-jdkim-project/maven-metadata.xml
(300 B at 0.4 KB/sec)
Uploading: https://repository.apache.org/content/repositories/snapshots/org/apache/james/jdkim/apache-jdkim-project/0.3-SNAPSHOT/maven-metadata.xml
Uploaded: https://repository.apache.org/content/repositories/snapshots/org/apache/james/jdkim/apache-jdkim-project/0.3-SNAPSHOT/maven-metadata.xml
(830 B at 0.6 KB/sec)
Uploading: https://repository.apache.org/content/repositories/snapshots/org/apache/james/jdkim/apache-jdkim-project/maven-metadata.xml
Uploaded: https://repository.apache.org/content/repositories/snapshots/org/apache/james/jdkim/apache-jdkim-project/maven-metadata.xml
(300 B at 0.2 KB/sec)
Uploading: https://repository.apache.org/content/repositories/snapshots/org/apache/james/jdkim/apache-jdkim-project/0.3-SNAPSHOT/apache-jdkim-project-0.3-20130427.113243-488-site.xml
Uploaded: https://repository.apache.org/content/repositories/snapshots/org/apache/james/jdkim/apache-jdkim-project/0.3-SNAPSHOT/apache-jdkim-project-0.3-20130427.113243-488-site.xml
(2 KB at 1.1 KB/sec)
Uploading: https://repository.apache.org/content/repositories/snapshots/org/apache/james/jdkim/apache-jdkim-project/0.3-SNAPSHOT/maven-metadata.xml
Uploaded: https://repository.apache.org/content/repositories/snapshots/org/apache/james/jdkim/apache-jdkim-project/0.3-SNAPSHOT/maven-metadata.xml
(830 B at 0.5 KB/sec)
[INFO]                                                                         
[INFO] ------------------------------------------------------------------------
[INFO] Building Apache James :: jDKIM 0.3-SNAPSHOT
[INFO] ------------------------------------------------------------------------
[INFO] 
[INFO] Deleting <https://builds.apache.org/job/jdkim-trunk/ws/trunk/main/target>
[INFO] --- maven-clean-plugin:2.4.1:clean (default-clean) @ apache-jdkim-library ---
[TASKS] Scanning folder '<https://builds.apache.org/job/jdkim-trunk/ws/trunk/main'>
for files matching the pattern '**/*.java' - excludes: 
[TASKS] Found 41 files to scan for tasks
Found 24 open tasks.
[TASKS] Computing warning deltas based on reference build #1655
[INFO] 
[INFO] --- maven-remote-resources-plugin:1.2.1:process (default) @ apache-jdkim-library ---
[INFO] 
[INFO] --- maven-resources-plugin:2.5:resources (default-resources) @ apache-jdkim-library
---[debug] execute contextualize
[INFO] Using 'UTF-8' encoding to copy filtered resources.
[INFO] skip non existing resourceDirectory <https://builds.apache.org/job/jdkim-trunk/ws/trunk/main/src/main/resources>
[INFO] Copying 3 resources

[INFO] 
[INFO] --- maven-compiler-plugin:2.3.2:compile (default-compile) @ apache-jdkim-library ---
[INFO] Compiling 25 source files to <https://builds.apache.org/job/jdkim-trunk/ws/trunk/main/target/classes>
[INFO] 
[INFO] --- maven-resources-plugin:2.5:testResources (default-testResources) @ apache-jdkim-library
---[debug] execute contextualize
[INFO] Using 'UTF-8' encoding to copy filtered resources.
[INFO] Copying 78 resources

[INFO] Copying 3 resources
[INFO] 
[INFO] --- maven-compiler-plugin:2.3.2:testCompile (default-testCompile) @ apache-jdkim-library
---[INFO] Compiling 16 source files to <https://builds.apache.org/job/jdkim-trunk/ws/trunk/main/target/test-classes>

[INFO] 
[INFO] --- maven-surefire-plugin:2.10:test (default-test) @ apache-jdkim-library ---
[INFO] Surefire report directory: <https://builds.apache.org/job/jdkim-trunk/ws/trunk/main/target/surefire-reports>

-------------------------------------------------------
 T E S T S
-------------------------------------------------------

-------------------------------------------------------
 T E S T S
-------------------------------------------------------

Results :

Tests run: 0, Failures: 0, Errors: 0, Skipped: 0

[JENKINS] Recording test results
[INFO] ------------------------------------------------------------------------
[INFO] Reactor Summary:
[INFO] 
[INFO] Apache James :: jDKIM :: DomainKey Project ........ SUCCESS [4:22.869s]
[INFO] Apache James :: jDKIM ............................. FAILURE [1:03.808s]
[INFO] Apache James :: jDKIM :: Mailets .................. SKIPPED
[INFO] Apache James :: jDKIM :: Assembly ................. SKIPPED
[INFO] ------------------------------------------------------------------------
[INFO] BUILD FAILURE
[INFO] ------------------------------------------------------------------------
[INFO] Total time: 5:53.098s
[INFO] Finished at: Sat Apr 27 11:34:02 GMT+00:00 2013
[INFO] Final Memory: 24M/268M
[INFO] ------------------------------------------------------------------------
[JENKINS] Archiving <https://builds.apache.org/job/jdkim-trunk/ws/trunk/mailets/pom.xml>
to /home/hudson/hudson/jobs/jdkim-trunk/modules/org.apache.james.jdkim$apache-jdkim-mailets/builds/2013-04-27_11-25-52/archive/org.apache.james.jdkim/apache-jdkim-mailets/0.3-SNAPSHOT/apache-jdkim-mailets-0.3-SNAPSHOT.pom
[JENKINS] Archiving <https://builds.apache.org/job/jdkim-trunk/ws/trunk/pom.xml> to
/home/hudson/hudson/jobs/jdkim-trunk/modules/org.apache.james.jdkim$apache-jdkim-project/builds/2013-04-27_11-25-49/archive/org.apache.james.jdkim/apache-jdkim-project/0.3-SNAPSHOT/apache-jdkim-project-0.3-SNAPSHOT.pom
[JENKINS] Archiving <https://builds.apache.org/job/jdkim-trunk/ws/trunk/target/apache-jdkim-project-0.3-SNAPSHOT-site.xml>
to /home/hudson/hudson/jobs/jdkim-trunk/modules/org.apache.james.jdkim$apache-jdkim-project/builds/2013-04-27_11-25-49/archive/org.apache.james.jdkim/apache-jdkim-project/0.3-20130427.113243-488/apache-jdkim-project-0.3-20130427.113243-488-site.xml
[JENKINS] Archiving <https://builds.apache.org/job/jdkim-trunk/ws/trunk/assemble/pom.xml>
to /home/hudson/hudson/jobs/jdkim-trunk/modules/org.apache.james.jdkim$apache-jdkim/builds/2013-04-27_11-25-53/archive/org.apache.james.jdkim/apache-jdkim/0.3-SNAPSHOT/apache-jdkim-0.3-SNAPSHOT.pom
[JENKINS] Archiving <https://builds.apache.org/job/jdkim-trunk/ws/trunk/main/pom.xml>
to /home/hudson/hudson/jobs/jdkim-trunk/modules/org.apache.james.jdkim$apache-jdkim-library/builds/2013-04-27_11-25-51/archive/org.apache.james.jdkim/apache-jdkim-library/0.3-SNAPSHOT/apache-jdkim-library-0.3-SNAPSHOT.pom
Waiting for Jenkins to finish collecting data
mavenExecutionResult exceptions not empty
message : Failed to execute goal org.apache.maven.plugins:maven-surefire-plugin:2.10:test
(default-test) on project apache-jdkim-library: Error while executing forked tests.; nested
exception is java.io.IOException: Cannot run program "/bin/sh" (in directory "<https://builds.apache.org/job/jdkim-trunk/ws/trunk/main")>:
error=12, Not enough space
cause : Error while executing forked tests.; nested exception is java.io.IOException: Cannot
run program "/bin/sh" (in directory "<https://builds.apache.org/job/jdkim-trunk/ws/trunk/main")>:
error=12, Not enough space
Stack trace : 
org.apache.maven.lifecycle.LifecycleExecutionException: Failed to execute goal org.apache.maven.plugins:maven-surefire-plugin:2.10:test
(default-test) on project apache-jdkim-library: Error while executing forked tests.; nested
exception is java.io.IOException: Cannot run program "/bin/sh" (in directory "<https://builds.apache.org/job/jdkim-trunk/ws/trunk/main")>:
error=12, Not enough space
	at org.apache.maven.lifecycle.internal.MojoExecutor.execute(MojoExecutor.java:217)
	at org.apache.maven.lifecycle.internal.MojoExecutor.execute(MojoExecutor.java:153)
	at org.apache.maven.lifecycle.internal.MojoExecutor.execute(MojoExecutor.java:145)
	at org.apache.maven.lifecycle.internal.LifecycleModuleBuilder.buildProject(LifecycleModuleBuilder.java:84)
	at org.apache.maven.lifecycle.internal.LifecycleModuleBuilder.buildProject(LifecycleModuleBuilder.java:59)
	at org.apache.maven.lifecycle.internal.LifecycleStarter.singleThreadedBuild(LifecycleStarter.java:183)
	at org.apache.maven.lifecycle.internal.LifecycleStarter.execute(LifecycleStarter.java:161)
	at org.apache.maven.DefaultMaven.doExecute(DefaultMaven.java:320)
	at org.apache.maven.DefaultMaven.execute(DefaultMaven.java:156)
	at org.jvnet.hudson.maven3.launcher.Maven3Launcher.main(Maven3Launcher.java:79)
	at sun.reflect.NativeMethodAccessorImpl.invoke0(Native Method)
	at sun.reflect.NativeMethodAccessorImpl.invoke(NativeMethodAccessorImpl.java:39)
	at sun.reflect.DelegatingMethodAccessorImpl.invoke(DelegatingMethodAccessorImpl.java:25)
	at java.lang.reflect.Method.invoke(Method.java:597)
	at org.codehaus.plexus.classworlds.launcher.Launcher.launchStandard(Launcher.java:329)
	at org.codehaus.plexus.classworlds.launcher.Launcher.launch(Launcher.java:239)
	at org.jvnet.hudson.maven3.agent.Maven3Main.launch(Maven3Main.java:158)
	at hudson.maven.Maven3Builder.call(Maven3Builder.java:100)
	at hudson.maven.Maven3Builder.call(Maven3Builder.java:66)
	at hudson.remoting.UserRequest.perform(UserRequest.java:118)
	at hudson.remoting.UserRequest.perform(UserRequest.java:48)
	at hudson.remoting.Request$2.run(Request.java:326)
	at hudson.remoting.InterceptingExecutorService$1.call(InterceptingExecutorService.java:72)
	at java.util.concurrent.FutureTask$Sync.innerRun(FutureTask.java:303)
	at java.util.concurrent.FutureTask.run(FutureTask.java:138)
	at java.util.concurrent.ThreadPoolExecutor$Worker.runTask(ThreadPoolExecutor.java:886)
	at java.util.concurrent.ThreadPoolExecutor$Worker.run(ThreadPoolExecutor.java:908)
	at java.lang.Thread.run(Thread.java:662)
Caused by: org.apache.maven.plugin.MojoExecutionException: Error while executing forked tests.;
nested exception is java.io.IOException: Cannot run program "/bin/sh" (in directory "<https://builds.apache.org/job/jdkim-trunk/ws/trunk/main")>:
error=12, Not enough space
	at org.apache.maven.plugin.surefire.SurefirePlugin.assertNoException(SurefirePlugin.java:624)
	at org.apache.maven.plugin.surefire.SurefirePlugin.handleSummary(SurefirePlugin.java:613)
	at org.apache.maven.plugin.surefire.AbstractSurefireMojo.executeAfterPreconditionsChecked(AbstractSurefireMojo.java:137)
	at org.apache.maven.plugin.surefire.AbstractSurefireMojo.execute(AbstractSurefireMojo.java:98)
	at org.apache.maven.plugin.DefaultBuildPluginManager.executeMojo(DefaultBuildPluginManager.java:101)
	at org.apache.maven.lifecycle.internal.MojoExecutor.execute(MojoExecutor.java:209)
	... 27 more
Caused by: org.apache.maven.surefire.booter.SurefireBooterForkException: Error while executing
forked tests.; nested exception is java.io.IOException: Cannot run program "/bin/sh" (in directory
"<https://builds.apache.org/job/jdkim-trunk/ws/trunk/main")>: error=12, Not enough space
	at org.apache.maven.plugin.surefire.booterclient.ForkStarter.fork(ForkStarter.java:206)
	at org.apache.maven.plugin.surefire.booterclient.ForkStarter.runSuitesForkPerTestSet(ForkStarter.java:128)
	at org.apache.maven.plugin.surefire.booterclient.ForkStarter.run(ForkStarter.java:102)
	at org.apache.maven.plugin.surefire.AbstractSurefireMojo.executeProvider(AbstractSurefireMojo.java:200)
	at org.apache.maven.plugin.surefire.AbstractSurefireMojo.executeAllProviders(AbstractSurefireMojo.java:177)
	at org.apache.maven.plugin.surefire.AbstractSurefireMojo.executeAfterPreconditionsChecked(AbstractSurefireMojo.java:135)
	... 30 more
Caused by: java.io.IOException: Cannot run program "/bin/sh" (in directory "<https://builds.apache.org/job/jdkim-trunk/ws/trunk/main")>:
error=12, Not enough space
	at java.lang.ProcessBuilder.start(ProcessBuilder.java:460)
	at java.lang.Runtime.exec(Runtime.java:593)
	at org.codehaus.plexus.util.cli.Commandline.execute(Commandline.java:651)
	at org.codehaus.plexus.util.cli.CommandLineUtils.executeCommandLine(CommandLineUtils.java:119)
	at org.codehaus.plexus.util.cli.CommandLineUtils.executeCommandLine(CommandLineUtils.java:88)
	at org.apache.maven.plugin.surefire.booterclient.ForkStarter.fork(ForkStarter.java:191)
	... 35 more
Caused by: java.io.IOException: error=12, Not enough space
	at java.lang.UNIXProcess.forkAndExec(Native Method)
	at java.lang.UNIXProcess.<init>(UNIXProcess.java:53)
	at java.lang.ProcessImpl.start(ProcessImpl.java:65)
	at java.lang.ProcessBuilder.start(ProcessBuilder.java:453)
	... 40 more
Sending e-mails to: server-dev@james.apache.org
channel stopped
[locks-and-latches] Releasing all the locks
[locks-and-latches] All the locks released

---------------------------------------------------------------------
To unsubscribe, e-mail: server-dev-unsubscribe@james.apache.org
For additional commands, e-mail: server-dev-help@james.apache.org


Mime
View raw message