james-server-dev mailing list archives

Site index · List index
Message view « Date » · « Thread »
Top « Date » · « Thread »
From Apache Jenkins Server <jenk...@builds.apache.org>
Subject Build failed in Jenkins: james-server-trunk » Apache James :: Server :: Data :: HBase Persistence #3913
Date Fri, 21 Jun 2013 10:28:00 GMT
See <https://builds.apache.org/job/james-server-trunk/org.apache.james$james-server-data-hbase/3913/>

------------------------------------------
[...truncated 75 lines...]
Cluster is active
2013-06-21 10:24:17,741 [org.apache.hadoop.hdfs.server.datanode.DataXceiver@31bd669d] WARN
 org.apache.hadoop.util.NativeCodeLoader - Unable to load native-hadoop library for your platform...
using builtin-java classes where applicable
2013-06-21 10:24:27,392 [Master:0;juno.apache.org,42981,1371810257204] WARN  org.apache.hadoop.hbase.zookeeper.RecoverableZooKeeper
- Node /hbase/root-region-server already deleted, and this is not a retry
2013-06-21 10:24:37,546 [main] ERROR MockLog - Exception during regexMap processing: 
java.util.regex.PatternSyntaxException: Regex should be formatted as regex:<regular-expression>:<parameterized-string>
near index 0
regex:(.*)@localhost
^
	at org.apache.james.rrt.lib.RecipientRewriteTableUtil.regexMap(RecipientRewriteTableUtil.java:67)
	at org.apache.james.rrt.lib.AbstractRecipientRewriteTable.getMappings(AbstractRecipientRewriteTable.java:137)
	at org.apache.james.rrt.lib.AbstractRecipientRewriteTable.getMappings(AbstractRecipientRewriteTable.java:114)
	at org.apache.james.rrt.lib.AbstractRecipientRewriteTableTest.testStoreAndRetrieveRegexMapping(AbstractRecipientRewriteTableTest.java:96)
	at sun.reflect.NativeMethodAccessorImpl.invoke0(Native Method)
	at sun.reflect.NativeMethodAccessorImpl.invoke(NativeMethodAccessorImpl.java:57)
	at sun.reflect.DelegatingMethodAccessorImpl.invoke(DelegatingMethodAccessorImpl.java:43)
	at java.lang.reflect.Method.invoke(Method.java:616)
	at org.junit.runners.model.FrameworkMethod$1.runReflectiveCall(FrameworkMethod.java:47)
	at org.junit.internal.runners.model.ReflectiveCallable.run(ReflectiveCallable.java:12)
	at org.junit.runners.model.FrameworkMethod.invokeExplosively(FrameworkMethod.java:44)
	at org.junit.internal.runners.statements.InvokeMethod.evaluate(InvokeMethod.java:17)
	at org.junit.internal.runners.statements.RunBefores.evaluate(RunBefores.java:26)
	at org.junit.internal.runners.statements.RunAfters.evaluate(RunAfters.java:27)
	at org.junit.runners.ParentRunner.runLeaf(ParentRunner.java:271)
	at org.junit.runners.BlockJUnit4ClassRunner.runChild(BlockJUnit4ClassRunner.java:70)
	at org.junit.runners.BlockJUnit4ClassRunner.runChild(BlockJUnit4ClassRunner.java:50)
	at org.junit.runners.ParentRunner$3.run(ParentRunner.java:238)
	at org.junit.runners.ParentRunner$1.schedule(ParentRunner.java:63)
	at org.junit.runners.ParentRunner.runChildren(ParentRunner.java:236)
	at org.junit.runners.ParentRunner.access$000(ParentRunner.java:53)
	at org.junit.runners.ParentRunner$2.evaluate(ParentRunner.java:229)
	at org.junit.runners.ParentRunner.run(ParentRunner.java:309)
	at org.apache.maven.surefire.junit4.JUnit4Provider.execute(JUnit4Provider.java:264)
	at org.apache.maven.surefire.junit4.JUnit4Provider.executeTestSet(JUnit4Provider.java:153)
	at org.apache.maven.surefire.junit4.JUnit4Provider.invoke(JUnit4Provider.java:124)
	at sun.reflect.NativeMethodAccessorImpl.invoke0(Native Method)
	at sun.reflect.NativeMethodAccessorImpl.invoke(NativeMethodAccessorImpl.java:57)
	at sun.reflect.DelegatingMethodAccessorImpl.invoke(DelegatingMethodAccessorImpl.java:43)
	at java.lang.reflect.Method.invoke(Method.java:616)
	at org.apache.maven.surefire.util.ReflectionUtils.invokeMethodWithArray2(ReflectionUtils.java:208)
	at org.apache.maven.surefire.booter.ProviderFactory$ProviderProxy.invoke(ProviderFactory.java:158)
	at org.apache.maven.surefire.booter.ProviderFactory.invokeProvider(ProviderFactory.java:86)
	at org.apache.maven.surefire.booter.ForkedBooter.runSuitesInProcess(ForkedBooter.java:153)
	at org.apache.maven.surefire.booter.ForkedBooter.main(ForkedBooter.java:95)
2013-06-21 10:24:37,560 [main] ERROR MockLog - Exception during regexMap processing: 
java.util.regex.PatternSyntaxException: Regex should be formatted as regex:<regular-expression>:<parameterized-string>
near index 0
regex:(.+)@test
^
	at org.apache.james.rrt.lib.RecipientRewriteTableUtil.regexMap(RecipientRewriteTableUtil.java:67)
	at org.apache.james.rrt.lib.AbstractRecipientRewriteTable.getMappings(AbstractRecipientRewriteTable.java:137)
	at org.apache.james.rrt.lib.AbstractRecipientRewriteTable.getMappings(AbstractRecipientRewriteTable.java:114)
	at org.apache.james.rrt.lib.AbstractRecipientRewriteTableTest.testStoreAndRetrieveRegexMapping(AbstractRecipientRewriteTableTest.java:96)
	at sun.reflect.NativeMethodAccessorImpl.invoke0(Native Method)
	at sun.reflect.NativeMethodAccessorImpl.invoke(NativeMethodAccessorImpl.java:57)
	at sun.reflect.DelegatingMethodAccessorImpl.invoke(DelegatingMethodAccessorImpl.java:43)
	at java.lang.reflect.Method.invoke(Method.java:616)
	at org.junit.runners.model.FrameworkMethod$1.runReflectiveCall(FrameworkMethod.java:47)
	at org.junit.internal.runners.model.ReflectiveCallable.run(ReflectiveCallable.java:12)
	at org.junit.runners.model.FrameworkMethod.invokeExplosively(FrameworkMethod.java:44)
	at org.junit.internal.runners.statements.InvokeMethod.evaluate(InvokeMethod.java:17)
	at org.junit.internal.runners.statements.RunBefores.evaluate(RunBefores.java:26)
	at org.junit.internal.runners.statements.RunAfters.evaluate(RunAfters.java:27)
	at org.junit.runners.ParentRunner.runLeaf(ParentRunner.java:271)
	at org.junit.runners.BlockJUnit4ClassRunner.runChild(BlockJUnit4ClassRunner.java:70)
	at org.junit.runners.BlockJUnit4ClassRunner.runChild(BlockJUnit4ClassRunner.java:50)
	at org.junit.runners.ParentRunner$3.run(ParentRunner.java:238)
	at org.junit.runners.ParentRunner$1.schedule(ParentRunner.java:63)
	at org.junit.runners.ParentRunner.runChildren(ParentRunner.java:236)
	at org.junit.runners.ParentRunner.access$000(ParentRunner.java:53)
	at org.junit.runners.ParentRunner$2.evaluate(ParentRunner.java:229)
	at org.junit.runners.ParentRunner.run(ParentRunner.java:309)
	at org.apache.maven.surefire.junit4.JUnit4Provider.execute(JUnit4Provider.java:264)
	at org.apache.maven.surefire.junit4.JUnit4Provider.executeTestSet(JUnit4Provider.java:153)
	at org.apache.maven.surefire.junit4.JUnit4Provider.invoke(JUnit4Provider.java:124)
	at sun.reflect.NativeMethodAccessorImpl.invoke0(Native Method)
	at sun.reflect.NativeMethodAccessorImpl.invoke(NativeMethodAccessorImpl.java:57)
	at sun.reflect.DelegatingMethodAccessorImpl.invoke(DelegatingMethodAccessorImpl.java:43)
	at java.lang.reflect.Method.invoke(Method.java:616)
	at org.apache.maven.surefire.util.ReflectionUtils.invokeMethodWithArray2(ReflectionUtils.java:208)
	at org.apache.maven.surefire.booter.ProviderFactory$ProviderProxy.invoke(ProviderFactory.java:158)
	at org.apache.maven.surefire.booter.ProviderFactory.invokeProvider(ProviderFactory.java:86)
	at org.apache.maven.surefire.booter.ForkedBooter.runSuitesInProcess(ForkedBooter.java:153)
	at org.apache.maven.surefire.booter.ForkedBooter.main(ForkedBooter.java:95)
Tests run: 6, Failures: 0, Errors: 0, Skipped: 0, Time elapsed: 25.595 sec
2013-06-21 10:24:40,218 [RegionServer:0;juno.apache.org,59274,1371810257658] WARN  org.apache.hadoop.hbase.regionserver.HRegionServer
- Received close for region we are already opening or closing; 70236052
Running org.apache.james.domainlist.hbase.HBaseDomainListTest
SLF4J: Class path contains multiple SLF4J bindings.
SLF4J: Found binding in [jar:file:/home/jenkins/jenkins-slave/maven-repositories/0/org/slf4j/slf4j-log4j12/1.7.2/slf4j-log4j12-1.7.2.jar!/org/slf4j/impl/StaticLoggerBinder.class]
SLF4J: Found binding in [jar:file:/home/jenkins/jenkins-slave/maven-repositories/0/org/slf4j/slf4j-simple/1.7.2/slf4j-simple-1.7.2.jar!/org/slf4j/impl/StaticLoggerBinder.class]
SLF4J: See http://www.slf4j.org/codes.html#multiple_bindings for an explanation.
SLF4J: Actual binding is of type [org.slf4j.impl.Log4jLoggerFactory]
2013-06-21 10:24:44,305 [main] WARN  org.apache.hadoop.hdfs.server.namenode.FSNamesystem -
The dfs.support.append option is in your configuration, however append is not supported. This
configuration option is no longer required to enable sync.
2013-06-21 10:24:45,634 [main] WARN  org.apache.hadoop.metrics2.impl.MetricsSystemImpl - Source
name ugi already exists!
2013-06-21 10:24:45,661 [main] WARN  org.apache.hadoop.metrics2.impl.MetricsSystemImpl - Source
name ugi already exists!
2013-06-21 10:24:45,671 [main] WARN  org.apache.hadoop.hdfs.server.namenode.FSNamesystem -
The dfs.support.append option is in your configuration, however append is not supported. This
configuration option is no longer required to enable sync.
Starting DataNode 0 with dfs.data.dir: <https://builds.apache.org/job/james-server-trunk/org.apache.james$james-server-data-hbase/ws/target/test-data/70df1cb8-e878-46de-ab3a-9088eb4a2e4c/dfscluster_7641cb59-b69d-439a-911c-20c7294bee66/dfs/data/data1,/home/jenkins/jenkins-slave/workspace/james-server-trunk/trunk/data/data-hbase/target/test-data/70df1cb8-e878-46de-ab3a-9088eb4a2e4c/dfscluster_7641cb59-b69d-439a-911c-20c7294bee66/dfs/data/data2>
2013-06-21 10:24:46,681 [main] WARN  org.apache.hadoop.metrics2.impl.MetricsSystemImpl - NameNode
metrics system already initialized!
2013-06-21 10:24:46,681 [main] WARN  org.apache.hadoop.metrics2.impl.MetricsSystemImpl - Source
name ugi already exists!
2013-06-21 10:24:47,532 [main] WARN  org.apache.hadoop.metrics2.impl.MetricsSystemImpl - Source
name jvm already exists!
Cluster is active
2013-06-21 10:24:51,740 [org.apache.hadoop.hdfs.server.datanode.DataXceiver@6fe22c75] WARN
 org.apache.hadoop.util.NativeCodeLoader - Unable to load native-hadoop library for your platform...
using builtin-java classes where applicable
2013-06-21 10:25:00,078 [Master:0;juno.apache.org,58304,1371810291273] WARN  org.apache.hadoop.hbase.zookeeper.RecoverableZooKeeper
- Node /hbase/root-region-server already deleted, and this is not a retry
Tests run: 5, Failures: 0, Errors: 0, Skipped: 0, Time elapsed: 27.033 sec
2013-06-21 10:25:13,170 [RegionServer:0;juno.apache.org,37718,1371810291639] WARN  org.apache.hadoop.hbase.regionserver.HRegionServer
- Received close for region we are already opening or closing; 70236052
Running org.apache.james.user.hbase.HBaseUsersRepositoryTest
SLF4J: Class path contains multiple SLF4J bindings.
SLF4J: Found binding in [jar:file:/home/jenkins/jenkins-slave/maven-repositories/0/org/slf4j/slf4j-log4j12/1.7.2/slf4j-log4j12-1.7.2.jar!/org/slf4j/impl/StaticLoggerBinder.class]
SLF4J: Found binding in [jar:file:/home/jenkins/jenkins-slave/maven-repositories/0/org/slf4j/slf4j-simple/1.7.2/slf4j-simple-1.7.2.jar!/org/slf4j/impl/StaticLoggerBinder.class]
SLF4J: See http://www.slf4j.org/codes.html#multiple_bindings for an explanation.
SLF4J: Actual binding is of type [org.slf4j.impl.Log4jLoggerFactory]
2013-06-21 10:25:17,396 [main] WARN  org.apache.hadoop.hdfs.server.namenode.FSNamesystem -
The dfs.support.append option is in your configuration, however append is not supported. This
configuration option is no longer required to enable sync.
2013-06-21 10:25:18,226 [main] WARN  org.apache.hadoop.metrics2.impl.MetricsSystemImpl - Source
name ugi already exists!
2013-06-21 10:25:18,253 [main] WARN  org.apache.hadoop.metrics2.impl.MetricsSystemImpl - Source
name ugi already exists!
2013-06-21 10:25:18,264 [main] WARN  org.apache.hadoop.hdfs.server.namenode.FSNamesystem -
The dfs.support.append option is in your configuration, however append is not supported. This
configuration option is no longer required to enable sync.
Starting DataNode 0 with dfs.data.dir: <https://builds.apache.org/job/james-server-trunk/org.apache.james$james-server-data-hbase/ws/target/test-data/5a3984cd-1201-450f-b413-3070088ba60d/dfscluster_fc24081f-4d66-4045-84e6-3b937fe17576/dfs/data/data1,/home/jenkins/jenkins-slave/workspace/james-server-trunk/trunk/data/data-hbase/target/test-data/5a3984cd-1201-450f-b413-3070088ba60d/dfscluster_fc24081f-4d66-4045-84e6-3b937fe17576/dfs/data/data2>
2013-06-21 10:25:19,250 [main] WARN  org.apache.hadoop.metrics2.impl.MetricsSystemImpl - NameNode
metrics system already initialized!
2013-06-21 10:25:19,250 [main] WARN  org.apache.hadoop.metrics2.impl.MetricsSystemImpl - Source
name ugi already exists!
2013-06-21 10:25:20,341 [main] WARN  org.apache.hadoop.metrics2.impl.MetricsSystemImpl - Source
name jvm already exists!
Cluster is active
2013-06-21 10:25:22,063 [org.apache.hadoop.hdfs.server.datanode.DataXceiver@38666d83] WARN
 org.apache.hadoop.util.NativeCodeLoader - Unable to load native-hadoop library for your platform...
using builtin-java classes where applicable
2013-06-21 10:25:31,932 [Master:0;juno.apache.org,36686,1371810321410] WARN  org.apache.hadoop.hbase.zookeeper.RecoverableZooKeeper
- Node /hbase/root-region-server already deleted, and this is not a retry
Tests run: 7, Failures: 0, Errors: 0, Skipped: 0, Time elapsed: 26.224 sec
2013-06-21 10:25:44,706 [RegionServer:0;juno.apache.org,51875,1371810321922] WARN  org.apache.hadoop.hbase.regionserver.HRegionServer
- Received close for region we are already opening or closing; 70236052
2013-06-21 10:25:44,794 [NIOServerCxn.Factory:0.0.0.0/0.0.0.0:21818] WARN  org.apache.zookeeper.server.NIOServerCnxn
- caught end of stream exception
EndOfStreamException: Unable to read additional data from client sessionid 0x13f6644507f0004,
likely client has closed socket
	at org.apache.zookeeper.server.NIOServerCnxn.doIO(NIOServerCnxn.java:220)
	at org.apache.zookeeper.server.NIOServerCnxnFactory.run(NIOServerCnxnFactory.java:224)
	at java.lang.Thread.run(Thread.java:679)

Results :

Tests run: 22, Failures: 0, Errors: 0, Skipped: 0

[JENKINS] Recording test results
[INFO] 
[INFO] --- maven-bundle-plugin:2.3.7:bundle (default-bundle) @ james-server-data-hbase ---
[INFO] 
[INFO] --- maven-jar-plugin:2.4:jar (jar) @ james-server-data-hbase ---
[INFO] 
[INFO] --- maven-jar-plugin:2.4:test-jar (test-jar) @ james-server-data-hbase ---
[INFO] Building jar: <https://builds.apache.org/job/james-server-trunk/org.apache.james$james-server-data-hbase/ws/target/james-server-data-hbase-3.0.0-beta5-SNAPSHOT-tests.jar>
Jun 21, 2013 10:25:49 AM hudson.maven.ExecutedMojo <init>
WARNING: Failed to getClass for org.apache.maven.plugin.source.SourceJarMojo
[INFO] 
[INFO] --- maven-source-plugin:2.2.1:jar (attach-sources) @ james-server-data-hbase ---
[INFO] Building jar: <https://builds.apache.org/job/james-server-trunk/org.apache.james$james-server-data-hbase/ws/target/james-server-data-hbase-3.0.0-beta5-SNAPSHOT-sources.jar>
Jun 21, 2013 10:25:51 AM hudson.maven.ExecutedMojo <init>
WARNING: Failed to getClass for org.apache.maven.plugin.source.TestSourceJarMojo
[INFO] 
[INFO] --- maven-source-plugin:2.2.1:test-jar (attach-sources) @ james-server-data-hbase ---
[INFO] Building jar: <https://builds.apache.org/job/james-server-trunk/org.apache.james$james-server-data-hbase/ws/target/james-server-data-hbase-3.0.0-beta5-SNAPSHOT-test-sources.jar>
[INFO] 
[INFO] --- maven-site-plugin:3.2:attach-descriptor (attach-descriptor) @ james-server-data-hbase
---
[INFO] [INFO] Installing <https://builds.apache.org/job/james-server-trunk/org.apache.james$james-server-data-hbase/ws/target/james-server-data-hbase-3.0.0-beta5-SNAPSHOT.jar>
to /home/jenkins/jenkins-slave/maven-repositories/0/org/apache/james/james-server-data-hbase/3.0.0-beta5-SNAPSHOT/james-server-data-hbase-3.0.0-beta5-SNAPSHOT.jar
[INFO] Installing <https://builds.apache.org/job/james-server-trunk/org.apache.james$james-server-data-hbase/ws/pom.xml>
to /home/jenkins/jenkins-slave/maven-repositories/0/org/apache/james/james-server-data-hbase/3.0.0-beta5-SNAPSHOT/james-server-data-hbase-3.0.0-beta5-SNAPSHOT.pom

[INFO] --- maven-install-plugin:2.3.1:install (default-install) @ james-server-data-hbase
---
[INFO] Installing <https://builds.apache.org/job/james-server-trunk/org.apache.james$james-server-data-hbase/ws/target/james-server-data-hbase-3.0.0-beta5-SNAPSHOT-tests.jar>
to /home/jenkins/jenkins-slave/maven-repositories/0/org/apache/james/james-server-data-hbase/3.0.0-beta5-SNAPSHOT/james-server-data-hbase-3.0.0-beta5-SNAPSHOT-tests.jar
[INFO] Installing <https://builds.apache.org/job/james-server-trunk/org.apache.james$james-server-data-hbase/ws/target/james-server-data-hbase-3.0.0-beta5-SNAPSHOT-sources.jar>
to /home/jenkins/jenkins-slave/maven-repositories/0/org/apache/james/james-server-data-hbase/3.0.0-beta5-SNAPSHOT/james-server-data-hbase-3.0.0-beta5-SNAPSHOT-sources.jar
[INFO] Installing <https://builds.apache.org/job/james-server-trunk/org.apache.james$james-server-data-hbase/ws/target/james-server-data-hbase-3.0.0-beta5-SNAPSHOT-test-sources.jar>
to /home/jenkins/jenkins-slave/maven-repositories/0/org/apache/james/james-server-data-hbase/3.0.0-beta5-SNAPSHOT/james-server-data-hbase-3.0.0-beta5-SNAPSHOT-test-sources.jar
[INFO] 
[INFO] --- maven-bundle-plugin:2.3.7:install (default-install) @ james-server-data-hbase ---
[INFO] Installing org/apache/james/james-server-data-hbase/3.0.0-beta5-SNAPSHOT/james-server-data-hbase-3.0.0-beta5-SNAPSHOT.jar
[INFO] Writing OBR metadata
[INFO] 
[INFO] --- maven-remote-resources-plugin:1.4:process (default) @ james-server-data-hbase ---
[INFO] [INFO] Using 'UTF-8' encoding to copy filtered resources.
[INFO] skip non existing resourceDirectory <https://builds.apache.org/job/james-server-trunk/org.apache.james$james-server-data-hbase/ws/src/main/resources>
[INFO] Copying 3 resources
[INFO] Copying 3 resources

[INFO] --- maven-resources-plugin:2.6:resources (default-resources) @ james-server-data-hbase
---
[INFO] Changes detected - recompiling the module!
[INFO] [INFO] Compiling 7 source files to <https://builds.apache.org/job/james-server-trunk/org.apache.james$james-server-data-hbase/ws/target/classes>

[INFO] --- maven-compiler-plugin:3.0:compile (default-compile) @ james-server-data-hbase ---
[INFO] [INFO] Using 'UTF-8' encoding to copy filtered resources.
[INFO] Copying 2 resources
[INFO] Copying 3 resources
[INFO] Copying 3 resources

[INFO] --- maven-resources-plugin:2.6:testResources (default-testResources) @ james-server-data-hbase
---
[INFO] [INFO] Changes detected - recompiling the module!
[INFO] Compiling 4 source files to <https://builds.apache.org/job/james-server-trunk/org.apache.james$james-server-data-hbase/ws/target/test-classes>

[INFO] --- maven-compiler-plugin:3.0:testCompile (default-testCompile) @ james-server-data-hbase
---
[WARNING] <https://builds.apache.org/job/james-server-trunk/org.apache.james$james-server-data-hbase/ws/src/test/java/org/apache/james/system/hbase/TablePoolTest.java>:
<https://builds.apache.org/job/james-server-trunk/org.apache.james$james-server-data-hbase/ws/src/test/java/org/apache/james/system/hbase/TablePoolTest.java>
uses or overrides a deprecated API.
[WARNING] <https://builds.apache.org/job/james-server-trunk/org.apache.james$james-server-data-hbase/ws/src/test/java/org/apache/james/system/hbase/TablePoolTest.java>:
Recompile with -Xlint:deprecation for details.
[INFO] [INFO] Skipping execution of surefire because it has already been run for this configuration

[INFO] --- maven-surefire-plugin:2.13:test (default-test) @ james-server-data-hbase ---
[JENKINS] Recording test results
[INFO] 
[INFO] --- maven-bundle-plugin:2.3.7:bundle (default-bundle) @ james-server-data-hbase ---
[INFO] 
[INFO] --- maven-jar-plugin:2.4:jar (jar) @ james-server-data-hbase ---
[INFO] 
[INFO] --- maven-jar-plugin:2.4:test-jar (test-jar) @ james-server-data-hbase ---
[INFO] Building jar: <https://builds.apache.org/job/james-server-trunk/org.apache.james$james-server-data-hbase/ws/target/james-server-data-hbase-3.0.0-beta5-SNAPSHOT-tests.jar>
[WARNING] Artifact org.apache.james:james-server-data-hbase:test-jar:tests:3.0.0-beta5-SNAPSHOT
already attached to project, ignoring duplicate
Jun 21, 2013 10:26:00 AM hudson.maven.ExecutedMojo <init>
WARNING: Failed to getClass for org.apache.maven.plugin.source.SourceJarMojo
[INFO] 
[INFO] --- maven-source-plugin:2.2.1:jar (attach-sources) @ james-server-data-hbase ---
[INFO] Building jar: <https://builds.apache.org/job/james-server-trunk/org.apache.james$james-server-data-hbase/ws/target/james-server-data-hbase-3.0.0-beta5-SNAPSHOT-sources.jar>
[WARNING] Artifact org.apache.james:james-server-data-hbase:java-source:sources:3.0.0-beta5-SNAPSHOT
already attached to project, ignoring duplicate
Jun 21, 2013 10:26:02 AM hudson.maven.ExecutedMojo <init>
WARNING: Failed to getClass for org.apache.maven.plugin.source.TestSourceJarMojo
[INFO] 
[INFO] --- maven-source-plugin:2.2.1:test-jar (attach-sources) @ james-server-data-hbase ---
[INFO] Building jar: <https://builds.apache.org/job/james-server-trunk/org.apache.james$james-server-data-hbase/ws/target/james-server-data-hbase-3.0.0-beta5-SNAPSHOT-test-sources.jar>
[WARNING] Artifact org.apache.james:james-server-data-hbase:java-source:test-sources:3.0.0-beta5-SNAPSHOT
already attached to project, ignoring duplicate
[INFO] 
[INFO] --- maven-site-plugin:3.2:attach-descriptor (attach-descriptor) @ james-server-data-hbase
---
[INFO] [INFO] Installing <https://builds.apache.org/job/james-server-trunk/org.apache.james$james-server-data-hbase/ws/target/james-server-data-hbase-3.0.0-beta5-SNAPSHOT.jar>
to /home/jenkins/jenkins-slave/maven-repositories/0/org/apache/james/james-server-data-hbase/3.0.0-beta5-SNAPSHOT/james-server-data-hbase-3.0.0-beta5-SNAPSHOT.jar
[INFO] Installing <https://builds.apache.org/job/james-server-trunk/org.apache.james$james-server-data-hbase/ws/pom.xml>
to /home/jenkins/jenkins-slave/maven-repositories/0/org/apache/james/james-server-data-hbase/3.0.0-beta5-SNAPSHOT/james-server-data-hbase-3.0.0-beta5-SNAPSHOT.pom
[INFO] Installing <https://builds.apache.org/job/james-server-trunk/org.apache.james$james-server-data-hbase/ws/target/james-server-data-hbase-3.0.0-beta5-SNAPSHOT-tests.jar>
to /home/jenkins/jenkins-slave/maven-repositories/0/org/apache/james/james-server-data-hbase/3.0.0-beta5-SNAPSHOT/james-server-data-hbase-3.0.0-beta5-SNAPSHOT-tests.jar
[INFO] Installing <https://builds.apache.org/job/james-server-trunk/org.apache.james$james-server-data-hbase/ws/target/james-server-data-hbase-3.0.0-beta5-SNAPSHOT-sources.jar>
to /home/jenkins/jenkins-slave/maven-repositories/0/org/apache/james/james-server-data-hbase/3.0.0-beta5-SNAPSHOT/james-server-data-hbase-3.0.0-beta5-SNAPSHOT-sources.jar
[INFO] Installing <https://builds.apache.org/job/james-server-trunk/org.apache.james$james-server-data-hbase/ws/target/james-server-data-hbase-3.0.0-beta5-SNAPSHOT-test-sources.jar>
to /home/jenkins/jenkins-slave/maven-repositories/0/org/apache/james/james-server-data-hbase/3.0.0-beta5-SNAPSHOT/james-server-data-hbase-3.0.0-beta5-SNAPSHOT-test-sources.jar

[INFO] --- maven-install-plugin:2.3.1:install (default-install) @ james-server-data-hbase
---
[INFO] 
[INFO] --- maven-bundle-plugin:2.3.7:install (default-install) @ james-server-data-hbase ---
[INFO] Installing org/apache/james/james-server-data-hbase/3.0.0-beta5-SNAPSHOT/james-server-data-hbase-3.0.0-beta5-SNAPSHOT.jar
[INFO] Writing OBR metadata
[INFO] Downloading: https://repository.apache.org/content/repositories/snapshots/org/apache/james/james-server-data-hbase/3.0.0-beta5-SNAPSHOT/maven-metadata.xml

[INFO] --- maven-deploy-plugin:2.7:deploy (default-deploy) @ james-server-data-hbase ---
Downloaded: https://repository.apache.org/content/repositories/snapshots/org/apache/james/james-server-data-hbase/3.0.0-beta5-SNAPSHOT/maven-metadata.xml
(2 KB at 2.5 KB/sec)
Uploading: https://repository.apache.org/content/repositories/snapshots/org/apache/james/james-server-data-hbase/3.0.0-beta5-SNAPSHOT/james-server-data-hbase-3.0.0-beta5-20130621.102608-128.jar
Uploaded: https://repository.apache.org/content/repositories/snapshots/org/apache/james/james-server-data-hbase/3.0.0-beta5-SNAPSHOT/james-server-data-hbase-3.0.0-beta5-20130621.102608-128.jar
(30 KB at 78.6 KB/sec)
Uploading: https://repository.apache.org/content/repositories/snapshots/org/apache/james/james-server-data-hbase/3.0.0-beta5-SNAPSHOT/james-server-data-hbase-3.0.0-beta5-20130621.102608-128.pom
Uploaded: https://repository.apache.org/content/repositories/snapshots/org/apache/james/james-server-data-hbase/3.0.0-beta5-SNAPSHOT/james-server-data-hbase-3.0.0-beta5-20130621.102608-128.pom
(7 KB at 18.4 KB/sec)
Downloading: https://repository.apache.org/content/repositories/snapshots/org/apache/james/james-server-data-hbase/maven-metadata.xml
Downloaded: https://repository.apache.org/content/repositories/snapshots/org/apache/james/james-server-data-hbase/maven-metadata.xml
(371 B at 1.3 KB/sec)
Uploading: https://repository.apache.org/content/repositories/snapshots/org/apache/james/james-server-data-hbase/3.0.0-beta5-SNAPSHOT/maven-metadata.xml
Uploaded: https://repository.apache.org/content/repositories/snapshots/org/apache/james/james-server-data-hbase/3.0.0-beta5-SNAPSHOT/maven-metadata.xml
(2 KB at 4.4 KB/sec)
Uploading: https://repository.apache.org/content/repositories/snapshots/org/apache/james/james-server-data-hbase/maven-metadata.xml
Uploaded: https://repository.apache.org/content/repositories/snapshots/org/apache/james/james-server-data-hbase/maven-metadata.xml
(371 B at 1.1 KB/sec)
Uploading: https://repository.apache.org/content/repositories/snapshots/org/apache/james/james-server-data-hbase/3.0.0-beta5-SNAPSHOT/james-server-data-hbase-3.0.0-beta5-20130621.102608-128-tests.jar
Uploaded: https://repository.apache.org/content/repositories/snapshots/org/apache/james/james-server-data-hbase/3.0.0-beta5-SNAPSHOT/james-server-data-hbase-3.0.0-beta5-20130621.102608-128-tests.jar
(19 KB at 52.4 KB/sec)
Uploading: https://repository.apache.org/content/repositories/snapshots/org/apache/james/james-server-data-hbase/3.0.0-beta5-SNAPSHOT/maven-metadata.xml
Uploaded: https://repository.apache.org/content/repositories/snapshots/org/apache/james/james-server-data-hbase/3.0.0-beta5-SNAPSHOT/maven-metadata.xml
(2 KB at 4.6 KB/sec)
Uploading: https://repository.apache.org/content/repositories/snapshots/org/apache/james/james-server-data-hbase/3.0.0-beta5-SNAPSHOT/james-server-data-hbase-3.0.0-beta5-20130621.102608-128-sources.jar
Uploaded: https://repository.apache.org/content/repositories/snapshots/org/apache/james/james-server-data-hbase/3.0.0-beta5-SNAPSHOT/james-server-data-hbase-3.0.0-beta5-20130621.102608-128-sources.jar
(22 KB at 59.6 KB/sec)
Uploading: https://repository.apache.org/content/repositories/snapshots/org/apache/james/james-server-data-hbase/3.0.0-beta5-SNAPSHOT/maven-metadata.xml
Uploaded: https://repository.apache.org/content/repositories/snapshots/org/apache/james/james-server-data-hbase/3.0.0-beta5-SNAPSHOT/maven-metadata.xml
(2 KB at 4.5 KB/sec)
Uploading: https://repository.apache.org/content/repositories/snapshots/org/apache/james/james-server-data-hbase/3.0.0-beta5-SNAPSHOT/james-server-data-hbase-3.0.0-beta5-20130621.102608-128-test-sources.jar
Uploaded: https://repository.apache.org/content/repositories/snapshots/org/apache/james/james-server-data-hbase/3.0.0-beta5-SNAPSHOT/james-server-data-hbase-3.0.0-beta5-20130621.102608-128-test-sources.jar
(16 KB at 46.3 KB/sec)
Uploading: https://repository.apache.org/content/repositories/snapshots/org/apache/james/james-server-data-hbase/3.0.0-beta5-SNAPSHOT/maven-metadata.xml
Uploaded: https://repository.apache.org/content/repositories/snapshots/org/apache/james/james-server-data-hbase/3.0.0-beta5-SNAPSHOT/maven-metadata.xml
(2 KB at 4.5 KB/sec)

---------------------------------------------------------------------
To unsubscribe, e-mail: server-dev-unsubscribe@james.apache.org
For additional commands, e-mail: server-dev-help@james.apache.org


Mime
View raw message