james-server-dev mailing list archives

Site index · List index
Message view « Date » · « Thread »
Top « Date » · « Thread »
From Apache Jenkins Server <jenk...@builds.apache.org>
Subject Build failed in Jenkins: james-server-trunk #3875
Date Sat, 01 Jun 2013 15:18:34 GMT
See <https://builds.apache.org/job/james-server-trunk/3875/>

------------------------------------------
[...truncated 8715 lines...]
	at java.util.concurrent.ThreadPoolExecutor.runWorker(ThreadPoolExecutor.java:1146)
	at java.util.concurrent.ThreadPoolExecutor$Worker.run(ThreadPoolExecutor.java:615)
	at java.lang.Thread.run(Thread.java:679)
Caused by: org.xmlpull.v1.XmlPullParserException: unexpected type (position:END_DOCUMENT null@3:1
in java.io.InputStreamReader@4d1b5e2e) 
	at org.kxml2.io.KXmlParser.exception(Unknown Source)
	at org.kxml2.io.KXmlParser.nextTag(Unknown Source)
	at org.apache.felix.bundlerepository.impl.PullParser.parseRepository(PullParser.java:43)
	at org.apache.felix.bundlerepository.impl.DataModelHelperImpl.repository(DataModelHelperImpl.java:147)
	at org.apache.felix.bundlerepository.impl.DataModelHelperImpl.repository(DataModelHelperImpl.java:118)
	at org.apache.felix.obrplugin.ObrUpdate.parseRepositoryXml(ObrUpdate.java:316)
	... 30 more

[INFO] --- maven-bundle-plugin:2.3.7:install (default-install) @ james-server-data-jdbc ---
[INFO] Downloading: https://repository.apache.org/content/repositories/snapshots/org/apache/james/james-server-data-jdbc/3.0.0-beta5-SNAPSHOT/maven-metadata.xml

[INFO] --- maven-deploy-plugin:2.7:deploy (default-deploy) @ james-server-data-jdbc ---
Downloaded: https://repository.apache.org/content/repositories/snapshots/org/apache/james/james-server-data-jdbc/3.0.0-beta5-SNAPSHOT/maven-metadata.xml
(2 KB at 4.9 KB/sec)
Uploading: https://repository.apache.org/content/repositories/snapshots/org/apache/james/james-server-data-jdbc/3.0.0-beta5-SNAPSHOT/james-server-data-jdbc-3.0.0-beta5-20130601.151556-112.jar
Uploaded: https://repository.apache.org/content/repositories/snapshots/org/apache/james/james-server-data-jdbc/3.0.0-beta5-SNAPSHOT/james-server-data-jdbc-3.0.0-beta5-20130601.151556-112.jar
(48 KB at 134.4 KB/sec)
Uploading: https://repository.apache.org/content/repositories/snapshots/org/apache/james/james-server-data-jdbc/3.0.0-beta5-SNAPSHOT/james-server-data-jdbc-3.0.0-beta5-20130601.151556-112.pom
Uploaded: https://repository.apache.org/content/repositories/snapshots/org/apache/james/james-server-data-jdbc/3.0.0-beta5-SNAPSHOT/james-server-data-jdbc-3.0.0-beta5-20130601.151556-112.pom
(5 KB at 13.9 KB/sec)
Downloading: https://repository.apache.org/content/repositories/snapshots/org/apache/james/james-server-data-jdbc/maven-metadata.xml
Downloaded: https://repository.apache.org/content/repositories/snapshots/org/apache/james/james-server-data-jdbc/maven-metadata.xml
(370 B at 1.3 KB/sec)
Uploading: https://repository.apache.org/content/repositories/snapshots/org/apache/james/james-server-data-jdbc/3.0.0-beta5-SNAPSHOT/maven-metadata.xml
Uploaded: https://repository.apache.org/content/repositories/snapshots/org/apache/james/james-server-data-jdbc/3.0.0-beta5-SNAPSHOT/maven-metadata.xml
(2 KB at 4.4 KB/sec)
Uploading: https://repository.apache.org/content/repositories/snapshots/org/apache/james/james-server-data-jdbc/maven-metadata.xml
Uploaded: https://repository.apache.org/content/repositories/snapshots/org/apache/james/james-server-data-jdbc/maven-metadata.xml
(370 B at 1.0 KB/sec)
Uploading: https://repository.apache.org/content/repositories/snapshots/org/apache/james/james-server-data-jdbc/3.0.0-beta5-SNAPSHOT/james-server-data-jdbc-3.0.0-beta5-20130601.151556-112-tests.jar
Uploaded: https://repository.apache.org/content/repositories/snapshots/org/apache/james/james-server-data-jdbc/3.0.0-beta5-SNAPSHOT/james-server-data-jdbc-3.0.0-beta5-20130601.151556-112-tests.jar
(29 KB at 72.6 KB/sec)
Uploading: https://repository.apache.org/content/repositories/snapshots/org/apache/james/james-server-data-jdbc/3.0.0-beta5-SNAPSHOT/maven-metadata.xml
Uploaded: https://repository.apache.org/content/repositories/snapshots/org/apache/james/james-server-data-jdbc/3.0.0-beta5-SNAPSHOT/maven-metadata.xml
(2 KB at 4.1 KB/sec)
Uploading: https://repository.apache.org/content/repositories/snapshots/org/apache/james/james-server-data-jdbc/3.0.0-beta5-SNAPSHOT/james-server-data-jdbc-3.0.0-beta5-20130601.151556-112-sources.jar
Uploaded: https://repository.apache.org/content/repositories/snapshots/org/apache/james/james-server-data-jdbc/3.0.0-beta5-SNAPSHOT/james-server-data-jdbc-3.0.0-beta5-20130601.151556-112-sources.jar
(34 KB at 81.1 KB/sec)
Uploading: https://repository.apache.org/content/repositories/snapshots/org/apache/james/james-server-data-jdbc/3.0.0-beta5-SNAPSHOT/maven-metadata.xml
Uploaded: https://repository.apache.org/content/repositories/snapshots/org/apache/james/james-server-data-jdbc/3.0.0-beta5-SNAPSHOT/maven-metadata.xml
(2 KB at 4.0 KB/sec)
Uploading: https://repository.apache.org/content/repositories/snapshots/org/apache/james/james-server-data-jdbc/3.0.0-beta5-SNAPSHOT/james-server-data-jdbc-3.0.0-beta5-20130601.151556-112-test-sources.jar
Uploaded: https://repository.apache.org/content/repositories/snapshots/org/apache/james/james-server-data-jdbc/3.0.0-beta5-SNAPSHOT/james-server-data-jdbc-3.0.0-beta5-20130601.151556-112-test-sources.jar
(27 KB at 66.0 KB/sec)
Uploading: https://repository.apache.org/content/repositories/snapshots/org/apache/james/james-server-data-jdbc/3.0.0-beta5-SNAPSHOT/maven-metadata.xml
Uploaded: https://repository.apache.org/content/repositories/snapshots/org/apache/james/james-server-data-jdbc/3.0.0-beta5-SNAPSHOT/maven-metadata.xml
(2 KB at 4.2 KB/sec)
[INFO] [INFO] Remote OBR update disabled (enable with -DremoteOBR)

[INFO] --- maven-bundle-plugin:2.3.7:deploy (default-deploy) @ james-server-data-jdbc ---
[INFO]                                                                         
[INFO] ------------------------------------------------------------------------
[INFO] Building Apache James :: Server :: Data :: HBase Persistence 3.0.0-beta5-SNAPSHOT
[INFO] ------------------------------------------------------------------------
Downloading: http://repository.apache.org/snapshots/org/apache/james/apache-james-mailbox-hbase/0.6-SNAPSHOT/maven-metadata.xml
Downloaded: http://repository.apache.org/snapshots/org/apache/james/apache-james-mailbox-hbase/0.6-SNAPSHOT/maven-metadata.xml
(2 KB at 3.7 KB/sec)
Downloading: http://repository.apache.org/snapshots/org/apache/james/apache-james-mailbox-hbase/0.6-SNAPSHOT/apache-james-mailbox-hbase-0.6-20130601.103030-61.pom
Downloaded: http://repository.apache.org/snapshots/org/apache/james/apache-james-mailbox-hbase/0.6-SNAPSHOT/apache-james-mailbox-hbase-0.6-20130601.103030-61.pom
(6 KB at 37.3 KB/sec)
Downloading: http://repository.apache.org/snapshots/org/apache/james/apache-james-mailbox-hbase/0.6-SNAPSHOT/apache-james-mailbox-hbase-0.6-20130601.103030-61-tests.jar
Downloaded: http://repository.apache.org/snapshots/org/apache/james/apache-james-mailbox-hbase/0.6-SNAPSHOT/apache-james-mailbox-hbase-0.6-20130601.103030-61-tests.jar
(42 KB at 193.3 KB/sec)
[INFO] [INFO] Deleting <https://builds.apache.org/job/james-server-trunk/ws/trunk/data/data-hbase/target>

[INFO] --- maven-clean-plugin:2.5:clean (default-clean) @ james-server-data-hbase ---
[INFO] 
[INFO] --- maven-remote-resources-plugin:1.4:process (default) @ james-server-data-hbase ---
[INFO] Using 'UTF-8' encoding to copy filtered resources.
[INFO] [INFO] skip non existing resourceDirectory <https://builds.apache.org/job/james-server-trunk/ws/trunk/data/data-hbase/src/main/resources>
[INFO] Copying 3 resources

[INFO] --- maven-resources-plugin:2.6:resources (default-resources) @ james-server-data-hbase
---
[INFO] 
[INFO] --- maven-compiler-plugin:3.0:compile (default-compile) @ james-server-data-hbase ---
[INFO] Changes detected - recompiling the module!
[INFO] Compiling 7 source files to <https://builds.apache.org/job/james-server-trunk/ws/trunk/data/data-hbase/target/classes>
[INFO] [INFO] Using 'UTF-8' encoding to copy filtered resources.
[INFO] Copying 2 resources
[INFO] Copying 3 resources

[INFO] --- maven-resources-plugin:2.6:testResources (default-testResources) @ james-server-data-hbase
---
[INFO] 
[INFO] --- maven-compiler-plugin:3.0:testCompile (default-testCompile) @ james-server-data-hbase
---
[INFO] Changes detected - recompiling the module!
[INFO] Compiling 4 source files to <https://builds.apache.org/job/james-server-trunk/ws/trunk/data/data-hbase/target/test-classes>
[WARNING] <https://builds.apache.org/job/james-server-trunk/ws/trunk/data/data-hbase/src/test/java/org/apache/james/system/hbase/TablePoolTest.java>:
<https://builds.apache.org/job/james-server-trunk/ws/trunk/data/data-hbase/src/test/java/org/apache/james/system/hbase/TablePoolTest.java>
uses or overrides a deprecated API.
[WARNING] <https://builds.apache.org/job/james-server-trunk/ws/trunk/data/data-hbase/src/test/java/org/apache/james/system/hbase/TablePoolTest.java>:
Recompile with -Xlint:deprecation for details.
[INFO] [INFO] Surefire report directory: <https://builds.apache.org/job/james-server-trunk/ws/trunk/data/data-hbase/target/surefire-reports>

-------------------------------------------------------
 T E S T S
-------------------------------------------------------

-------------------------------------------------------
 T E S T S
-------------------------------------------------------

[INFO] --- maven-surefire-plugin:2.13:test (default-test) @ james-server-data-hbase ---
Running org.apache.james.rrt.hbase.HBaseRecipientRewriteTableTest
SLF4J: Class path contains multiple SLF4J bindings.
SLF4J: Found binding in [jar:file:/home/jenkins/jenkins-slave/maven-repositories/0/org/slf4j/slf4j-log4j12/1.7.2/slf4j-log4j12-1.7.2.jar!/org/slf4j/impl/StaticLoggerBinder.class]
SLF4J: Found binding in [jar:file:/home/jenkins/jenkins-slave/maven-repositories/0/org/slf4j/slf4j-simple/1.7.2/slf4j-simple-1.7.2.jar!/org/slf4j/impl/StaticLoggerBinder.class]
SLF4J: See http://www.slf4j.org/codes.html#multiple_bindings for an explanation.
SLF4J: Actual binding is of type [org.slf4j.impl.Log4jLoggerFactory]
2013-06-01 15:16:13,844 [main] WARN  org.apache.hadoop.hdfs.server.namenode.FSNamesystem -
The dfs.support.append option is in your configuration, however append is not supported. This
configuration option is no longer required to enable sync.
2013-06-01 15:16:15,090 [main] WARN  org.apache.hadoop.metrics2.impl.MetricsSystemImpl - Source
name ugi already exists!
2013-06-01 15:16:15,116 [main] WARN  org.apache.hadoop.metrics2.impl.MetricsSystemImpl - Source
name ugi already exists!
2013-06-01 15:16:15,127 [main] WARN  org.apache.hadoop.hdfs.server.namenode.FSNamesystem -
The dfs.support.append option is in your configuration, however append is not supported. This
configuration option is no longer required to enable sync.
Starting DataNode 0 with dfs.data.dir: <https://builds.apache.org/job/james-server-trunk/ws/trunk/data/data-hbase/target/test-data/830e2c8f-9179-4da8-871a-76ff5eef046c/dfscluster_27118be9-5611-40d1-9cd0-f211d339d97b/dfs/data/data1,/home/jenkins/jenkins-slave/workspace/james-server-trunk/trunk/data/data-hbase/target/test-data/830e2c8f-9179-4da8-871a-76ff5eef046c/dfscluster_27118be9-5611-40d1-9cd0-f211d339d97b/dfs/data/data2>
2013-06-01 15:16:16,274 [main] WARN  org.apache.hadoop.metrics2.impl.MetricsSystemImpl - NameNode
metrics system already initialized!
2013-06-01 15:16:16,274 [main] WARN  org.apache.hadoop.metrics2.impl.MetricsSystemImpl - Source
name ugi already exists!
2013-06-01 15:16:17,260 [main] WARN  org.apache.hadoop.metrics2.impl.MetricsSystemImpl - Source
name jvm already exists!
Cluster is active
2013-06-01 15:16:18,608 [org.apache.hadoop.hdfs.server.datanode.DataXceiver@55f35e30] WARN
 org.apache.hadoop.util.NativeCodeLoader - Unable to load native-hadoop library for your platform...
using builtin-java classes where applicable
2013-06-01 15:16:28,213 [Master:0;janus.apache.org,45421,1370099778074] WARN  org.apache.hadoop.hbase.zookeeper.RecoverableZooKeeper
- Node /hbase/root-region-server already deleted, and this is not a retry
2013-06-01 15:16:38,270 [main] ERROR MockLog - Exception during regexMap processing: 
java.util.regex.PatternSyntaxException: Regex should be formatted as regex:<regular-expression>:<parameterized-string>
near index 0
regex:(.*)@localhost
^
	at org.apache.james.rrt.lib.RecipientRewriteTableUtil.regexMap(RecipientRewriteTableUtil.java:67)
	at org.apache.james.rrt.lib.AbstractRecipientRewriteTable.getMappings(AbstractRecipientRewriteTable.java:137)
	at org.apache.james.rrt.lib.AbstractRecipientRewriteTable.getMappings(AbstractRecipientRewriteTable.java:114)
	at org.apache.james.rrt.lib.AbstractRecipientRewriteTableTest.testStoreAndRetrieveRegexMapping(AbstractRecipientRewriteTableTest.java:96)
	at sun.reflect.NativeMethodAccessorImpl.invoke0(Native Method)
	at sun.reflect.NativeMethodAccessorImpl.invoke(NativeMethodAccessorImpl.java:57)
	at sun.reflect.DelegatingMethodAccessorImpl.invoke(DelegatingMethodAccessorImpl.java:43)
	at java.lang.reflect.Method.invoke(Method.java:616)
	at org.junit.runners.model.FrameworkMethod$1.runReflectiveCall(FrameworkMethod.java:47)
	at org.junit.internal.runners.model.ReflectiveCallable.run(ReflectiveCallable.java:12)
	at org.junit.runners.model.FrameworkMethod.invokeExplosively(FrameworkMethod.java:44)
	at org.junit.internal.runners.statements.InvokeMethod.evaluate(InvokeMethod.java:17)
	at org.junit.internal.runners.statements.RunBefores.evaluate(RunBefores.java:26)
	at org.junit.internal.runners.statements.RunAfters.evaluate(RunAfters.java:27)
	at org.junit.runners.ParentRunner.runLeaf(ParentRunner.java:271)
	at org.junit.runners.BlockJUnit4ClassRunner.runChild(BlockJUnit4ClassRunner.java:70)
	at org.junit.runners.BlockJUnit4ClassRunner.runChild(BlockJUnit4ClassRunner.java:50)
	at org.junit.runners.ParentRunner$3.run(ParentRunner.java:238)
	at org.junit.runners.ParentRunner$1.schedule(ParentRunner.java:63)
	at org.junit.runners.ParentRunner.runChildren(ParentRunner.java:236)
	at org.junit.runners.ParentRunner.access$000(ParentRunner.java:53)
	at org.junit.runners.ParentRunner$2.evaluate(ParentRunner.java:229)
	at org.junit.runners.ParentRunner.run(ParentRunner.java:309)
	at org.apache.maven.surefire.junit4.JUnit4Provider.execute(JUnit4Provider.java:264)
	at org.apache.maven.surefire.junit4.JUnit4Provider.executeTestSet(JUnit4Provider.java:153)
	at org.apache.maven.surefire.junit4.JUnit4Provider.invoke(JUnit4Provider.java:124)
	at sun.reflect.NativeMethodAccessorImpl.invoke0(Native Method)
	at sun.reflect.NativeMethodAccessorImpl.invoke(NativeMethodAccessorImpl.java:57)
	at sun.reflect.DelegatingMethodAccessorImpl.invoke(DelegatingMethodAccessorImpl.java:43)
	at java.lang.reflect.Method.invoke(Method.java:616)
	at org.apache.maven.surefire.util.ReflectionUtils.invokeMethodWithArray2(ReflectionUtils.java:208)
	at org.apache.maven.surefire.booter.ProviderFactory$ProviderProxy.invoke(ProviderFactory.java:158)
	at org.apache.maven.surefire.booter.ProviderFactory.invokeProvider(ProviderFactory.java:86)
	at org.apache.maven.surefire.booter.ForkedBooter.runSuitesInProcess(ForkedBooter.java:153)
	at org.apache.maven.surefire.booter.ForkedBooter.main(ForkedBooter.java:95)
2013-06-01 15:16:38,284 [main] ERROR MockLog - Exception during regexMap processing: 
java.util.regex.PatternSyntaxException: Regex should be formatted as regex:<regular-expression>:<parameterized-string>
near index 0
regex:(.+)@test
^
	at org.apache.james.rrt.lib.RecipientRewriteTableUtil.regexMap(RecipientRewriteTableUtil.java:67)
	at org.apache.james.rrt.lib.AbstractRecipientRewriteTable.getMappings(AbstractRecipientRewriteTable.java:137)
	at org.apache.james.rrt.lib.AbstractRecipientRewriteTable.getMappings(AbstractRecipientRewriteTable.java:114)
	at org.apache.james.rrt.lib.AbstractRecipientRewriteTableTest.testStoreAndRetrieveRegexMapping(AbstractRecipientRewriteTableTest.java:96)
	at sun.reflect.NativeMethodAccessorImpl.invoke0(Native Method)
	at sun.reflect.NativeMethodAccessorImpl.invoke(NativeMethodAccessorImpl.java:57)
	at sun.reflect.DelegatingMethodAccessorImpl.invoke(DelegatingMethodAccessorImpl.java:43)
	at java.lang.reflect.Method.invoke(Method.java:616)
	at org.junit.runners.model.FrameworkMethod$1.runReflectiveCall(FrameworkMethod.java:47)
	at org.junit.internal.runners.model.ReflectiveCallable.run(ReflectiveCallable.java:12)
	at org.junit.runners.model.FrameworkMethod.invokeExplosively(FrameworkMethod.java:44)
	at org.junit.internal.runners.statements.InvokeMethod.evaluate(InvokeMethod.java:17)
	at org.junit.internal.runners.statements.RunBefores.evaluate(RunBefores.java:26)
	at org.junit.internal.runners.statements.RunAfters.evaluate(RunAfters.java:27)
	at org.junit.runners.ParentRunner.runLeaf(ParentRunner.java:271)
	at org.junit.runners.BlockJUnit4ClassRunner.runChild(BlockJUnit4ClassRunner.java:70)
	at org.junit.runners.BlockJUnit4ClassRunner.runChild(BlockJUnit4ClassRunner.java:50)
	at org.junit.runners.ParentRunner$3.run(ParentRunner.java:238)
	at org.junit.runners.ParentRunner$1.schedule(ParentRunner.java:63)
	at org.junit.runners.ParentRunner.runChildren(ParentRunner.java:236)
	at org.junit.runners.ParentRunner.access$000(ParentRunner.java:53)
	at org.junit.runners.ParentRunner$2.evaluate(ParentRunner.java:229)
	at org.junit.runners.ParentRunner.run(ParentRunner.java:309)
	at org.apache.maven.surefire.junit4.JUnit4Provider.execute(JUnit4Provider.java:264)
	at org.apache.maven.surefire.junit4.JUnit4Provider.executeTestSet(JUnit4Provider.java:153)
	at org.apache.maven.surefire.junit4.JUnit4Provider.invoke(JUnit4Provider.java:124)
	at sun.reflect.NativeMethodAccessorImpl.invoke0(Native Method)
	at sun.reflect.NativeMethodAccessorImpl.invoke(NativeMethodAccessorImpl.java:57)
	at sun.reflect.DelegatingMethodAccessorImpl.invoke(DelegatingMethodAccessorImpl.java:43)
	at java.lang.reflect.Method.invoke(Method.java:616)
	at org.apache.maven.surefire.util.ReflectionUtils.invokeMethodWithArray2(ReflectionUtils.java:208)
	at org.apache.maven.surefire.booter.ProviderFactory$ProviderProxy.invoke(ProviderFactory.java:158)
	at org.apache.maven.surefire.booter.ProviderFactory.invokeProvider(ProviderFactory.java:86)
	at org.apache.maven.surefire.booter.ForkedBooter.runSuitesInProcess(ForkedBooter.java:153)
	at org.apache.maven.surefire.booter.ForkedBooter.main(ForkedBooter.java:95)
Tests run: 6, Failures: 0, Errors: 0, Skipped: 0, Time elapsed: 25.696 sec
2013-06-01 15:16:40,892 [RegionServer:0;janus.apache.org,51632,1370099778539] WARN  org.apache.hadoop.hbase.regionserver.HRegionServer
- Received close for region we are already opening or closing; 70236052
Running org.apache.james.domainlist.hbase.HBaseDomainListTest
SLF4J: Class path contains multiple SLF4J bindings.
SLF4J: Found binding in [jar:file:/home/jenkins/jenkins-slave/maven-repositories/0/org/slf4j/slf4j-log4j12/1.7.2/slf4j-log4j12-1.7.2.jar!/org/slf4j/impl/StaticLoggerBinder.class]
SLF4J: Found binding in [jar:file:/home/jenkins/jenkins-slave/maven-repositories/0/org/slf4j/slf4j-simple/1.7.2/slf4j-simple-1.7.2.jar!/org/slf4j/impl/StaticLoggerBinder.class]
SLF4J: See http://www.slf4j.org/codes.html#multiple_bindings for an explanation.
SLF4J: Actual binding is of type [org.slf4j.impl.Log4jLoggerFactory]
2013-06-01 15:16:44,488 [main] WARN  org.apache.hadoop.hdfs.server.namenode.FSNamesystem -
The dfs.support.append option is in your configuration, however append is not supported. This
configuration option is no longer required to enable sync.
2013-06-01 15:16:45,376 [main] WARN  org.apache.hadoop.metrics2.impl.MetricsSystemImpl - Source
name ugi already exists!
2013-06-01 15:16:45,403 [main] WARN  org.apache.hadoop.metrics2.impl.MetricsSystemImpl - Source
name ugi already exists!
2013-06-01 15:16:45,413 [main] WARN  org.apache.hadoop.hdfs.server.namenode.FSNamesystem -
The dfs.support.append option is in your configuration, however append is not supported. This
configuration option is no longer required to enable sync.
Starting DataNode 0 with dfs.data.dir: <https://builds.apache.org/job/james-server-trunk/ws/trunk/data/data-hbase/target/test-data/b8cd0f6a-e624-4891-9e8f-589de424cb7d/dfscluster_4c3452cc-3e59-4ef4-a6f0-2b2eac9ed5f5/dfs/data/data1,/home/jenkins/jenkins-slave/workspace/james-server-trunk/trunk/data/data-hbase/target/test-data/b8cd0f6a-e624-4891-9e8f-589de424cb7d/dfscluster_4c3452cc-3e59-4ef4-a6f0-2b2eac9ed5f5/dfs/data/data2>
2013-06-01 15:16:46,457 [main] WARN  org.apache.hadoop.metrics2.impl.MetricsSystemImpl - NameNode
metrics system already initialized!
2013-06-01 15:16:46,458 [main] WARN  org.apache.hadoop.metrics2.impl.MetricsSystemImpl - Source
name ugi already exists!
2013-06-01 15:16:47,398 [main] WARN  org.apache.hadoop.metrics2.impl.MetricsSystemImpl - Source
name jvm already exists!
Cluster is active
2013-06-01 15:16:49,120 [org.apache.hadoop.hdfs.server.datanode.DataXceiver@63f796d0] WARN
 org.apache.hadoop.util.NativeCodeLoader - Unable to load native-hadoop library for your platform...
using builtin-java classes where applicable
2013-06-01 15:16:58,796 [Master:0;janus.apache.org,55115,1370099808589] WARN  org.apache.hadoop.hbase.zookeeper.RecoverableZooKeeper
- Node /hbase/root-region-server already deleted, and this is not a retry
Tests run: 5, Failures: 0, Errors: 0, Skipped: 0, Time elapsed: 23.533 sec
2013-06-01 15:17:08,494 [RegionServer:0;janus.apache.org,39753,1370099809000] WARN  org.apache.hadoop.hbase.regionserver.HRegionServer
- Received close for region we are already opening or closing; 70236052
Running org.apache.james.system.hbase.TablePoolTest
SLF4J: Class path contains multiple SLF4J bindings.
SLF4J: Found binding in [jar:file:/home/jenkins/jenkins-slave/maven-repositories/0/org/slf4j/slf4j-log4j12/1.7.2/slf4j-log4j12-1.7.2.jar!/org/slf4j/impl/StaticLoggerBinder.class]
SLF4J: Found binding in [jar:file:/home/jenkins/jenkins-slave/maven-repositories/0/org/slf4j/slf4j-simple/1.7.2/slf4j-simple-1.7.2.jar!/org/slf4j/impl/StaticLoggerBinder.class]
SLF4J: See http://www.slf4j.org/codes.html#multiple_bindings for an explanation.
SLF4J: Actual binding is of type [org.slf4j.impl.Log4jLoggerFactory]
2013-06-01 15:17:12,971 [main] WARN  org.apache.hadoop.hdfs.server.namenode.FSNamesystem -
The dfs.support.append option is in your configuration, however append is not supported. This
configuration option is no longer required to enable sync.
2013-06-01 15:17:14,084 [main] WARN  org.apache.hadoop.metrics2.impl.MetricsSystemImpl - Source
name ugi already exists!
2013-06-01 15:17:14,111 [main] WARN  org.apache.hadoop.metrics2.impl.MetricsSystemImpl - Source
name ugi already exists!
2013-06-01 15:17:14,121 [main] WARN  org.apache.hadoop.hdfs.server.namenode.FSNamesystem -
The dfs.support.append option is in your configuration, however append is not supported. This
configuration option is no longer required to enable sync.
Starting DataNode 0 with dfs.data.dir: <https://builds.apache.org/job/james-server-trunk/ws/trunk/data/data-hbase/target/test-data/91217e57-743b-48a1-b0f2-ff0437beabd5/dfscluster_80451328-15a0-4e3c-a7a0-2c83ab4a3ff9/dfs/data/data1,/home/jenkins/jenkins-slave/workspace/james-server-trunk/trunk/data/data-hbase/target/test-data/91217e57-743b-48a1-b0f2-ff0437beabd5/dfscluster_80451328-15a0-4e3c-a7a0-2c83ab4a3ff9/dfs/data/data2>
2013-06-01 15:17:15,250 [main] WARN  org.apache.hadoop.metrics2.impl.MetricsSystemImpl - NameNode
metrics system already initialized!
2013-06-01 15:17:15,250 [main] WARN  org.apache.hadoop.metrics2.impl.MetricsSystemImpl - Source
name ugi already exists!
2013-06-01 15:17:16,171 [main] WARN  org.apache.hadoop.metrics2.impl.MetricsSystemImpl - Source
name jvm already exists!
Cluster is active
2013-06-01 15:17:17,885 [org.apache.hadoop.hdfs.server.datanode.DataXceiver@6af2f0d0] WARN
 org.apache.hadoop.util.NativeCodeLoader - Unable to load native-hadoop library for your platform...
using builtin-java classes where applicable
2013-06-01 15:17:27,209 [Master:0;janus.apache.org,53434,1370099837357] WARN  org.apache.hadoop.hbase.zookeeper.RecoverableZooKeeper
- Node /hbase/root-region-server already deleted, and this is not a retry
Tests run: 4, Failures: 0, Errors: 0, Skipped: 0, Time elapsed: 22.12 sec
2013-06-01 15:17:36,981 [RegionServer:0;janus.apache.org,44569,1370099837824] WARN  org.apache.hadoop.hbase.regionserver.HRegionServer
- Received close for region we are already opening or closing; 70236052
Running org.apache.james.user.hbase.HBaseUsersRepositoryTest
SLF4J: Class path contains multiple SLF4J bindings.
SLF4J: Found binding in [jar:file:/home/jenkins/jenkins-slave/maven-repositories/0/org/slf4j/slf4j-log4j12/1.7.2/slf4j-log4j12-1.7.2.jar!/org/slf4j/impl/StaticLoggerBinder.class]
SLF4J: Found binding in [jar:file:/home/jenkins/jenkins-slave/maven-repositories/0/org/slf4j/slf4j-simple/1.7.2/slf4j-simple-1.7.2.jar!/org/slf4j/impl/StaticLoggerBinder.class]
SLF4J: See http://www.slf4j.org/codes.html#multiple_bindings for an explanation.
SLF4J: Actual binding is of type [org.slf4j.impl.Log4jLoggerFactory]
2013-06-01 15:17:39,549 [main] WARN  org.apache.hadoop.hdfs.server.namenode.FSNamesystem -
The dfs.support.append option is in your configuration, however append is not supported. This
configuration option is no longer required to enable sync.
2013-06-01 15:17:40,545 [main] WARN  org.apache.hadoop.metrics2.impl.MetricsSystemImpl - Source
name ugi already exists!
2013-06-01 15:17:40,572 [main] WARN  org.apache.hadoop.metrics2.impl.MetricsSystemImpl - Source
name ugi already exists!
2013-06-01 15:17:40,582 [main] WARN  org.apache.hadoop.hdfs.server.namenode.FSNamesystem -
The dfs.support.append option is in your configuration, however append is not supported. This
configuration option is no longer required to enable sync.
Starting DataNode 0 with dfs.data.dir: <https://builds.apache.org/job/james-server-trunk/ws/trunk/data/data-hbase/target/test-data/8a4e3836-ef73-4d64-8842-214c4c8981a2/dfscluster_7d2a1bb4-f911-4d5f-9ea6-02d011ad418c/dfs/data/data1,/home/jenkins/jenkins-slave/workspace/james-server-trunk/trunk/data/data-hbase/target/test-data/8a4e3836-ef73-4d64-8842-214c4c8981a2/dfscluster_7d2a1bb4-f911-4d5f-9ea6-02d011ad418c/dfs/data/data2>
2013-06-01 15:17:41,642 [main] WARN  org.apache.hadoop.metrics2.impl.MetricsSystemImpl - NameNode
metrics system already initialized!
2013-06-01 15:17:41,642 [main] WARN  org.apache.hadoop.metrics2.impl.MetricsSystemImpl - Source
name ugi already exists!
2013-06-01 15:17:42,563 [main] WARN  org.apache.hadoop.metrics2.impl.MetricsSystemImpl - Source
name jvm already exists!
Cluster is active
2013-06-01 15:17:44,300 [org.apache.hadoop.hdfs.server.datanode.DataXceiver@bbef5e8] WARN
 org.apache.hadoop.util.NativeCodeLoader - Unable to load native-hadoop library for your platform...
using builtin-java classes where applicable
2013-06-01 15:17:51,945 [Master:0;janus.apache.org,38080,1370099863781] WARN  org.apache.hadoop.hbase.zookeeper.RecoverableZooKeeper
- Node /hbase/root-region-server already deleted, and this is not a retry
Tests run: 7, Failures: 0, Errors: 0, Skipped: 0, Time elapsed: 23.103 sec
2013-06-01 15:18:04,663 [RegionServer:0;janus.apache.org,54083,1370099864222] WARN  org.apache.hadoop.hbase.regionserver.HRegionServer
- Received close for region we are already opening or closing; 70236052

Results :

Tests run: 22, Failures: 0, Errors: 0, Skipped: 0

ERROR: Maven JVM terminated unexpectedly with exit code 143


---------------------------------------------------------------------
To unsubscribe, e-mail: server-dev-unsubscribe@james.apache.org
For additional commands, e-mail: server-dev-help@james.apache.org


Mime
View raw message