james-server-dev mailing list archives

Site index · List index
Message view « Date » · « Thread »
Top « Date » · « Thread »
From Apache Jenkins Server <jenk...@builds.apache.org>
Subject Build failed in Jenkins: james-mailet #2106
Date Sun, 23 Jun 2013 04:05:12 GMT
See <https://builds.apache.org/job/james-mailet/2106/>

------------------------------------------
Started by timer
Building remotely on ubuntu2 in workspace <https://builds.apache.org/job/james-mailet/ws/>
Updating http://svn.apache.org/repos/asf/james/mailet/trunk
At revision 1495790
no change for http://svn.apache.org/repos/asf/james/mailet/trunk since the previous build
Parsing POMs
Modules changed, recalculating dependency graph
[trunk] $ /home/hudson/tools/java/latest1.6/bin/java -cp /home/jenkins/jenkins-slave/maven3-agent.jar:/home/hudson/tools/maven/apache-maven-3.0.4/boot/plexus-classworlds-2.4.jar
org.jvnet.hudson.maven3.agent.Maven3Main /home/hudson/tools/maven/apache-maven-3.0.4 /home/hudson/jenkins-slave/slave.jar
/home/jenkins/jenkins-slave/maven3-interceptor.jar 52326
<===[JENKINS REMOTING CAPACITY]===>channel started
   log4j:WARN No appenders could be found for logger (org.apache.commons.beanutils.converters.BooleanConverter).
log4j:WARN Please initialize the log4j system properly.
Executing Maven:  -B -f <https://builds.apache.org/job/james-mailet/ws/trunk/pom.xml>
-Dmaven.repo.local=/home/jenkins/jenkins-slave/maven-repositories/1 clean deploy
[INFO] Scanning for projects...
[INFO] ------------------------------------------------------------------------
[INFO] Reactor Build Order:
[INFO] 
[INFO] Apache James :: Mailets parent and aggregator
[INFO] Apache James :: Mailet API
[INFO] Apache James :: Basic Mailet Toolkit
[INFO] Apache James :: Mailetdocs Maven Plugin
[INFO] Apache James :: Crypto Mailets
[INFO] Apache James :: Standard Mailets
[INFO] Apache James :: AI Mailets
[INFO]                                                                         
[INFO] ------------------------------------------------------------------------
[INFO] Building Apache James :: Mailets parent and aggregator 2.5.1-SNAPSHOT
[INFO] ------------------------------------------------------------------------
[INFO] [INFO] Deleting <https://builds.apache.org/job/james-mailet/ws/trunk/target>

[INFO] --- maven-clean-plugin:2.4.1:clean (default-clean) @ apache-mailet ---
[INFO] 
[INFO] --- maven-remote-resources-plugin:1.2.1:process (default) @ apache-mailet ---
[INFO] 
[INFO] --- maven-site-plugin:3.2:attach-descriptor (attach-descriptor) @ apache-mailet ---
[INFO] 
[INFO] --- apache-rat-plugin:0.8:check (default) @ apache-mailet ---
[INFO] Exclude: NOTICE.*
[INFO] Exclude: LICENSE.*
[INFO] Exclude: release.properties
[INFO] Exclude: dist/**/*
[INFO] Exclude: **/.*
[INFO] Exclude: .*/**/*
[INFO] Exclude: **/.*/**/*
[INFO] Exclude: **/LICENSE*
[INFO] Exclude: **/target/**
[INFO] Exclude: **/*.iml
[INFO] Exclude: src/site/**
[INFO] [INFO] Installing <https://builds.apache.org/job/james-mailet/ws/trunk/pom.xml>
to /home/jenkins/jenkins-slave/maven-repositories/1/org/apache/james/apache-mailet/2.5.1-SNAPSHOT/apache-mailet-2.5.1-SNAPSHOT.pom

[INFO] --- maven-install-plugin:2.3.1:install (default-install) @ apache-mailet ---
[INFO] Installing <https://builds.apache.org/job/james-mailet/ws/trunk/target/apache-mailet-2.5.1-SNAPSHOT-site.xml>
to /home/jenkins/jenkins-slave/maven-repositories/1/org/apache/james/apache-mailet/2.5.1-SNAPSHOT/apache-mailet-2.5.1-SNAPSHOT-site.xml
[INFO] 
[INFO] --- maven-deploy-plugin:2.7:deploy (default-deploy) @ apache-mailet ---
Downloading: https://repository.apache.org/content/repositories/snapshots/org/apache/james/apache-mailet/2.5.1-SNAPSHOT/maven-metadata.xml
Downloaded: https://repository.apache.org/content/repositories/snapshots/org/apache/james/apache-mailet/2.5.1-SNAPSHOT/maven-metadata.xml
(823 B at 0.3 KB/sec)
Uploading: https://repository.apache.org/content/repositories/snapshots/org/apache/james/apache-mailet/2.5.1-SNAPSHOT/apache-mailet-2.5.1-20130623.040435-165.pom
Uploaded: https://repository.apache.org/content/repositories/snapshots/org/apache/james/apache-mailet/2.5.1-SNAPSHOT/apache-mailet-2.5.1-20130623.040435-165.pom
(12 KB at 26.4 KB/sec)
Downloading: https://repository.apache.org/content/repositories/snapshots/org/apache/james/apache-mailet/maven-metadata.xml
Downloaded: https://repository.apache.org/content/repositories/snapshots/org/apache/james/apache-mailet/maven-metadata.xml
(427 B at 1.0 KB/sec)
Uploading: https://repository.apache.org/content/repositories/snapshots/org/apache/james/apache-mailet/2.5.1-SNAPSHOT/maven-metadata.xml
Uploaded: https://repository.apache.org/content/repositories/snapshots/org/apache/james/apache-mailet/2.5.1-SNAPSHOT/maven-metadata.xml
(823 B at 1.5 KB/sec)
Uploading: https://repository.apache.org/content/repositories/snapshots/org/apache/james/apache-mailet/maven-metadata.xml
Uploaded: https://repository.apache.org/content/repositories/snapshots/org/apache/james/apache-mailet/maven-metadata.xml
(427 B at 1.1 KB/sec)
Uploading: https://repository.apache.org/content/repositories/snapshots/org/apache/james/apache-mailet/2.5.1-SNAPSHOT/apache-mailet-2.5.1-20130623.040435-165-site.xml
Uploaded: https://repository.apache.org/content/repositories/snapshots/org/apache/james/apache-mailet/2.5.1-SNAPSHOT/apache-mailet-2.5.1-20130623.040435-165-site.xml
(3 KB at 6.5 KB/sec)
Uploading: https://repository.apache.org/content/repositories/snapshots/org/apache/james/apache-mailet/2.5.1-SNAPSHOT/maven-metadata.xml
Uploaded: https://repository.apache.org/content/repositories/snapshots/org/apache/james/apache-mailet/2.5.1-SNAPSHOT/maven-metadata.xml
(823 B at 2.4 KB/sec)
[INFO]                                                                         
[INFO] ------------------------------------------------------------------------
[INFO] Building Apache James :: Mailet API 2.5.1-SNAPSHOT
[INFO] ------------------------------------------------------------------------
[INFO] [INFO] Deleting <https://builds.apache.org/job/james-mailet/ws/trunk/api/target>

[INFO] --- maven-clean-plugin:2.4.1:clean (default-clean) @ apache-mailet-api ---
[INFO] 
[INFO] --- maven-remote-resources-plugin:1.2.1:process (default) @ apache-mailet-api ---
[INFO] 
[INFO] --- maven-resources-plugin:2.5:resources (default-resources) @ apache-mailet-api ---
[debug] execute contextualize
[INFO] Using 'UTF-8' encoding to copy filtered resources.
[INFO] Copying 0 resource
[INFO] Copying 3 resources
[INFO] 
[INFO] --- maven-compiler-plugin:2.3.2:compile (default-compile) @ apache-mailet-api ---
[INFO] Compiling 11 source files to <https://builds.apache.org/job/james-mailet/ws/trunk/api/target/classes>
[debug] execute contextualize
[INFO] [INFO] Using 'UTF-8' encoding to copy filtered resources.
[INFO] Copying 0 resource
[INFO] Copying 3 resources

[INFO] --- maven-resources-plugin:2.5:testResources (default-testResources) @ apache-mailet-api
---
[INFO] [INFO] Compiling 1 source file to <https://builds.apache.org/job/james-mailet/ws/trunk/api/target/test-classes>

[INFO] --- maven-compiler-plugin:2.3.2:testCompile (default-testCompile) @ apache-mailet-api
---
[INFO] 
[INFO] --- maven-surefire-plugin:2.10:test (default-test) @ apache-mailet-api ---
[INFO] Surefire report directory: <https://builds.apache.org/job/james-mailet/ws/trunk/api/target/surefire-reports>

-------------------------------------------------------
 T E S T S
-------------------------------------------------------

-------------------------------------------------------
 T E S T S
-------------------------------------------------------
Running org.apache.mailet.MailAddressTest
Tests run: 9, Failures: 0, Errors: 0, Skipped: 0, Time elapsed: 0.125 sec

Results :

Tests run: 9, Failures: 0, Errors: 0, Skipped: 0

java.lang.reflect.InvocationTargetException
	at sun.reflect.NativeMethodAccessorImpl.invoke0(Native Method)
	at sun.reflect.NativeMethodAccessorImpl.invoke(NativeMethodAccessorImpl.java:39)
	at sun.reflect.DelegatingMethodAccessorImpl.invoke(DelegatingMethodAccessorImpl.java:25)
	at java.lang.reflect.Method.invoke(Method.java:597)
	at org.codehaus.plexus.classworlds.launcher.Launcher.launchStandard(Launcher.java:329)
	at org.codehaus.plexus.classworlds.launcher.Launcher.launch(Launcher.java:239)
	at org.jvnet.hudson.maven3.agent.Maven3Main.launch(Maven3Main.java:158)
	at hudson.maven.Maven3Builder.call(Maven3Builder.java:100)
	at hudson.maven.Maven3Builder.call(Maven3Builder.java:66)
	at hudson.remoting.UserRequest.perform(UserRequest.java:118)
	at hudson.remoting.UserRequest.perform(UserRequest.java:48)
	at hudson.remoting.Request$2.run(Request.java:326)
	at hudson.remoting.InterceptingExecutorService$1.call(InterceptingExecutorService.java:72)
	at java.util.concurrent.FutureTask$Sync.innerRun(FutureTask.java:303)
	at java.util.concurrent.FutureTask.run(FutureTask.java:138)
	at java.util.concurrent.ThreadPoolExecutor$Worker.runTask(ThreadPoolExecutor.java:895)
	at java.util.concurrent.ThreadPoolExecutor$Worker.run(ThreadPoolExecutor.java:918)
	at java.lang.Thread.run(Thread.java:662)
Caused by: java.lang.Error: Unable to load resource hudson/maven/reporters/Messages.properties
	at hudson.remoting.RemoteClassLoader.findResource(RemoteClassLoader.java:241)
	at java.lang.ClassLoader.getResource(ClassLoader.java:1002)
	at java.lang.Class.getResource(Class.java:2076)
	at org.jvnet.localizer.ResourceBundleHolder.get(ResourceBundleHolder.java:83)
	at org.jvnet.localizer.ResourceBundleHolder.get(ResourceBundleHolder.java:102)
	at org.jvnet.localizer.ResourceBundleHolder.get(ResourceBundleHolder.java:102)
	at org.jvnet.localizer.ResourceBundleHolder.format(ResourceBundleHolder.java:139)
	at hudson.maven.reporters.Messages.SurefireArchiver_Recording(Messages.java:165)
	at hudson.maven.reporters.SurefireArchiver.postExecute(SurefireArchiver.java:120)
	at hudson.maven.Maven3Builder$MavenExecutionListener.recordMojoEnded(Maven3Builder.java:443)
	at hudson.maven.Maven3Builder$MavenExecutionListener.mojoSucceeded(Maven3Builder.java:425)
	at org.apache.maven.lifecycle.internal.DefaultExecutionEventCatapult.fire(DefaultExecutionEventCatapult.java:87)
	at org.apache.maven.lifecycle.internal.DefaultExecutionEventCatapult.fire(DefaultExecutionEventCatapult.java:42)
	at org.apache.maven.lifecycle.internal.MojoExecutor.execute(MojoExecutor.java:228)
	at org.apache.maven.lifecycle.internal.MojoExecutor.execute(MojoExecutor.java:153)
	at org.apache.maven.lifecycle.internal.MojoExecutor.execute(MojoExecutor.java:145)
	at org.apache.maven.lifecycle.internal.LifecycleModuleBuilder.buildProject(LifecycleModuleBuilder.java:84)
	at org.apache.maven.lifecycle.internal.LifecycleModuleBuilder.buildProject(LifecycleModuleBuilder.java:59)
	at org.apache.maven.lifecycle.internal.LifecycleStarter.singleThreadedBuild(LifecycleStarter.java:183)
	at org.apache.maven.lifecycle.internal.LifecycleStarter.execute(LifecycleStarter.java:161)
	at org.apache.maven.DefaultMaven.doExecute(DefaultMaven.java:320)
	at org.apache.maven.DefaultMaven.execute(DefaultMaven.java:156)
	at org.jvnet.hudson.maven3.launcher.Maven3Launcher.main(Maven3Launcher.java:79)
	... 18 more
Caused by: java.io.FileNotFoundException: /tmp/hudson-remoting6954009786648499899/hudson/maven/reporters/Messages.properties
(No such file or directory)
	at java.io.FileOutputStream.open(Native Method)
	at java.io.FileOutputStream.<init>(FileOutputStream.java:194)
	at java.io.FileOutputStream.<init>(FileOutputStream.java:145)
	at hudson.remoting.RemoteClassLoader.makeResource(RemoteClassLoader.java:309)
	at hudson.remoting.RemoteClassLoader.findResource(RemoteClassLoader.java:237)
	... 40 more
channel stopped
ERROR: Failed to parse POMs
hudson.util.IOException2: java.lang.reflect.InvocationTargetException
	at hudson.maven.Maven3Builder.call(Maven3Builder.java:162)
	at hudson.maven.Maven3Builder.call(Maven3Builder.java:66)
	at hudson.remoting.UserRequest.perform(UserRequest.java:118)
	at hudson.remoting.UserRequest.perform(UserRequest.java:48)
	at hudson.remoting.Request$2.run(Request.java:326)
	at hudson.remoting.InterceptingExecutorService$1.call(InterceptingExecutorService.java:72)
	at java.util.concurrent.FutureTask$Sync.innerRun(FutureTask.java:303)
	at java.util.concurrent.FutureTask.run(FutureTask.java:138)
	at java.util.concurrent.ThreadPoolExecutor$Worker.runTask(ThreadPoolExecutor.java:895)
	at java.util.concurrent.ThreadPoolExecutor$Worker.run(ThreadPoolExecutor.java:918)
	at java.lang.Thread.run(Thread.java:662)
Caused by: java.lang.Exception: java.lang.reflect.InvocationTargetException
	at org.jvnet.hudson.maven3.agent.Maven3Main.launch(Maven3Main.java:161)
	at hudson.maven.Maven3Builder.call(Maven3Builder.java:100)
	... 10 more
Caused by: java.lang.reflect.InvocationTargetException
	at sun.reflect.NativeMethodAccessorImpl.invoke0(Native Method)
	at sun.reflect.NativeMethodAccessorImpl.invoke(NativeMethodAccessorImpl.java:39)
	at sun.reflect.DelegatingMethodAccessorImpl.invoke(DelegatingMethodAccessorImpl.java:25)
	at java.lang.reflect.Method.invoke(Method.java:597)
	at org.codehaus.plexus.classworlds.launcher.Launcher.launchStandard(Launcher.java:329)
	at org.codehaus.plexus.classworlds.launcher.Launcher.launch(Launcher.java:239)
	at org.jvnet.hudson.maven3.agent.Maven3Main.launch(Maven3Main.java:158)
	... 11 more
Caused by: java.lang.Error: Unable to load resource hudson/maven/reporters/Messages.properties
	at hudson.remoting.RemoteClassLoader.findResource(RemoteClassLoader.java:241)
	at java.lang.ClassLoader.getResource(ClassLoader.java:1002)
	at java.lang.Class.getResource(Class.java:2076)
	at org.jvnet.localizer.ResourceBundleHolder.get(ResourceBundleHolder.java:83)
	at org.jvnet.localizer.ResourceBundleHolder.get(ResourceBundleHolder.java:102)
	at org.jvnet.localizer.ResourceBundleHolder.get(ResourceBundleHolder.java:102)
	at org.jvnet.localizer.ResourceBundleHolder.format(ResourceBundleHolder.java:139)
	at hudson.maven.reporters.Messages.SurefireArchiver_Recording(Messages.java:165)
	at hudson.maven.reporters.SurefireArchiver.postExecute(SurefireArchiver.java:120)
	at hudson.maven.Maven3Builder$MavenExecutionListener.recordMojoEnded(Maven3Builder.java:443)
	at hudson.maven.Maven3Builder$MavenExecutionListener.mojoSucceeded(Maven3Builder.java:425)
	at org.apache.maven.lifecycle.internal.DefaultExecutionEventCatapult.fire(DefaultExecutionEventCatapult.java:87)
	at org.apache.maven.lifecycle.internal.DefaultExecutionEventCatapult.fire(DefaultExecutionEventCatapult.java:42)
	at org.apache.maven.lifecycle.internal.MojoExecutor.execute(MojoExecutor.java:228)
	at org.apache.maven.lifecycle.internal.MojoExecutor.execute(MojoExecutor.java:153)
	at org.apache.maven.lifecycle.internal.MojoExecutor.execute(MojoExecutor.java:145)
	at org.apache.maven.lifecycle.internal.LifecycleModuleBuilder.buildProject(LifecycleModuleBuilder.java:84)
	at org.apache.maven.lifecycle.internal.LifecycleModuleBuilder.buildProject(LifecycleModuleBuilder.java:59)
	at org.apache.maven.lifecycle.internal.LifecycleStarter.singleThreadedBuild(LifecycleStarter.java:183)
	at org.apache.maven.lifecycle.internal.LifecycleStarter.execute(LifecycleStarter.java:161)
	at org.apache.maven.DefaultMaven.doExecute(DefaultMaven.java:320)
	at org.apache.maven.DefaultMaven.execute(DefaultMaven.java:156)
	at org.jvnet.hudson.maven3.launcher.Maven3Launcher.main(Maven3Launcher.java:79)
	... 18 more
Caused by: java.io.FileNotFoundException: /tmp/hudson-remoting6954009786648499899/hudson/maven/reporters/Messages.properties
(No such file or directory)
	at java.io.FileOutputStream.open(Native Method)
	at java.io.FileOutputStream.<init>(FileOutputStream.java:194)
	at java.io.FileOutputStream.<init>(FileOutputStream.java:145)
	at hudson.remoting.RemoteClassLoader.makeResource(RemoteClassLoader.java:309)
	at hudson.remoting.RemoteClassLoader.findResource(RemoteClassLoader.java:237)
	... 40 more

---------------------------------------------------------------------
To unsubscribe, e-mail: server-dev-unsubscribe@james.apache.org
For additional commands, e-mail: server-dev-help@james.apache.org


Mime
View raw message