james-server-dev mailing list archives

Site index · List index
Message view « Date » · « Thread »
Top « Date » · « Thread »
From Shrivallabh Jagdish Deshmukh <shrivalla...@ivycomptech.com>
Subject Build failing
Date Fri, 14 Jun 2013 14:40:27 GMT
Hi,

I have just checked out -
https://svn.apache.org/repos/asf/james/current

The build is failing for MPT project.

Any ideas?


[INFO] Scanning for projects...
[INFO] ------------------------------------------------------------------------
[INFO] Reactor Build Order:
[INFO]
[INFO] Apache James MPT
[INFO] Apache James MPT Core
[INFO] Apache James MPT AntLib
[INFO] Apache James MPT Application
[INFO] Apache James MPT All
[INFO] Apache James MPT Imap Mailbox
[INFO] Apache James MPT Maven2 Plugin
[INFO]
[INFO] ------------------------------------------------------------------------
[INFO] Building Apache James MPT 0.2-SNAPSHOT
[INFO] ------------------------------------------------------------------------
[INFO]
[INFO] --- maven-clean-plugin:2.4.1:clean (default-clean) @ apache-james-mpt ---

[INFO] Deleting D:\External\Apache\james\current\mpt\target
[INFO]
[INFO] --- maven-remote-resources-plugin:1.2.1:process (default) @ apache-james-
mpt ---
[INFO]
[INFO] --- maven-site-plugin:3.0:attach-descriptor (attach-descriptor) @ apache-
james-mpt ---
[INFO]
[INFO] --- maven-jar-plugin:2.3.2:test-jar (default) @ apache-james-mpt ---
[WARNING] JAR will be empty - no content was marked for inclusion!
[INFO] Building jar: D:\External\Apache\james\current\mpt\target\apache-james-mp
t-0.2-SNAPSHOT-tests.jar
[INFO]
[INFO] >>> maven-source-plugin:2.1.2:jar (attach-sources) @ apache-james-mpt >>>

[INFO]
[INFO] <<< maven-source-plugin:2.1.2:jar (attach-sources) @ apache-james-mpt <<<

[INFO]
[INFO] --- maven-source-plugin:2.1.2:jar (attach-sources) @ apache-james-mpt ---

[INFO]
[INFO] --- maven-install-plugin:2.3.1:install (default-install) @ apache-james-m
pt ---
[INFO] Installing D:\External\Apache\james\current\mpt\pom.xml to C:\Users\ivy47
49\.m2\repository\org\apache\james\apache-james-mpt\0.2-SNAPSHOT\apache-james-mp
t-0.2-SNAPSHOT.pom
[INFO] Installing D:\External\Apache\james\current\mpt\target\apache-james-mpt-0
.2-SNAPSHOT-site.xml to C:\Users\ivy4749\.m2\repository\org\apache\james\apache-
james-mpt\0.2-SNAPSHOT\apache-james-mpt-0.2-SNAPSHOT-site.xml
[INFO] Installing D:\External\Apache\james\current\mpt\target\apache-james-mpt-0
.2-SNAPSHOT-tests.jar to C:\Users\ivy4749\.m2\repository\org\apache\james\apache
-james-mpt\0.2-SNAPSHOT\apache-james-mpt-0.2-SNAPSHOT-tests.jar
[INFO]
[INFO] ------------------------------------------------------------------------
[INFO] Building Apache James MPT Core 0.2-SNAPSHOT
[INFO] ------------------------------------------------------------------------
[WARNING] The POM for org.apache.james.protocols:protocols-imap:jar:1.6.3-SNAPSH
OT is missing, no dependency information available
[WARNING] The POM for org.apache.james.protocols:protocols-imap:jar:tests:1.6.3-
SNAPSHOT is missing, no dependency information available
[WARNING] The POM for org.apache.james:apache-james-mailbox-api:jar:0.5-SNAPSHOT
is missing, no dependency information available
[WARNING] The POM for org.apache.james:apache-james-mailbox-store:jar:tests:0.5-
SNAPSHOT is missing, no dependency information available
[INFO] ------------------------------------------------------------------------
[INFO] Reactor Summary:
[INFO]
[INFO] Apache James MPT .................................. SUCCESS [1.018s]
[INFO] Apache James MPT Core ............................. FAILURE [0.105s]
[INFO] Apache James MPT AntLib ........................... SKIPPED
[INFO] Apache James MPT Application ...................... SKIPPED
[INFO] Apache James MPT All .............................. SKIPPED
[INFO] Apache James MPT Imap Mailbox ..................... SKIPPED
[INFO] Apache James MPT Maven2 Plugin .................... SKIPPED
[INFO] ------------------------------------------------------------------------
[INFO] BUILD FAILURE
[INFO] ------------------------------------------------------------------------
[INFO] Total time: 1.583s
[INFO] Finished at: Fri Jun 14 20:08:38 IST 2013
[INFO] Final Memory: 13M/31M
[INFO] ------------------------------------------------------------------------
[ERROR] Failed to execute goal on project apache-james-mpt-core: Could not resol
ve dependencies for project org.apache.james:apache-james-mpt-core:jar:0.2-SNAPS
HOT: The following artifacts could not be resolved: org.apache.james.protocols:p
rotocols-imap:jar:1.6.3-SNAPSHOT, org.apache.james.protocols:protocols-imap:jar:
tests:1.6.3-SNAPSHOT, org.apache.james:apache-james-mailbox-api:jar:0.5-SNAPSHOT
, org.apache.james:apache-james-mailbox-store:jar:tests:0.5-SNAPSHOT: Failure to
find org.apache.james.protocols:protocols-imap:jar:1.6.3-SNAPSHOT in http://rep
ository.apache.org/snapshots was cached in the local repository, resolution will
not be reattempted until the update interval of apache.snapshots has elapsed or
updates are forced -> [Help 1]
[ERROR]
[ERROR] To see the full stack trace of the errors, re-run Maven with the -e swit
ch.
[ERROR] Re-run Maven using the -X switch to enable full debug logging.
[ERROR]
[ERROR] For more information about the errors and possible solutions, please rea
d the following articles:
[ERROR] [Help 1] http://cwiki.apache.org/confluence/display/MAVEN/DependencyReso
lutionException
[ERROR]
[ERROR] After correcting the problems, you can resume the build with the command

[ERROR]   mvn <goals> -rf :apache-james-mpt-core
D:\External\Apache\james\current\mpt>



SJD

This email and any attachments are confidential, and may be legally privileged and protected
by copyright. If you are not the intended recipient dissemination or copying of this email
is prohibited. If you have received this in error, please notify the sender by replying by
email and then delete the email completely from your system. Any views or opinions are solely
those of the sender. This communication is not intended to form a binding contract unless
expressly indicated to the contrary and properly authorised. Any actions taken on the basis
of this email are at the recipient's own risk.

Mime
  • Unnamed multipart/alternative (inline, None, 0 bytes)
View raw message