james-server-dev mailing list archives

Site index · List index
Message view « Date » · « Thread »
Top « Date » · « Thread »
From Apache Jenkins Server <jenk...@builds.apache.org>
Subject Build failed in Jenkins: jdkim-trunk #1717
Date Wed, 03 Jul 2013 11:44:57 GMT
See <https://builds.apache.org/job/jdkim-trunk/1717/>

------------------------------------------
[...truncated 144 lines...]
[INFO] Excluding org.apache.james:apache-mailet-base:jar:2.5.0 from the shaded jar.
[INFO] Excluding org.apache.james:apache-mailet-api:jar:2.5.0 from the shaded jar.
[INFO] Excluding org.apache.james:apache-mime4j-core:jar:0.7.2 from the shaded jar.
[INFO] Excluding org.apache.james:apache-mime4j-dom:jar:0.7.2 from the shaded jar.
[INFO] Excluding log4j:log4j:jar:1.2.16 from the shaded jar.
[INFO] Excluding dnsjava:dnsjava:jar:2.1.1 from the shaded jar.
[INFO] Replacing original artifact with shaded artifact.
[INFO] Replacing <https://builds.apache.org/job/jdkim-trunk/ws/trunk/main/target/apache-jdkim-library-0.3-SNAPSHOT.jar>
with <https://builds.apache.org/job/jdkim-trunk/ws/trunk/main/target/apache-jdkim-library-0.3-SNAPSHOT-shaded.jar>
[INFO] 
[INFO] --- apache-rat-plugin:0.8:check (default) @ apache-jdkim-library ---
[INFO] Exclude: src/test/resources/org/apache/james/jdkim/corpus/*
[INFO] Exclude: src/test/resources/org/apache/james/jdkim/Mail-DKIM/FAKE_DNS.dat
[INFO] Exclude: src/test/resources/org/apache/james/jdkim/Mail-DKIM/corpus/*
[INFO] Exclude: release.properties
[INFO] Exclude: dependency-reduced-pom.xml
[INFO] Exclude: nbactions.xml
[INFO] Exclude: **/.*/**/*
[INFO] 
[INFO] --- maven-install-plugin:2.3.1:install (default-install) @ apache-jdkim-library ---[INFO]
Installing <https://builds.apache.org/job/jdkim-trunk/ws/trunk/main/target/apache-jdkim-library-0.3-SNAPSHOT.jar>
to /export/home/hudson/hudson-slave/maven-repositories/0/org/apache/james/jdkim/apache-jdkim-library/0.3-SNAPSHOT/apache-jdkim-library-0.3-SNAPSHOT.jar
[INFO] Installing <https://builds.apache.org/job/jdkim-trunk/ws/trunk/main/dependency-reduced-pom.xml>
to /export/home/hudson/hudson-slave/maven-repositories/0/org/apache/james/jdkim/apache-jdkim-library/0.3-SNAPSHOT/apache-jdkim-library-0.3-SNAPSHOT.pom
[INFO] Installing <https://builds.apache.org/job/jdkim-trunk/ws/trunk/main/target/apache-jdkim-library-0.3-SNAPSHOT-tests.jar>
to /export/home/hudson/hudson-slave/maven-repositories/0/org/apache/james/jdkim/apache-jdkim-library/0.3-SNAPSHOT/apache-jdkim-library-0.3-SNAPSHOT-tests.jar

[INFO] 
[INFO] --- maven-bundle-plugin:2.3.7:install (default-install) @ apache-jdkim-library ---
[INFO] Installing org/apache/james/jdkim/apache-jdkim-library/0.3-SNAPSHOT/apache-jdkim-library-0.3-SNAPSHOT.jar
[INFO] Writing OBR metadata
[INFO] 
[INFO] --- maven-deploy-plugin:2.7:deploy (default-deploy) @ apache-jdkim-library ---Downloading:
https://repository.apache.org/content/repositories/snapshots/org/apache/james/jdkim/apache-jdkim-library/0.3-SNAPSHOT/maven-metadata.xml

Downloaded: https://repository.apache.org/content/repositories/snapshots/org/apache/james/jdkim/apache-jdkim-library/0.3-SNAPSHOT/maven-metadata.xml
(1004 B at 0.6 KB/sec)
Uploading: https://repository.apache.org/content/repositories/snapshots/org/apache/james/jdkim/apache-jdkim-library/0.3-SNAPSHOT/apache-jdkim-library-0.3-20130703.113813-533.jar
Uploaded: https://repository.apache.org/content/repositories/snapshots/org/apache/james/jdkim/apache-jdkim-library/0.3-SNAPSHOT/apache-jdkim-library-0.3-20130703.113813-533.jar
(241 KB at 86.7 KB/sec)
Uploading: https://repository.apache.org/content/repositories/snapshots/org/apache/james/jdkim/apache-jdkim-library/0.3-SNAPSHOT/apache-jdkim-library-0.3-20130703.113813-533.pom
Uploaded: https://repository.apache.org/content/repositories/snapshots/org/apache/james/jdkim/apache-jdkim-library/0.3-SNAPSHOT/apache-jdkim-library-0.3-20130703.113813-533.pom
(8 KB at 3.5 KB/sec)
Downloading: https://repository.apache.org/content/repositories/snapshots/org/apache/james/jdkim/apache-jdkim-library/maven-metadata.xml
Downloaded: https://repository.apache.org/content/repositories/snapshots/org/apache/james/jdkim/apache-jdkim-library/maven-metadata.xml
(300 B at 0.3 KB/sec)
Uploading: https://repository.apache.org/content/repositories/snapshots/org/apache/james/jdkim/apache-jdkim-library/0.3-SNAPSHOT/maven-metadata.xml
Uploaded: https://repository.apache.org/content/repositories/snapshots/org/apache/james/jdkim/apache-jdkim-library/0.3-SNAPSHOT/maven-metadata.xml
(1004 B at 0.6 KB/sec)
Uploading: https://repository.apache.org/content/repositories/snapshots/org/apache/james/jdkim/apache-jdkim-library/maven-metadata.xml
Uploaded: https://repository.apache.org/content/repositories/snapshots/org/apache/james/jdkim/apache-jdkim-library/maven-metadata.xml
(300 B at 0.1 KB/sec)
Uploading: https://repository.apache.org/content/repositories/snapshots/org/apache/james/jdkim/apache-jdkim-library/0.3-SNAPSHOT/apache-jdkim-library-0.3-20130703.113813-533-tests.jar
Uploaded: https://repository.apache.org/content/repositories/snapshots/org/apache/james/jdkim/apache-jdkim-library/0.3-SNAPSHOT/apache-jdkim-library-0.3-20130703.113813-533-tests.jar
(112 KB at 37.9 KB/sec)
Uploading: https://repository.apache.org/content/repositories/snapshots/org/apache/james/jdkim/apache-jdkim-library/0.3-SNAPSHOT/maven-metadata.xml
Uploaded: https://repository.apache.org/content/repositories/snapshots/org/apache/james/jdkim/apache-jdkim-library/0.3-SNAPSHOT/maven-metadata.xml
(1004 B at 0.5 KB/sec)
[INFO] 
[INFO] --- maven-bundle-plugin:2.3.7:deploy (default-deploy) @ apache-jdkim-library ---[INFO]
Remote OBR update disabled (enable with -DremoteOBR)

[INFO]                                                                         
[INFO] ------------------------------------------------------------------------
[INFO] Building Apache James :: jDKIM :: Mailets 0.3-SNAPSHOT
[INFO] ------------------------------------------------------------------------
[INFO] 
[INFO] Deleting <https://builds.apache.org/job/jdkim-trunk/ws/trunk/mailets/target>
[INFO] --- maven-clean-plugin:2.4.1:clean (default-clean) @ apache-jdkim-mailets ---
[TASKS] Scanning folder '<https://builds.apache.org/job/jdkim-trunk/ws/trunk/mailets'>
for files matching the pattern '**/*.java' - excludes: 
[TASKS] Found 8 files to scan for tasks
Found 0 open tasks.
[TASKS] Computing warning deltas based on reference build #1716
[INFO] 
[INFO] --- maven-remote-resources-plugin:1.2.1:process (default) @ apache-jdkim-mailets ---
[INFO] 
[debug] execute contextualize
[INFO] --- maven-resources-plugin:2.5:resources (default-resources) @ apache-jdkim-mailets
---[INFO] Using 'UTF-8' encoding to copy filtered resources.
[INFO] Copying 0 resource
[INFO] Copying 3 resources

[INFO] 
[INFO] --- maven-compiler-plugin:2.3.2:compile (default-compile) @ apache-jdkim-mailets ---[INFO]
Compiling 6 source files to <https://builds.apache.org/job/jdkim-trunk/ws/trunk/mailets/target/classes>

[INFO] [debug] execute contextualize

[INFO] Using 'UTF-8' encoding to copy filtered resources.
[INFO] Copying 0 resource
[INFO] Copying 3 resources
[INFO] --- maven-resources-plugin:2.5:testResources (default-testResources) @ apache-jdkim-mailets
---
[INFO] 
[INFO] --- maven-compiler-plugin:2.3.2:testCompile (default-testCompile) @ apache-jdkim-mailets
---[INFO] Compiling 2 source files to <https://builds.apache.org/job/jdkim-trunk/ws/trunk/mailets/target/test-classes>

[INFO] 
[INFO] --- maven-surefire-plugin:2.10:test (default-test) @ apache-jdkim-mailets ---[INFO]
Surefire report directory: <https://builds.apache.org/job/jdkim-trunk/ws/trunk/mailets/target/surefire-reports>

-------------------------------------------------------
 T E S T S
-------------------------------------------------------

-------------------------------------------------------
 T E S T S
-------------------------------------------------------

Running org.apache.james.jdkim.mailets.DKIMSignTest
Tests run: 6, Failures: 0, Errors: 0, Skipped: 0, Time elapsed: 10.854 sec
Running org.apache.james.jdkim.mailets.DKIMVerifyTest
Tests run: 4, Failures: 0, Errors: 0, Skipped: 0, Time elapsed: 3.684 sec

Results :

Tests run: 10, Failures: 0, Errors: 0, Skipped: 0

[JENKINS] Recording test results
[INFO] 
[INFO] --- maven-bundle-plugin:2.3.7:bundle (default-bundle) @ apache-jdkim-mailets ---
[INFO] 
[INFO] --- maven-site-plugin:3.0:attach-descriptor (attach-descriptor) @ apache-jdkim-mailets
---
[INFO] [INFO] Installing <https://builds.apache.org/job/jdkim-trunk/ws/trunk/mailets/target/apache-jdkim-mailets-0.3-SNAPSHOT.jar>
to /export/home/hudson/hudson-slave/maven-repositories/0/org/apache/james/jdkim/apache-jdkim-mailets/0.3-SNAPSHOT/apache-jdkim-mailets-0.3-SNAPSHOT.jar

[INFO] --- maven-install-plugin:2.3.1:install (default-install) @ apache-jdkim-mailets ---[INFO]
Installing <https://builds.apache.org/job/jdkim-trunk/ws/trunk/mailets/pom.xml> to /export/home/hudson/hudson-slave/maven-repositories/0/org/apache/james/jdkim/apache-jdkim-mailets/0.3-SNAPSHOT/apache-jdkim-mailets-0.3-SNAPSHOT.pom

[INFO] 
[INFO] --- maven-bundle-plugin:2.3.7:install (default-install) @ apache-jdkim-mailets ---
[INFO] Installing org/apache/james/jdkim/apache-jdkim-mailets/0.3-SNAPSHOT/apache-jdkim-mailets-0.3-SNAPSHOT.jar
[INFO] Writing OBR metadata
[INFO] 
[INFO] --- maven-deploy-plugin:2.7:deploy (default-deploy) @ apache-jdkim-mailets ---Downloading:
https://repository.apache.org/content/repositories/snapshots/org/apache/james/jdkim/apache-jdkim-mailets/0.3-SNAPSHOT/maven-metadata.xml

Downloaded: https://repository.apache.org/content/repositories/snapshots/org/apache/james/jdkim/apache-jdkim-mailets/0.3-SNAPSHOT/maven-metadata.xml
(792 B at 0.5 KB/sec)
Uploading: https://repository.apache.org/content/repositories/snapshots/org/apache/james/jdkim/apache-jdkim-mailets/0.3-SNAPSHOT/apache-jdkim-mailets-0.3-20130703.113936-526.jar
Uploaded: https://repository.apache.org/content/repositories/snapshots/org/apache/james/jdkim/apache-jdkim-mailets/0.3-SNAPSHOT/apache-jdkim-mailets-0.3-20130703.113936-526.jar
(19 KB at 10.3 KB/sec)
Uploading: https://repository.apache.org/content/repositories/snapshots/org/apache/james/jdkim/apache-jdkim-mailets/0.3-SNAPSHOT/apache-jdkim-mailets-0.3-20130703.113936-526.pom
Uploaded: https://repository.apache.org/content/repositories/snapshots/org/apache/james/jdkim/apache-jdkim-mailets/0.3-SNAPSHOT/apache-jdkim-mailets-0.3-20130703.113936-526.pom
(5 KB at 2.4 KB/sec)
Downloading: https://repository.apache.org/content/repositories/snapshots/org/apache/james/jdkim/apache-jdkim-mailets/maven-metadata.xml
Downloaded: https://repository.apache.org/content/repositories/snapshots/org/apache/james/jdkim/apache-jdkim-mailets/maven-metadata.xml
(300 B at 0.2 KB/sec)
Uploading: https://repository.apache.org/content/repositories/snapshots/org/apache/james/jdkim/apache-jdkim-mailets/0.3-SNAPSHOT/maven-metadata.xml
Uploaded: https://repository.apache.org/content/repositories/snapshots/org/apache/james/jdkim/apache-jdkim-mailets/0.3-SNAPSHOT/maven-metadata.xml
(792 B at 0.5 KB/sec)
Uploading: https://repository.apache.org/content/repositories/snapshots/org/apache/james/jdkim/apache-jdkim-mailets/maven-metadata.xml
Uploaded: https://repository.apache.org/content/repositories/snapshots/org/apache/james/jdkim/apache-jdkim-mailets/maven-metadata.xml
(300 B at 0.2 KB/sec)
[INFO] 
[INFO] --- maven-bundle-plugin:2.3.7:deploy (default-deploy) @ apache-jdkim-mailets ---[INFO]
Remote OBR update disabled (enable with -DremoteOBR)

[INFO]                                                                         
[INFO] ------------------------------------------------------------------------
[INFO] Building Apache James :: jDKIM :: Assembly 0.3-SNAPSHOT
[INFO] ------------------------------------------------------------------------
[INFO] 
[INFO] Deleting <https://builds.apache.org/job/jdkim-trunk/ws/trunk/assemble/target>
[INFO] --- maven-clean-plugin:2.4.1:clean (default-clean) @ apache-jdkim ---
[TASKS] Scanning folder '<https://builds.apache.org/job/jdkim-trunk/ws/trunk/assemble'>
for files matching the pattern '**/*.java' - excludes: 
[TASKS] Found 0 files to scan for tasks
Found 0 open tasks.
[TASKS] Computing warning deltas based on reference build #1716
[INFO] 
[INFO] --- maven-remote-resources-plugin:1.2.1:process (default) @ apache-jdkim ---
[INFO] 
[INFO] --- maven-site-plugin:3.0:attach-descriptor (attach-descriptor) @ apache-jdkim ---
[INFO] 
[INFO] --- maven-assembly-plugin:2.2.1:attached (make-assembly) @ apache-jdkim ---
[INFO] Building zip: <https://builds.apache.org/job/jdkim-trunk/ws/trunk/assemble/target/apache-jdkim-0.3-SNAPSHOT-bin.zip>
[INFO] ------------------------------------------------------------------------
[INFO] Reactor Summary:
[INFO] 
[INFO] Apache James :: jDKIM :: DomainKey Project ........ SUCCESS [4:52.789s]
[INFO] Apache James :: jDKIM ............................. SUCCESS [4:00.572s]
[INFO] Apache James :: jDKIM :: Mailets .................. SUCCESS [1:15.408s]
[INFO] Apache James :: jDKIM :: Assembly ................. FAILURE [56.721s]
[INFO] ------------------------------------------------------------------------
[INFO] BUILD FAILURE
[INFO] ------------------------------------------------------------------------
[INFO] Total time: 11:29.008s
[INFO] Finished at: Wed Jul 03 11:40:49 GMT+00:00 2013
[INFO] Final Memory: 31M/145M
[INFO] ------------------------------------------------------------------------
[JENKINS] Archiving <https://builds.apache.org/job/jdkim-trunk/ws/trunk/mailets/pom.xml>
to /home/hudson/hudson/jobs/jdkim-trunk/modules/org.apache.james.jdkim$apache-jdkim-mailets/builds/2013-07-03_11-27-01/archive/org.apache.james.jdkim/apache-jdkim-mailets/0.3-SNAPSHOT/apache-jdkim-mailets-0.3-SNAPSHOT.pom
[JENKINS] Archiving <https://builds.apache.org/job/jdkim-trunk/ws/trunk/mailets/target/apache-jdkim-mailets-0.3-SNAPSHOT.jar>
to /home/hudson/hudson/jobs/jdkim-trunk/modules/org.apache.james.jdkim$apache-jdkim-mailets/builds/2013-07-03_11-27-01/archive/org.apache.james.jdkim/apache-jdkim-mailets/0.3-20130703.113936-526/apache-jdkim-mailets-0.3-20130703.113936-526.jar
[JENKINS] Archiving <https://builds.apache.org/job/jdkim-trunk/ws/trunk/pom.xml> to
/home/hudson/hudson/jobs/jdkim-trunk/modules/org.apache.james.jdkim$apache-jdkim-project/builds/2013-07-03_11-26-59/archive/org.apache.james.jdkim/apache-jdkim-project/0.3-SNAPSHOT/apache-jdkim-project-0.3-SNAPSHOT.pom
[JENKINS] Archiving <https://builds.apache.org/job/jdkim-trunk/ws/trunk/target/apache-jdkim-project-0.3-SNAPSHOT-site.xml>
to /home/hudson/hudson/jobs/jdkim-trunk/modules/org.apache.james.jdkim$apache-jdkim-project/builds/2013-07-03_11-26-59/archive/org.apache.james.jdkim/apache-jdkim-project/0.3-20130703.113417-543/apache-jdkim-project-0.3-20130703.113417-543-site.xml
[JENKINS] Archiving <https://builds.apache.org/job/jdkim-trunk/ws/trunk/assemble/pom.xml>
to /home/hudson/hudson/jobs/jdkim-trunk/modules/org.apache.james.jdkim$apache-jdkim/builds/2013-07-03_11-27-03/archive/org.apache.james.jdkim/apache-jdkim/0.3-SNAPSHOT/apache-jdkim-0.3-SNAPSHOT.pom
[JENKINS] Archiving <https://builds.apache.org/job/jdkim-trunk/ws/trunk/assemble/target/apache-jdkim-0.3-SNAPSHOT-bin.zip>
to /home/hudson/hudson/jobs/jdkim-trunk/modules/org.apache.james.jdkim$apache-jdkim/builds/2013-07-03_11-27-03/archive/org.apache.james.jdkim/apache-jdkim/0.3-SNAPSHOT/apache-jdkim-0.3-SNAPSHOT-bin.zip
[JENKINS] Archiving <https://builds.apache.org/job/jdkim-trunk/ws/trunk/main/dependency-reduced-pom.xml>
to /home/hudson/hudson/jobs/jdkim-trunk/modules/org.apache.james.jdkim$apache-jdkim-library/builds/2013-07-03_11-27-00/archive/org.apache.james.jdkim/apache-jdkim-library/0.3-SNAPSHOT/apache-jdkim-library-0.3-SNAPSHOT.pom
[JENKINS] Archiving <https://builds.apache.org/job/jdkim-trunk/ws/trunk/main/target/apache-jdkim-library-0.3-SNAPSHOT.jar>
to /home/hudson/hudson/jobs/jdkim-trunk/modules/org.apache.james.jdkim$apache-jdkim-library/builds/2013-07-03_11-27-00/archive/org.apache.james.jdkim/apache-jdkim-library/0.3-20130703.113813-533/apache-jdkim-library-0.3-20130703.113813-533.jar
[JENKINS] Archiving <https://builds.apache.org/job/jdkim-trunk/ws/trunk/main/target/apache-jdkim-library-0.3-SNAPSHOT-tests.jar>
to /home/hudson/hudson/jobs/jdkim-trunk/modules/org.apache.james.jdkim$apache-jdkim-library/builds/2013-07-03_11-27-00/archive/org.apache.james.jdkim/apache-jdkim-library/0.3-20130703.113813-533/apache-jdkim-library-0.3-20130703.113813-533-tests.jar
Waiting for Jenkins to finish collecting data
mavenExecutionResult exceptions not empty
message : Failed to execute goal org.apache.maven.plugins:maven-assembly-plugin:2.2.1:attached
(make-assembly) on project apache-jdkim: Failed to create assembly: Error creating assembly
archive bin: Failed to retrieve numeric file attributes using: '/bin/sh -c ls -1nlaR <https://builds.apache.org/job/jdkim-trunk/ws/trunk/assemble/..'>
cause : Failed to create assembly: Error creating assembly archive bin: Failed to retrieve
numeric file attributes using: '/bin/sh -c ls -1nlaR <https://builds.apache.org/job/jdkim-trunk/ws/trunk/assemble/..'>
Stack trace : 
org.apache.maven.lifecycle.LifecycleExecutionException: Failed to execute goal org.apache.maven.plugins:maven-assembly-plugin:2.2.1:attached
(make-assembly) on project apache-jdkim: Failed to create assembly: Error creating assembly
archive bin: Failed to retrieve numeric file attributes using: '/bin/sh -c ls -1nlaR <https://builds.apache.org/job/jdkim-trunk/ws/trunk/assemble/..'>
	at org.apache.maven.lifecycle.internal.MojoExecutor.execute(MojoExecutor.java:217)
	at org.apache.maven.lifecycle.internal.MojoExecutor.execute(MojoExecutor.java:153)
	at org.apache.maven.lifecycle.internal.MojoExecutor.execute(MojoExecutor.java:145)
	at org.apache.maven.lifecycle.internal.LifecycleModuleBuilder.buildProject(LifecycleModuleBuilder.java:84)
	at org.apache.maven.lifecycle.internal.LifecycleModuleBuilder.buildProject(LifecycleModuleBuilder.java:59)
	at org.apache.maven.lifecycle.internal.LifecycleStarter.singleThreadedBuild(LifecycleStarter.java:183)
	at org.apache.maven.lifecycle.internal.LifecycleStarter.execute(LifecycleStarter.java:161)
	at org.apache.maven.DefaultMaven.doExecute(DefaultMaven.java:320)
	at org.apache.maven.DefaultMaven.execute(DefaultMaven.java:156)
	at org.jvnet.hudson.maven3.launcher.Maven3Launcher.main(Maven3Launcher.java:79)
	at sun.reflect.NativeMethodAccessorImpl.invoke0(Native Method)
	at sun.reflect.NativeMethodAccessorImpl.invoke(NativeMethodAccessorImpl.java:39)
	at sun.reflect.DelegatingMethodAccessorImpl.invoke(DelegatingMethodAccessorImpl.java:25)
	at java.lang.reflect.Method.invoke(Method.java:597)
	at org.codehaus.plexus.classworlds.launcher.Launcher.launchStandard(Launcher.java:329)
	at org.codehaus.plexus.classworlds.launcher.Launcher.launch(Launcher.java:239)
	at org.jvnet.hudson.maven3.agent.Maven3Main.launch(Maven3Main.java:158)
	at hudson.maven.Maven3Builder.call(Maven3Builder.java:100)
	at hudson.maven.Maven3Builder.call(Maven3Builder.java:66)
	at hudson.remoting.UserRequest.perform(UserRequest.java:118)
	at hudson.remoting.UserRequest.perform(UserRequest.java:48)
	at hudson.remoting.Request$2.run(Request.java:326)
	at hudson.remoting.InterceptingExecutorService$1.call(InterceptingExecutorService.java:72)
	at java.util.concurrent.FutureTask$Sync.innerRun(FutureTask.java:303)
	at java.util.concurrent.FutureTask.run(FutureTask.java:138)
	at java.util.concurrent.ThreadPoolExecutor$Worker.runTask(ThreadPoolExecutor.java:886)
	at java.util.concurrent.ThreadPoolExecutor$Worker.run(ThreadPoolExecutor.java:908)
	at java.lang.Thread.run(Thread.java:662)
Caused by: org.apache.maven.plugin.MojoExecutionException: Failed to create assembly: Error
creating assembly archive bin: Failed to retrieve numeric file attributes using: '/bin/sh
-c ls -1nlaR <https://builds.apache.org/job/jdkim-trunk/ws/trunk/assemble/..'>
	at org.apache.maven.plugin.assembly.mojos.AbstractAssemblyMojo.execute(AbstractAssemblyMojo.java:472)
	at org.apache.maven.plugin.DefaultBuildPluginManager.executeMojo(DefaultBuildPluginManager.java:101)
	at org.apache.maven.lifecycle.internal.MojoExecutor.execute(MojoExecutor.java:209)
	... 27 more
Caused by: org.apache.maven.plugin.assembly.archive.ArchiveCreationException: Error creating
assembly archive bin: Failed to retrieve numeric file attributes using: '/bin/sh -c ls -1nlaR
<https://builds.apache.org/job/jdkim-trunk/ws/trunk/assemble/..'>
	at org.apache.maven.plugin.assembly.archive.DefaultAssemblyArchiver.createArchive(DefaultAssemblyArchiver.java:196)
	at org.apache.maven.plugin.assembly.mojos.AbstractAssemblyMojo.execute(AbstractAssemblyMojo.java:413)
	... 29 more
Caused by: org.codehaus.plexus.archiver.ArchiverException: Failed to retrieve numeric file
attributes using: '/bin/sh -c ls -1nlaR <https://builds.apache.org/job/jdkim-trunk/ws/trunk/assemble/..'>
	at org.codehaus.plexus.archiver.AbstractArchiver$1.hasNext(AbstractArchiver.java:439)
	at org.apache.maven.plugin.assembly.filter.ComponentsXmlArchiverFileFilter.finalizeArchiveCreation(ComponentsXmlArchiverFileFilter.java:166)
	at org.codehaus.plexus.archiver.AbstractArchiver.runArchiveFinalizers(AbstractArchiver.java:845)
	at org.codehaus.plexus.archiver.AbstractArchiver.createArchive(AbstractArchiver.java:869)
	at org.apache.maven.plugin.assembly.archive.archiver.AssemblyProxyArchiver.createArchive(AssemblyProxyArchiver.java:512)
	at org.apache.maven.plugin.assembly.archive.DefaultAssemblyArchiver.createArchive(DefaultAssemblyArchiver.java:192)
	... 30 more
Caused by: java.io.IOException: Failed to retrieve numeric file attributes using: '/bin/sh
-c ls -1nlaR <https://builds.apache.org/job/jdkim-trunk/ws/trunk/assemble/..'>
	at org.codehaus.plexus.components.io.attributes.PlexusIoResourceAttributeUtils.executeLs(PlexusIoResourceAttributeUtils.java:287)
	at org.codehaus.plexus.components.io.attributes.PlexusIoResourceAttributeUtils.getFileAttributesByPath(PlexusIoResourceAttributeUtils.java:223)
	at org.codehaus.plexus.components.io.attributes.PlexusIoResourceAttributeUtils.getFileAttributesByPath(PlexusIoResourceAttributeUtils.java:189)
	at org.codehaus.plexus.components.io.resources.PlexusIoFileResourceCollection.getResources(PlexusIoFileResourceCollection.java:175)
	at org.codehaus.plexus.archiver.AbstractArchiver$1.hasNext(AbstractArchiver.java:435)
	... 35 more
Caused by: org.codehaus.plexus.util.cli.CommandLineException: Error while executing process.
	at org.codehaus.plexus.util.cli.Commandline.execute(Commandline.java:656)
	at org.codehaus.plexus.util.cli.CommandLineUtils.executeCommandLine(CommandLineUtils.java:144)
	at org.codehaus.plexus.util.cli.CommandLineUtils.executeCommandLine(CommandLineUtils.java:107)
	at org.codehaus.plexus.components.io.attributes.PlexusIoResourceAttributeUtils.executeLs(PlexusIoResourceAttributeUtils.java:277)
	... 39 more
Caused by: java.io.IOException: Cannot run program "/bin/sh": error=12, Not enough space
	at java.lang.ProcessBuilder.start(ProcessBuilder.java:460)
	at java.lang.Runtime.exec(Runtime.java:593)
	at java.lang.Runtime.exec(Runtime.java:509)
	at org.codehaus.plexus.util.cli.Commandline.execute(Commandline.java:636)
	... 42 more
Caused by: java.io.IOException: error=12, Not enough space
	at java.lang.UNIXProcess.forkAndExec(Native Method)
	at java.lang.UNIXProcess.<init>(UNIXProcess.java:53)
	at java.lang.ProcessImpl.start(ProcessImpl.java:65)
	at java.lang.ProcessBuilder.start(ProcessBuilder.java:453)
	... 45 more
Sending e-mails to: server-dev@james.apache.org
channel stopped
[locks-and-latches] Releasing all the locks
[locks-and-latches] All the locks released

---------------------------------------------------------------------
To unsubscribe, e-mail: server-dev-unsubscribe@james.apache.org
For additional commands, e-mail: server-dev-help@james.apache.org


Mime
View raw message