james-server-dev mailing list archives

Site index · List index
Message view « Date » · « Thread »
Top « Date » · « Thread »
From Apache Jenkins Server <jenk...@builds.apache.org>
Subject Build failed in Jenkins: jdkim-trunk #1737
Date Thu, 25 Jul 2013 11:57:56 GMT
See <https://builds.apache.org/job/jdkim-trunk/1737/>

------------------------------------------
[...truncated 259 lines...]
[TASKS] Scanning folder '<https://builds.apache.org/job/jdkim-trunk/ws/trunk/mailets'>
for files matching the pattern '**/*.java' - excludes: 
[TASKS] Found 8 files to scan for tasks
Found 0 open tasks.
[TASKS] Computing warning deltas based on reference build #1736
Jul 25, 2013 11:50:08 AM org.apache.maven.cli.event.ExecutionEventLogger mojoStarted
INFO: 
Jul 25, 2013 11:50:08 AM org.apache.maven.cli.event.ExecutionEventLogger mojoStarted
INFO: --- maven-remote-resources-plugin:1.2.1:process (default) @ apache-jdkim-mailets ---
Jul 25, 2013 11:50:14 AM org.apache.maven.cli.event.ExecutionEventLogger mojoStarted
INFO: 
Jul 25, 2013 11:50:14 AM org.apache.maven.cli.event.ExecutionEventLogger mojoStarted
INFO: --- maven-resources-plugin:2.5:resources (default-resources) @ apache-jdkim-mailets
---
[debug] execute contextualize
[INFO] Using 'UTF-8' encoding to copy filtered resources.
[INFO] Copying 0 resource
[INFO] Copying 3 resources
Jul 25, 2013 11:50:16 AM org.apache.maven.cli.event.ExecutionEventLogger mojoStarted
INFO: 
Jul 25, 2013 11:50:16 AM org.apache.maven.cli.event.ExecutionEventLogger mojoStarted
INFO: --- maven-compiler-plugin:2.3.2:compile (default-compile) @ apache-jdkim-mailets ---
[INFO] Compiling 6 source files to <https://builds.apache.org/job/jdkim-trunk/ws/trunk/mailets/target/classes>
Jul 25, 2013 11:50:22 AM org.apache.maven.cli.event.ExecutionEventLogger mojoStarted
INFO: 
Jul 25, 2013 11:50:22 AM org.apache.maven.cli.event.ExecutionEventLogger mojoStarted
INFO: --- maven-resources-plugin:2.5:testResources (default-testResources) @ apache-jdkim-mailets
---
[debug] execute contextualize
[INFO] Using 'UTF-8' encoding to copy filtered resources.
[INFO] Copying 0 resource
[INFO] Copying 3 resources
Jul 25, 2013 11:50:25 AM org.apache.maven.cli.event.ExecutionEventLogger mojoStarted
INFO: 
Jul 25, 2013 11:50:25 AM org.apache.maven.cli.event.ExecutionEventLogger mojoStarted
INFO: --- maven-compiler-plugin:2.3.2:testCompile (default-testCompile) @ apache-jdkim-mailets
---
[INFO] Compiling 2 source files to <https://builds.apache.org/job/jdkim-trunk/ws/trunk/mailets/target/test-classes>
Jul 25, 2013 11:50:29 AM org.apache.maven.cli.event.ExecutionEventLogger mojoStarted
INFO: 
Jul 25, 2013 11:50:29 AM org.apache.maven.cli.event.ExecutionEventLogger mojoStarted
INFO: --- maven-surefire-plugin:2.10:test (default-test) @ apache-jdkim-mailets ---
[INFO] Surefire report directory: <https://builds.apache.org/job/jdkim-trunk/ws/trunk/mailets/target/surefire-reports>

-------------------------------------------------------
 T E S T S
-------------------------------------------------------

-------------------------------------------------------
 T E S T S
-------------------------------------------------------
Running org.apache.james.jdkim.mailets.DKIMSignTest
Tests run: 6, Failures: 0, Errors: 0, Skipped: 0, Time elapsed: 15.224 sec
Running org.apache.james.jdkim.mailets.DKIMVerifyTest
Tests run: 4, Failures: 0, Errors: 0, Skipped: 0, Time elapsed: 1.775 sec

Results :

Tests run: 10, Failures: 0, Errors: 0, Skipped: 0

[JENKINS] Recording test results
Jul 25, 2013 11:51:01 AM org.apache.maven.cli.event.ExecutionEventLogger mojoStarted
INFO: 
Jul 25, 2013 11:51:01 AM org.apache.maven.cli.event.ExecutionEventLogger mojoStarted
INFO: --- maven-bundle-plugin:2.3.7:bundle (default-bundle) @ apache-jdkim-mailets ---
Jul 25, 2013 11:51:05 AM org.apache.maven.cli.event.ExecutionEventLogger mojoStarted
INFO: 
Jul 25, 2013 11:51:05 AM org.apache.maven.cli.event.ExecutionEventLogger mojoStarted
INFO: --- maven-site-plugin:3.0:attach-descriptor (attach-descriptor) @ apache-jdkim-mailets
---
Jul 25, 2013 11:51:08 AM org.apache.maven.cli.event.ExecutionEventLogger mojoStarted
INFO: 
Jul 25, 2013 11:51:08 AM org.apache.maven.cli.event.ExecutionEventLogger mojoStarted
INFO: --- maven-install-plugin:2.3.1:install (default-install) @ apache-jdkim-mailets ---
[INFO] Installing <https://builds.apache.org/job/jdkim-trunk/ws/trunk/mailets/target/apache-jdkim-mailets-0.3-SNAPSHOT.jar>
to /export/home/hudson/hudson-slave/maven-repositories/1/org/apache/james/jdkim/apache-jdkim-mailets/0.3-SNAPSHOT/apache-jdkim-mailets-0.3-SNAPSHOT.jar
[INFO] Installing <https://builds.apache.org/job/jdkim-trunk/ws/trunk/mailets/pom.xml>
to /export/home/hudson/hudson-slave/maven-repositories/1/org/apache/james/jdkim/apache-jdkim-mailets/0.3-SNAPSHOT/apache-jdkim-mailets-0.3-SNAPSHOT.pom
Jul 25, 2013 11:51:11 AM org.apache.maven.cli.event.ExecutionEventLogger mojoStarted
INFO: 
Jul 25, 2013 11:51:11 AM org.apache.maven.cli.event.ExecutionEventLogger mojoStarted
INFO: --- maven-bundle-plugin:2.3.7:install (default-install) @ apache-jdkim-mailets ---
[INFO] Installing org/apache/james/jdkim/apache-jdkim-mailets/0.3-SNAPSHOT/apache-jdkim-mailets-0.3-SNAPSHOT.jar
[INFO] Writing OBR metadata
Jul 25, 2013 11:51:15 AM org.apache.maven.cli.event.ExecutionEventLogger mojoStarted
INFO: 
Jul 25, 2013 11:51:15 AM org.apache.maven.cli.event.ExecutionEventLogger mojoStarted
INFO: --- maven-deploy-plugin:2.7:deploy (default-deploy) @ apache-jdkim-mailets ---
Downloading: https://repository.apache.org/content/repositories/snapshots/org/apache/james/jdkim/apache-jdkim-mailets/0.3-SNAPSHOT/maven-metadata.xml
Downloaded: https://repository.apache.org/content/repositories/snapshots/org/apache/james/jdkim/apache-jdkim-mailets/0.3-SNAPSHOT/maven-metadata.xml
(792 B at 0.3 KB/sec)
Uploading: https://repository.apache.org/content/repositories/snapshots/org/apache/james/jdkim/apache-jdkim-mailets/0.3-SNAPSHOT/apache-jdkim-mailets-0.3-20130725.115118-543.jar
Uploaded: https://repository.apache.org/content/repositories/snapshots/org/apache/james/jdkim/apache-jdkim-mailets/0.3-SNAPSHOT/apache-jdkim-mailets-0.3-20130725.115118-543.jar
(19 KB at 7.4 KB/sec)
Uploading: https://repository.apache.org/content/repositories/snapshots/org/apache/james/jdkim/apache-jdkim-mailets/0.3-SNAPSHOT/apache-jdkim-mailets-0.3-20130725.115118-543.pom
Uploaded: https://repository.apache.org/content/repositories/snapshots/org/apache/james/jdkim/apache-jdkim-mailets/0.3-SNAPSHOT/apache-jdkim-mailets-0.3-20130725.115118-543.pom
(5 KB at 2.3 KB/sec)
Downloading: https://repository.apache.org/content/repositories/snapshots/org/apache/james/jdkim/apache-jdkim-mailets/maven-metadata.xml
Downloaded: https://repository.apache.org/content/repositories/snapshots/org/apache/james/jdkim/apache-jdkim-mailets/maven-metadata.xml
(300 B at 0.2 KB/sec)
Uploading: https://repository.apache.org/content/repositories/snapshots/org/apache/james/jdkim/apache-jdkim-mailets/0.3-SNAPSHOT/maven-metadata.xml
Uploaded: https://repository.apache.org/content/repositories/snapshots/org/apache/james/jdkim/apache-jdkim-mailets/0.3-SNAPSHOT/maven-metadata.xml
(792 B at 0.5 KB/sec)
Uploading: https://repository.apache.org/content/repositories/snapshots/org/apache/james/jdkim/apache-jdkim-mailets/maven-metadata.xml
Uploaded: https://repository.apache.org/content/repositories/snapshots/org/apache/james/jdkim/apache-jdkim-mailets/maven-metadata.xml
(300 B at 0.2 KB/sec)
Jul 25, 2013 11:51:29 AM org.apache.maven.cli.event.ExecutionEventLogger mojoStarted
INFO: 
Jul 25, 2013 11:51:29 AM org.apache.maven.cli.event.ExecutionEventLogger mojoStarted
INFO: --- maven-bundle-plugin:2.3.7:deploy (default-deploy) @ apache-jdkim-mailets ---
[INFO] Remote OBR update disabled (enable with -DremoteOBR)
Jul 25, 2013 11:51:33 AM org.apache.maven.cli.event.ExecutionEventLogger projectStarted
INFO:                                                                         
Jul 25, 2013 11:51:33 AM org.apache.maven.cli.event.ExecutionEventLogger projectStarted
INFO: ------------------------------------------------------------------------
Jul 25, 2013 11:51:33 AM org.apache.maven.cli.event.ExecutionEventLogger projectStarted
INFO: Building Apache James :: jDKIM :: Assembly 0.3-SNAPSHOT
Jul 25, 2013 11:51:33 AM org.apache.maven.cli.event.ExecutionEventLogger projectStarted
INFO: ------------------------------------------------------------------------
Jul 25, 2013 11:51:34 AM org.apache.maven.cli.event.ExecutionEventLogger mojoStarted
INFO: 
Jul 25, 2013 11:51:34 AM org.apache.maven.cli.event.ExecutionEventLogger mojoStarted
INFO: --- maven-clean-plugin:2.4.1:clean (default-clean) @ apache-jdkim ---
[TASKS] Scanning folder '<https://builds.apache.org/job/jdkim-trunk/ws/trunk/assemble'>
for files matching the pattern '**/*.java' - excludes: 
[TASKS] Found 0 files to scan for tasks
Found 0 open tasks.
[TASKS] Computing warning deltas based on reference build #1736
Jul 25, 2013 11:51:39 AM org.apache.maven.cli.event.ExecutionEventLogger mojoStarted
INFO: 
Jul 25, 2013 11:51:39 AM org.apache.maven.cli.event.ExecutionEventLogger mojoStarted
INFO: --- maven-remote-resources-plugin:1.2.1:process (default) @ apache-jdkim ---
Jul 25, 2013 11:51:44 AM org.apache.maven.cli.event.ExecutionEventLogger mojoStarted
INFO: 
Jul 25, 2013 11:51:44 AM org.apache.maven.cli.event.ExecutionEventLogger mojoStarted
INFO: --- maven-site-plugin:3.0:attach-descriptor (attach-descriptor) @ apache-jdkim ---
Jul 25, 2013 11:51:47 AM org.apache.maven.cli.event.ExecutionEventLogger mojoStarted
INFO: 
Jul 25, 2013 11:51:47 AM org.apache.maven.cli.event.ExecutionEventLogger mojoStarted
INFO: --- maven-assembly-plugin:2.2.1:attached (make-assembly) @ apache-jdkim ---
[INFO] Building zip: <https://builds.apache.org/job/jdkim-trunk/ws/trunk/assemble/target/apache-jdkim-0.3-SNAPSHOT-bin.zip>
Jul 25, 2013 11:54:18 AM org.apache.maven.cli.event.ExecutionEventLogger logReactorSummary
INFO: ------------------------------------------------------------------------
Jul 25, 2013 11:54:18 AM org.apache.maven.cli.event.ExecutionEventLogger logReactorSummary
INFO: Reactor Summary:
Jul 25, 2013 11:54:18 AM org.apache.maven.cli.event.ExecutionEventLogger logReactorSummary
INFO: 
Jul 25, 2013 11:54:18 AM org.apache.maven.cli.event.ExecutionEventLogger logReactorSummary
INFO: Apache James :: jDKIM :: DomainKey Project ........ SUCCESS [3:12.815s]
Jul 25, 2013 11:54:18 AM org.apache.maven.cli.event.ExecutionEventLogger logReactorSummary
INFO: Apache James :: jDKIM ............................. SUCCESS [3:23.015s]
Jul 25, 2013 11:54:18 AM org.apache.maven.cli.event.ExecutionEventLogger logReactorSummary
INFO: Apache James :: jDKIM :: Mailets .................. SUCCESS [1:31.619s]
Jul 25, 2013 11:54:18 AM org.apache.maven.cli.event.ExecutionEventLogger logReactorSummary
INFO: Apache James :: jDKIM :: Assembly ................. FAILURE [2:44.299s]
Jul 25, 2013 11:54:18 AM org.apache.maven.cli.event.ExecutionEventLogger logResult
INFO: ------------------------------------------------------------------------
Jul 25, 2013 11:54:18 AM org.apache.maven.cli.event.ExecutionEventLogger logResult
INFO: BUILD FAILURE
Jul 25, 2013 11:54:18 AM org.apache.maven.cli.event.ExecutionEventLogger logStats
INFO: ------------------------------------------------------------------------
Jul 25, 2013 11:54:18 AM org.apache.maven.cli.event.ExecutionEventLogger logStats
INFO: Total time: 11:11.443s
Jul 25, 2013 11:54:18 AM org.apache.maven.cli.event.ExecutionEventLogger logStats
INFO: Finished at: Thu Jul 25 11:54:18 GMT+00:00 2013
Jul 25, 2013 11:54:19 AM org.apache.maven.cli.event.ExecutionEventLogger logStats
INFO: Final Memory: 31M/143M
Jul 25, 2013 11:54:19 AM org.apache.maven.cli.event.ExecutionEventLogger sessionEnded
INFO: ------------------------------------------------------------------------
[JENKINS] Archiving <https://builds.apache.org/job/jdkim-trunk/ws/trunk/mailets/pom.xml>
to /home/hudson/hudson/jobs/jdkim-trunk/modules/org.apache.james.jdkim$apache-jdkim-mailets/builds/2013-07-25_11-41-14/archive/org.apache.james.jdkim/apache-jdkim-mailets/0.3-SNAPSHOT/apache-jdkim-mailets-0.3-SNAPSHOT.pom
[JENKINS] Archiving <https://builds.apache.org/job/jdkim-trunk/ws/trunk/mailets/target/apache-jdkim-mailets-0.3-SNAPSHOT.jar>
to /home/hudson/hudson/jobs/jdkim-trunk/modules/org.apache.james.jdkim$apache-jdkim-mailets/builds/2013-07-25_11-41-14/archive/org.apache.james.jdkim/apache-jdkim-mailets/0.3-20130725.115118-543/apache-jdkim-mailets-0.3-20130725.115118-543.jar
[JENKINS] Archiving <https://builds.apache.org/job/jdkim-trunk/ws/trunk/pom.xml> to
/home/hudson/hudson/jobs/jdkim-trunk/modules/org.apache.james.jdkim$apache-jdkim-project/builds/2013-07-25_11-41-12/archive/org.apache.james.jdkim/apache-jdkim-project/0.3-SNAPSHOT/apache-jdkim-project-0.3-SNAPSHOT.pom
[JENKINS] Archiving <https://builds.apache.org/job/jdkim-trunk/ws/trunk/target/apache-jdkim-project-0.3-SNAPSHOT-site.xml>
to /home/hudson/hudson/jobs/jdkim-trunk/modules/org.apache.james.jdkim$apache-jdkim-project/builds/2013-07-25_11-41-12/archive/org.apache.james.jdkim/apache-jdkim-project/0.3-20130725.114622-561/apache-jdkim-project-0.3-20130725.114622-561-site.xml
[JENKINS] Archiving <https://builds.apache.org/job/jdkim-trunk/ws/trunk/assemble/pom.xml>
to /home/hudson/hudson/jobs/jdkim-trunk/modules/org.apache.james.jdkim$apache-jdkim/builds/2013-07-25_11-41-16/archive/org.apache.james.jdkim/apache-jdkim/0.3-SNAPSHOT/apache-jdkim-0.3-SNAPSHOT.pom
[JENKINS] Archiving <https://builds.apache.org/job/jdkim-trunk/ws/trunk/assemble/target/apache-jdkim-0.3-SNAPSHOT-bin.zip>
to /home/hudson/hudson/jobs/jdkim-trunk/modules/org.apache.james.jdkim$apache-jdkim/builds/2013-07-25_11-41-16/archive/org.apache.james.jdkim/apache-jdkim/0.3-SNAPSHOT/apache-jdkim-0.3-SNAPSHOT-bin.zip
[JENKINS] Archiving <https://builds.apache.org/job/jdkim-trunk/ws/trunk/main/dependency-reduced-pom.xml>
to /home/hudson/hudson/jobs/jdkim-trunk/modules/org.apache.james.jdkim$apache-jdkim-library/builds/2013-07-25_11-41-13/archive/org.apache.james.jdkim/apache-jdkim-library/0.3-SNAPSHOT/apache-jdkim-library-0.3-SNAPSHOT.pom
[JENKINS] Archiving <https://builds.apache.org/job/jdkim-trunk/ws/trunk/main/target/apache-jdkim-library-0.3-SNAPSHOT.jar>
to /home/hudson/hudson/jobs/jdkim-trunk/modules/org.apache.james.jdkim$apache-jdkim-library/builds/2013-07-25_11-41-13/archive/org.apache.james.jdkim/apache-jdkim-library/0.3-20130725.114938-551/apache-jdkim-library-0.3-20130725.114938-551.jar
[JENKINS] Archiving <https://builds.apache.org/job/jdkim-trunk/ws/trunk/main/target/apache-jdkim-library-0.3-SNAPSHOT-tests.jar>
to /home/hudson/hudson/jobs/jdkim-trunk/modules/org.apache.james.jdkim$apache-jdkim-library/builds/2013-07-25_11-41-13/archive/org.apache.james.jdkim/apache-jdkim-library/0.3-20130725.114938-551/apache-jdkim-library-0.3-20130725.114938-551-tests.jar
Waiting for Jenkins to finish collecting data
mavenExecutionResult exceptions not empty
message : Failed to execute goal org.apache.maven.plugins:maven-assembly-plugin:2.2.1:attached
(make-assembly) on project apache-jdkim: Failed to create assembly: Error creating assembly
archive bin: Failed to retrieve numeric file attributes using: '/bin/sh -c ls -1nlaR <https://builds.apache.org/job/jdkim-trunk/ws/trunk/assemble/../main/target'>
cause : Failed to create assembly: Error creating assembly archive bin: Failed to retrieve
numeric file attributes using: '/bin/sh -c ls -1nlaR <https://builds.apache.org/job/jdkim-trunk/ws/trunk/assemble/../main/target'>
Stack trace : 
org.apache.maven.lifecycle.LifecycleExecutionException: Failed to execute goal org.apache.maven.plugins:maven-assembly-plugin:2.2.1:attached
(make-assembly) on project apache-jdkim: Failed to create assembly: Error creating assembly
archive bin: Failed to retrieve numeric file attributes using: '/bin/sh -c ls -1nlaR <https://builds.apache.org/job/jdkim-trunk/ws/trunk/assemble/../main/target'>
	at org.apache.maven.lifecycle.internal.MojoExecutor.execute(MojoExecutor.java:217)
	at org.apache.maven.lifecycle.internal.MojoExecutor.execute(MojoExecutor.java:153)
	at org.apache.maven.lifecycle.internal.MojoExecutor.execute(MojoExecutor.java:145)
	at org.apache.maven.lifecycle.internal.LifecycleModuleBuilder.buildProject(LifecycleModuleBuilder.java:84)
	at org.apache.maven.lifecycle.internal.LifecycleModuleBuilder.buildProject(LifecycleModuleBuilder.java:59)
	at org.apache.maven.lifecycle.internal.LifecycleStarter.singleThreadedBuild(LifecycleStarter.java:183)
	at org.apache.maven.lifecycle.internal.LifecycleStarter.execute(LifecycleStarter.java:161)
	at org.apache.maven.DefaultMaven.doExecute(DefaultMaven.java:320)
	at org.apache.maven.DefaultMaven.execute(DefaultMaven.java:156)
	at org.jvnet.hudson.maven3.launcher.Maven3Launcher.main(Maven3Launcher.java:117)
	at sun.reflect.NativeMethodAccessorImpl.invoke0(Native Method)
	at sun.reflect.NativeMethodAccessorImpl.invoke(NativeMethodAccessorImpl.java:39)
	at sun.reflect.DelegatingMethodAccessorImpl.invoke(DelegatingMethodAccessorImpl.java:25)
	at java.lang.reflect.Method.invoke(Method.java:597)
	at org.codehaus.plexus.classworlds.launcher.Launcher.launchStandard(Launcher.java:329)
	at org.codehaus.plexus.classworlds.launcher.Launcher.launch(Launcher.java:239)
	at org.jvnet.hudson.maven3.agent.Maven3Main.launch(Maven3Main.java:178)
	at sun.reflect.NativeMethodAccessorImpl.invoke0(Native Method)
	at sun.reflect.NativeMethodAccessorImpl.invoke(NativeMethodAccessorImpl.java:39)
	at sun.reflect.DelegatingMethodAccessorImpl.invoke(DelegatingMethodAccessorImpl.java:25)
	at java.lang.reflect.Method.invoke(Method.java:597)
	at hudson.maven.Maven3Builder.call(Maven3Builder.java:129)
	at hudson.maven.Maven3Builder.call(Maven3Builder.java:67)
	at hudson.remoting.UserRequest.perform(UserRequest.java:118)
	at hudson.remoting.UserRequest.perform(UserRequest.java:48)
	at hudson.remoting.Request$2.run(Request.java:326)
	at hudson.remoting.InterceptingExecutorService$1.call(InterceptingExecutorService.java:72)
	at java.util.concurrent.FutureTask$Sync.innerRun(FutureTask.java:303)
	at java.util.concurrent.FutureTask.run(FutureTask.java:138)
	at java.util.concurrent.ThreadPoolExecutor$Worker.runTask(ThreadPoolExecutor.java:886)
	at java.util.concurrent.ThreadPoolExecutor$Worker.run(ThreadPoolExecutor.java:908)
	at java.lang.Thread.run(Thread.java:662)
Caused by: org.apache.maven.plugin.MojoExecutionException: Failed to create assembly: Error
creating assembly archive bin: Failed to retrieve numeric file attributes using: '/bin/sh
-c ls -1nlaR <https://builds.apache.org/job/jdkim-trunk/ws/trunk/assemble/../main/target'>
	at org.apache.maven.plugin.assembly.mojos.AbstractAssemblyMojo.execute(AbstractAssemblyMojo.java:472)
	at org.apache.maven.plugin.DefaultBuildPluginManager.executeMojo(DefaultBuildPluginManager.java:101)
	at org.apache.maven.lifecycle.internal.MojoExecutor.execute(MojoExecutor.java:209)
	... 31 more
Caused by: org.apache.maven.plugin.assembly.archive.ArchiveCreationException: Error creating
assembly archive bin: Failed to retrieve numeric file attributes using: '/bin/sh -c ls -1nlaR
<https://builds.apache.org/job/jdkim-trunk/ws/trunk/assemble/../main/target'>
	at org.apache.maven.plugin.assembly.archive.DefaultAssemblyArchiver.createArchive(DefaultAssemblyArchiver.java:196)
	at org.apache.maven.plugin.assembly.mojos.AbstractAssemblyMojo.execute(AbstractAssemblyMojo.java:413)
	... 33 more
Caused by: org.codehaus.plexus.archiver.ArchiverException: Failed to retrieve numeric file
attributes using: '/bin/sh -c ls -1nlaR <https://builds.apache.org/job/jdkim-trunk/ws/trunk/assemble/../main/target'>
	at org.codehaus.plexus.archiver.AbstractArchiver$1.hasNext(AbstractArchiver.java:439)
	at org.codehaus.plexus.archiver.AbstractArchiver$1.hasNext(AbstractArchiver.java:466)
	at org.apache.maven.plugin.assembly.filter.ComponentsXmlArchiverFileFilter.finalizeArchiveCreation(ComponentsXmlArchiverFileFilter.java:166)
	at org.codehaus.plexus.archiver.AbstractArchiver.runArchiveFinalizers(AbstractArchiver.java:845)
	at org.codehaus.plexus.archiver.AbstractArchiver.createArchive(AbstractArchiver.java:869)
	at org.apache.maven.plugin.assembly.archive.archiver.AssemblyProxyArchiver.createArchive(AssemblyProxyArchiver.java:512)
	at org.apache.maven.plugin.assembly.archive.DefaultAssemblyArchiver.createArchive(DefaultAssemblyArchiver.java:192)
	... 34 more
Caused by: java.io.IOException: Failed to retrieve numeric file attributes using: '/bin/sh
-c ls -1nlaR <https://builds.apache.org/job/jdkim-trunk/ws/trunk/assemble/../main/target'>
	at org.codehaus.plexus.components.io.attributes.PlexusIoResourceAttributeUtils.executeLs(PlexusIoResourceAttributeUtils.java:287)
	at org.codehaus.plexus.components.io.attributes.PlexusIoResourceAttributeUtils.getFileAttributesByPath(PlexusIoResourceAttributeUtils.java:223)
	at org.codehaus.plexus.components.io.attributes.PlexusIoResourceAttributeUtils.getFileAttributesByPath(PlexusIoResourceAttributeUtils.java:189)
	at org.codehaus.plexus.components.io.resources.PlexusIoFileResourceCollection.getResources(PlexusIoFileResourceCollection.java:175)
	at org.codehaus.plexus.archiver.AbstractArchiver$1.hasNext(AbstractArchiver.java:435)
	... 40 more
Caused by: org.codehaus.plexus.util.cli.CommandLineException: Error while executing process.
	at org.codehaus.plexus.util.cli.Commandline.execute(Commandline.java:656)
	at org.codehaus.plexus.util.cli.CommandLineUtils.executeCommandLine(CommandLineUtils.java:144)
	at org.codehaus.plexus.util.cli.CommandLineUtils.executeCommandLine(CommandLineUtils.java:107)
	at org.codehaus.plexus.components.io.attributes.PlexusIoResourceAttributeUtils.executeLs(PlexusIoResourceAttributeUtils.java:277)
	... 44 more
Caused by: java.io.IOException: Cannot run program "/bin/sh": error=12, Not enough space
	at java.lang.ProcessBuilder.start(ProcessBuilder.java:460)
	at java.lang.Runtime.exec(Runtime.java:593)
	at java.lang.Runtime.exec(Runtime.java:509)
	at org.codehaus.plexus.util.cli.Commandline.execute(Commandline.java:636)
	... 47 more
Caused by: java.io.IOException: error=12, Not enough space
	at java.lang.UNIXProcess.forkAndExec(Native Method)
	at java.lang.UNIXProcess.<init>(UNIXProcess.java:53)
	at java.lang.ProcessImpl.start(ProcessImpl.java:65)
	at java.lang.ProcessBuilder.start(ProcessBuilder.java:453)
	... 50 more
Sending e-mails to: server-dev@james.apache.org
channel stopped
[locks-and-latches] Releasing all the locks
[locks-and-latches] All the locks released

---------------------------------------------------------------------
To unsubscribe, e-mail: server-dev-unsubscribe@james.apache.org
For additional commands, e-mail: server-dev-help@james.apache.org


Mime
View raw message