james-server-dev mailing list archives

Site index · List index
Message view « Date » · « Thread »
Top « Date » · « Thread »
From Apache Jenkins Server <jenk...@builds.apache.org>
Subject Build failed in Jenkins: james-server-trunk #3972
Date Sun, 04 Aug 2013 01:14:02 GMT
See <https://builds.apache.org/job/james-server-trunk/3972/>

------------------------------------------
[...truncated 8475 lines...]
Uploaded: https://repository.apache.org/content/repositories/snapshots/org/apache/james/james-server-data-jdbc/3.0.0-beta5-SNAPSHOT/maven-metadata.xml
(2 KB at 4.2 KB/sec)
Uploading: https://repository.apache.org/content/repositories/snapshots/org/apache/james/james-server-data-jdbc/3.0.0-beta5-SNAPSHOT/james-server-data-jdbc-3.0.0-beta5-20130804.011053-175-sources.jar
Uploaded: https://repository.apache.org/content/repositories/snapshots/org/apache/james/james-server-data-jdbc/3.0.0-beta5-SNAPSHOT/james-server-data-jdbc-3.0.0-beta5-20130804.011053-175-sources.jar
(34 KB at 83.1 KB/sec)
Uploading: https://repository.apache.org/content/repositories/snapshots/org/apache/james/james-server-data-jdbc/3.0.0-beta5-SNAPSHOT/maven-metadata.xml
Uploaded: https://repository.apache.org/content/repositories/snapshots/org/apache/james/james-server-data-jdbc/3.0.0-beta5-SNAPSHOT/maven-metadata.xml
(2 KB at 4.1 KB/sec)
Uploading: https://repository.apache.org/content/repositories/snapshots/org/apache/james/james-server-data-jdbc/3.0.0-beta5-SNAPSHOT/james-server-data-jdbc-3.0.0-beta5-20130804.011053-175-test-sources.jar
Uploaded: https://repository.apache.org/content/repositories/snapshots/org/apache/james/james-server-data-jdbc/3.0.0-beta5-SNAPSHOT/james-server-data-jdbc-3.0.0-beta5-20130804.011053-175-test-sources.jar
(27 KB at 65.6 KB/sec)
Uploading: https://repository.apache.org/content/repositories/snapshots/org/apache/james/james-server-data-jdbc/3.0.0-beta5-SNAPSHOT/maven-metadata.xml
Uploaded: https://repository.apache.org/content/repositories/snapshots/org/apache/james/james-server-data-jdbc/3.0.0-beta5-SNAPSHOT/maven-metadata.xml
(2 KB at 4.1 KB/sec)
Aug 4, 2013 1:10:57 AM org.apache.maven.cli.event.ExecutionEventLogger mojoStarted
INFO: 
Aug 4, 2013 1:10:57 AM org.apache.maven.cli.event.ExecutionEventLogger mojoStarted
INFO: --- maven-bundle-plugin:2.3.7:deploy (default-deploy) @ james-server-data-jdbc ---
[INFO] Remote OBR update disabled (enable with -DremoteOBR)
Aug 4, 2013 1:10:57 AM org.apache.maven.cli.event.ExecutionEventLogger projectStarted
INFO:                                                                         
Aug 4, 2013 1:10:57 AM org.apache.maven.cli.event.ExecutionEventLogger projectStarted
INFO: ------------------------------------------------------------------------
Aug 4, 2013 1:10:57 AM org.apache.maven.cli.event.ExecutionEventLogger projectStarted
INFO: Building Apache James :: Server :: Data :: HBase Persistence 3.0.0-beta5-SNAPSHOT
Aug 4, 2013 1:10:57 AM org.apache.maven.cli.event.ExecutionEventLogger projectStarted
INFO: ------------------------------------------------------------------------
Downloading: http://repository.apache.org/snapshots/org/apache/james/apache-james-mailbox-hbase/0.6-SNAPSHOT/maven-metadata.xml
Downloaded: http://repository.apache.org/snapshots/org/apache/james/apache-james-mailbox-hbase/0.6-SNAPSHOT/maven-metadata.xml
(2 KB at 4.5 KB/sec)
Downloading: http://repository.apache.org/snapshots/org/apache/james/apache-james-mailbox-hbase/0.6-SNAPSHOT/apache-james-mailbox-hbase-0.6-20130803.041729-117.pom
Downloaded: http://repository.apache.org/snapshots/org/apache/james/apache-james-mailbox-hbase/0.6-SNAPSHOT/apache-james-mailbox-hbase-0.6-20130803.041729-117.pom
(6 KB at 20.7 KB/sec)
Downloading: http://repository.apache.org/snapshots/org/apache/james/apache-james-mailbox-hbase/0.6-SNAPSHOT/apache-james-mailbox-hbase-0.6-20130803.041729-117-tests.jar
Downloaded: http://repository.apache.org/snapshots/org/apache/james/apache-james-mailbox-hbase/0.6-SNAPSHOT/apache-james-mailbox-hbase-0.6-20130803.041729-117-tests.jar
(42 KB at 132.6 KB/sec)
Aug 4, 2013 1:11:04 AM org.apache.maven.cli.event.ExecutionEventLogger mojoStarted
INFO: 
Aug 4, 2013 1:11:04 AM org.apache.maven.cli.event.ExecutionEventLogger mojoStarted
INFO: --- maven-clean-plugin:2.5:clean (default-clean) @ james-server-data-hbase ---
[INFO] Deleting <https://builds.apache.org/job/james-server-trunk/ws/trunk/data/data-hbase/target>
Aug 4, 2013 1:11:06 AM org.apache.maven.cli.event.ExecutionEventLogger mojoStarted
INFO: 
Aug 4, 2013 1:11:06 AM org.apache.maven.cli.event.ExecutionEventLogger mojoStarted
INFO: --- maven-remote-resources-plugin:1.4:process (default) @ james-server-data-hbase ---
Aug 4, 2013 1:11:07 AM org.apache.maven.cli.event.ExecutionEventLogger mojoStarted
INFO: 
Aug 4, 2013 1:11:07 AM org.apache.maven.cli.event.ExecutionEventLogger mojoStarted
INFO: --- maven-resources-plugin:2.6:resources (default-resources) @ james-server-data-hbase
---
[INFO] Using 'UTF-8' encoding to copy filtered resources.
[INFO] skip non existing resourceDirectory <https://builds.apache.org/job/james-server-trunk/ws/trunk/data/data-hbase/src/main/resources>
[INFO] Copying 3 resources
Aug 4, 2013 1:11:07 AM org.apache.maven.cli.event.ExecutionEventLogger mojoStarted
INFO: 
Aug 4, 2013 1:11:07 AM org.apache.maven.cli.event.ExecutionEventLogger mojoStarted
INFO: --- maven-compiler-plugin:3.0:compile (default-compile) @ james-server-data-hbase ---
[INFO] Changes detected - recompiling the module!
[INFO] Compiling 7 source files to <https://builds.apache.org/job/james-server-trunk/ws/trunk/data/data-hbase/target/classes>
Aug 4, 2013 1:11:10 AM org.apache.maven.cli.event.ExecutionEventLogger mojoStarted
INFO: 
Aug 4, 2013 1:11:10 AM org.apache.maven.cli.event.ExecutionEventLogger mojoStarted
INFO: --- maven-resources-plugin:2.6:testResources (default-testResources) @ james-server-data-hbase
---
[INFO] Using 'UTF-8' encoding to copy filtered resources.
[INFO] Copying 2 resources
[INFO] Copying 3 resources
Aug 4, 2013 1:11:10 AM org.apache.maven.cli.event.ExecutionEventLogger mojoStarted
INFO: 
Aug 4, 2013 1:11:10 AM org.apache.maven.cli.event.ExecutionEventLogger mojoStarted
INFO: --- maven-compiler-plugin:3.0:testCompile (default-testCompile) @ james-server-data-hbase
---
[INFO] Changes detected - recompiling the module!
[INFO] Compiling 4 source files to <https://builds.apache.org/job/james-server-trunk/ws/trunk/data/data-hbase/target/test-classes>
[WARNING] <https://builds.apache.org/job/james-server-trunk/ws/trunk/data/data-hbase/src/test/java/org/apache/james/system/hbase/TablePoolTest.java>:
<https://builds.apache.org/job/james-server-trunk/ws/trunk/data/data-hbase/src/test/java/org/apache/james/system/hbase/TablePoolTest.java>
uses or overrides a deprecated API.
[WARNING] <https://builds.apache.org/job/james-server-trunk/ws/trunk/data/data-hbase/src/test/java/org/apache/james/system/hbase/TablePoolTest.java>:
Recompile with -Xlint:deprecation for details.
Aug 4, 2013 1:11:12 AM org.apache.maven.cli.event.ExecutionEventLogger mojoStarted
INFO: 
Aug 4, 2013 1:11:12 AM org.apache.maven.cli.event.ExecutionEventLogger mojoStarted
INFO: --- maven-surefire-plugin:2.13:test (default-test) @ james-server-data-hbase ---
[INFO] Surefire report directory: <https://builds.apache.org/job/james-server-trunk/ws/trunk/data/data-hbase/target/surefire-reports>

-------------------------------------------------------
 T E S T S
-------------------------------------------------------

-------------------------------------------------------
 T E S T S
-------------------------------------------------------
Running org.apache.james.system.hbase.TablePoolTest
SLF4J: Class path contains multiple SLF4J bindings.
SLF4J: Found binding in [jar:file:/home/jenkins/jenkins-slave/maven-repositories/0/org/slf4j/slf4j-log4j12/1.7.2/slf4j-log4j12-1.7.2.jar!/org/slf4j/impl/StaticLoggerBinder.class]
SLF4J: Found binding in [jar:file:/home/jenkins/jenkins-slave/maven-repositories/0/org/slf4j/slf4j-simple/1.7.2/slf4j-simple-1.7.2.jar!/org/slf4j/impl/StaticLoggerBinder.class]
SLF4J: See http://www.slf4j.org/codes.html#multiple_bindings for an explanation.
SLF4J: Actual binding is of type [org.slf4j.impl.Log4jLoggerFactory]
2013-08-04 01:11:14,126 [main] WARN  org.apache.hadoop.hdfs.server.namenode.FSNamesystem -
The dfs.support.append option is in your configuration, however append is not supported. This
configuration option is no longer required to enable sync.
2013-08-04 01:11:15,071 [main] WARN  org.apache.hadoop.metrics2.impl.MetricsSystemImpl - Source
name ugi already exists!
2013-08-04 01:11:15,099 [main] WARN  org.apache.hadoop.metrics2.impl.MetricsSystemImpl - Source
name ugi already exists!
2013-08-04 01:11:15,124 [main] WARN  org.apache.hadoop.hdfs.server.namenode.FSNamesystem -
The dfs.support.append option is in your configuration, however append is not supported. This
configuration option is no longer required to enable sync.
Starting DataNode 0 with dfs.data.dir: <https://builds.apache.org/job/james-server-trunk/ws/trunk/data/data-hbase/target/test-data/35963de9-9860-4a69-b69c-7ad7debd6a5e/dfscluster_a3d874f3-ada1-4ab2-aeb2-80e1895831cd/dfs/data/data1,/home/jenkins/jenkins-slave/workspace/james-server-trunk/trunk/data/data-hbase/target/test-data/35963de9-9860-4a69-b69c-7ad7debd6a5e/dfscluster_a3d874f3-ada1-4ab2-aeb2-80e1895831cd/dfs/data/data2>
2013-08-04 01:11:16,511 [main] WARN  org.apache.hadoop.metrics2.impl.MetricsSystemImpl - NameNode
metrics system already initialized!
2013-08-04 01:11:16,511 [main] WARN  org.apache.hadoop.metrics2.impl.MetricsSystemImpl - Source
name ugi already exists!
2013-08-04 01:11:17,734 [main] WARN  org.apache.hadoop.metrics2.impl.MetricsSystemImpl - Source
name jvm already exists!
Cluster is active
2013-08-04 01:11:19,630 [org.apache.hadoop.hdfs.server.datanode.DataXceiver@968e429] WARN
 org.apache.hadoop.util.NativeCodeLoader - Unable to load native-hadoop library for your platform...
using builtin-java classes where applicable
2013-08-04 01:11:30,459 [Master:0;juno.apache.org,35413,1375578679012] WARN  org.apache.hadoop.hbase.zookeeper.RecoverableZooKeeper
- Node /hbase/root-region-server already deleted, and this is not a retry
Tests run: 4, Failures: 0, Errors: 0, Skipped: 0, Time elapsed: 28.371 sec
2013-08-04 01:11:43,115 [RegionServer:0;juno.apache.org,50089,1375578679547] WARN  org.apache.hadoop.hbase.regionserver.HRegionServer
- Received close for region we are already opening or closing; 70236052
Running org.apache.james.rrt.hbase.HBaseRecipientRewriteTableTest
SLF4J: Class path contains multiple SLF4J bindings.
SLF4J: Found binding in [jar:file:/home/jenkins/jenkins-slave/maven-repositories/0/org/slf4j/slf4j-log4j12/1.7.2/slf4j-log4j12-1.7.2.jar!/org/slf4j/impl/StaticLoggerBinder.class]
SLF4J: Found binding in [jar:file:/home/jenkins/jenkins-slave/maven-repositories/0/org/slf4j/slf4j-simple/1.7.2/slf4j-simple-1.7.2.jar!/org/slf4j/impl/StaticLoggerBinder.class]
SLF4J: See http://www.slf4j.org/codes.html#multiple_bindings for an explanation.
SLF4J: Actual binding is of type [org.slf4j.impl.Log4jLoggerFactory]
2013-08-04 01:11:46,302 [main] WARN  org.apache.hadoop.hdfs.server.namenode.FSNamesystem -
The dfs.support.append option is in your configuration, however append is not supported. This
configuration option is no longer required to enable sync.
2013-08-04 01:11:48,546 [main] WARN  org.apache.hadoop.metrics2.impl.MetricsSystemImpl - Source
name ugi already exists!
2013-08-04 01:11:48,573 [main] WARN  org.apache.hadoop.metrics2.impl.MetricsSystemImpl - Source
name ugi already exists!
2013-08-04 01:11:48,583 [main] WARN  org.apache.hadoop.hdfs.server.namenode.FSNamesystem -
The dfs.support.append option is in your configuration, however append is not supported. This
configuration option is no longer required to enable sync.
Starting DataNode 0 with dfs.data.dir: <https://builds.apache.org/job/james-server-trunk/ws/trunk/data/data-hbase/target/test-data/83e8f844-4e77-4ef2-9b77-c6095bd8572b/dfscluster_e59531a4-f381-412c-8ef6-b5be5820242e/dfs/data/data1,/home/jenkins/jenkins-slave/workspace/james-server-trunk/trunk/data/data-hbase/target/test-data/83e8f844-4e77-4ef2-9b77-c6095bd8572b/dfscluster_e59531a4-f381-412c-8ef6-b5be5820242e/dfs/data/data2>
2013-08-04 01:11:49,750 [main] WARN  org.apache.hadoop.metrics2.impl.MetricsSystemImpl - NameNode
metrics system already initialized!
2013-08-04 01:11:49,750 [main] WARN  org.apache.hadoop.metrics2.impl.MetricsSystemImpl - Source
name ugi already exists!
2013-08-04 01:11:52,927 [main] WARN  org.apache.hadoop.metrics2.impl.MetricsSystemImpl - Source
name jvm already exists!
Cluster is active
2013-08-04 01:11:54,816 [org.apache.hadoop.hdfs.server.datanode.DataXceiver@4f09dcbb] WARN
 org.apache.hadoop.util.NativeCodeLoader - Unable to load native-hadoop library for your platform...
using builtin-java classes where applicable
2013-08-04 01:12:06,919 [Master:0;juno.apache.org,43510,1375578714185] WARN  org.apache.hadoop.hbase.zookeeper.RecoverableZooKeeper
- Node /hbase/root-region-server already deleted, and this is not a retry
2013-08-04 01:12:16,099 [main] ERROR MockLog - Exception during regexMap processing: 
java.util.regex.PatternSyntaxException: Regex should be formatted as regex:<regular-expression>:<parameterized-string>
near index 0
regex:(.*)@localhost
^
	at org.apache.james.rrt.lib.RecipientRewriteTableUtil.regexMap(RecipientRewriteTableUtil.java:67)
	at org.apache.james.rrt.lib.AbstractRecipientRewriteTable.getMappings(AbstractRecipientRewriteTable.java:137)
	at org.apache.james.rrt.lib.AbstractRecipientRewriteTable.getMappings(AbstractRecipientRewriteTable.java:114)
	at org.apache.james.rrt.lib.AbstractRecipientRewriteTableTest.testStoreAndRetrieveRegexMapping(AbstractRecipientRewriteTableTest.java:96)
	at sun.reflect.NativeMethodAccessorImpl.invoke0(Native Method)
	at sun.reflect.NativeMethodAccessorImpl.invoke(NativeMethodAccessorImpl.java:57)
	at sun.reflect.DelegatingMethodAccessorImpl.invoke(DelegatingMethodAccessorImpl.java:43)
	at java.lang.reflect.Method.invoke(Method.java:616)
	at org.junit.runners.model.FrameworkMethod$1.runReflectiveCall(FrameworkMethod.java:47)
	at org.junit.internal.runners.model.ReflectiveCallable.run(ReflectiveCallable.java:12)
	at org.junit.runners.model.FrameworkMethod.invokeExplosively(FrameworkMethod.java:44)
	at org.junit.internal.runners.statements.InvokeMethod.evaluate(InvokeMethod.java:17)
	at org.junit.internal.runners.statements.RunBefores.evaluate(RunBefores.java:26)
	at org.junit.internal.runners.statements.RunAfters.evaluate(RunAfters.java:27)
	at org.junit.runners.ParentRunner.runLeaf(ParentRunner.java:271)
	at org.junit.runners.BlockJUnit4ClassRunner.runChild(BlockJUnit4ClassRunner.java:70)
	at org.junit.runners.BlockJUnit4ClassRunner.runChild(BlockJUnit4ClassRunner.java:50)
	at org.junit.runners.ParentRunner$3.run(ParentRunner.java:238)
	at org.junit.runners.ParentRunner$1.schedule(ParentRunner.java:63)
	at org.junit.runners.ParentRunner.runChildren(ParentRunner.java:236)
	at org.junit.runners.ParentRunner.access$000(ParentRunner.java:53)
	at org.junit.runners.ParentRunner$2.evaluate(ParentRunner.java:229)
	at org.junit.runners.ParentRunner.run(ParentRunner.java:309)
	at org.apache.maven.surefire.junit4.JUnit4Provider.execute(JUnit4Provider.java:264)
	at org.apache.maven.surefire.junit4.JUnit4Provider.executeTestSet(JUnit4Provider.java:153)
	at org.apache.maven.surefire.junit4.JUnit4Provider.invoke(JUnit4Provider.java:124)
	at sun.reflect.NativeMethodAccessorImpl.invoke0(Native Method)
	at sun.reflect.NativeMethodAccessorImpl.invoke(NativeMethodAccessorImpl.java:57)
	at sun.reflect.DelegatingMethodAccessorImpl.invoke(DelegatingMethodAccessorImpl.java:43)
	at java.lang.reflect.Method.invoke(Method.java:616)
	at org.apache.maven.surefire.util.ReflectionUtils.invokeMethodWithArray2(ReflectionUtils.java:208)
	at org.apache.maven.surefire.booter.ProviderFactory$ProviderProxy.invoke(ProviderFactory.java:158)
	at org.apache.maven.surefire.booter.ProviderFactory.invokeProvider(ProviderFactory.java:86)
	at org.apache.maven.surefire.booter.ForkedBooter.runSuitesInProcess(ForkedBooter.java:153)
	at org.apache.maven.surefire.booter.ForkedBooter.main(ForkedBooter.java:95)
2013-08-04 01:12:16,113 [main] ERROR MockLog - Exception during regexMap processing: 
java.util.regex.PatternSyntaxException: Regex should be formatted as regex:<regular-expression>:<parameterized-string>
near index 0
regex:(.+)@test
^
	at org.apache.james.rrt.lib.RecipientRewriteTableUtil.regexMap(RecipientRewriteTableUtil.java:67)
	at org.apache.james.rrt.lib.AbstractRecipientRewriteTable.getMappings(AbstractRecipientRewriteTable.java:137)
	at org.apache.james.rrt.lib.AbstractRecipientRewriteTable.getMappings(AbstractRecipientRewriteTable.java:114)
	at org.apache.james.rrt.lib.AbstractRecipientRewriteTableTest.testStoreAndRetrieveRegexMapping(AbstractRecipientRewriteTableTest.java:96)
	at sun.reflect.NativeMethodAccessorImpl.invoke0(Native Method)
	at sun.reflect.NativeMethodAccessorImpl.invoke(NativeMethodAccessorImpl.java:57)
	at sun.reflect.DelegatingMethodAccessorImpl.invoke(DelegatingMethodAccessorImpl.java:43)
	at java.lang.reflect.Method.invoke(Method.java:616)
	at org.junit.runners.model.FrameworkMethod$1.runReflectiveCall(FrameworkMethod.java:47)
	at org.junit.internal.runners.model.ReflectiveCallable.run(ReflectiveCallable.java:12)
	at org.junit.runners.model.FrameworkMethod.invokeExplosively(FrameworkMethod.java:44)
	at org.junit.internal.runners.statements.InvokeMethod.evaluate(InvokeMethod.java:17)
	at org.junit.internal.runners.statements.RunBefores.evaluate(RunBefores.java:26)
	at org.junit.internal.runners.statements.RunAfters.evaluate(RunAfters.java:27)
	at org.junit.runners.ParentRunner.runLeaf(ParentRunner.java:271)
	at org.junit.runners.BlockJUnit4ClassRunner.runChild(BlockJUnit4ClassRunner.java:70)
	at org.junit.runners.BlockJUnit4ClassRunner.runChild(BlockJUnit4ClassRunner.java:50)
	at org.junit.runners.ParentRunner$3.run(ParentRunner.java:238)
	at org.junit.runners.ParentRunner$1.schedule(ParentRunner.java:63)
	at org.junit.runners.ParentRunner.runChildren(ParentRunner.java:236)
	at org.junit.runners.ParentRunner.access$000(ParentRunner.java:53)
	at org.junit.runners.ParentRunner$2.evaluate(ParentRunner.java:229)
	at org.junit.runners.ParentRunner.run(ParentRunner.java:309)
	at org.apache.maven.surefire.junit4.JUnit4Provider.execute(JUnit4Provider.java:264)
	at org.apache.maven.surefire.junit4.JUnit4Provider.executeTestSet(JUnit4Provider.java:153)
	at org.apache.maven.surefire.junit4.JUnit4Provider.invoke(JUnit4Provider.java:124)
	at sun.reflect.NativeMethodAccessorImpl.invoke0(Native Method)
	at sun.reflect.NativeMethodAccessorImpl.invoke(NativeMethodAccessorImpl.java:57)
	at sun.reflect.DelegatingMethodAccessorImpl.invoke(DelegatingMethodAccessorImpl.java:43)
	at java.lang.reflect.Method.invoke(Method.java:616)
	at org.apache.maven.surefire.util.ReflectionUtils.invokeMethodWithArray2(ReflectionUtils.java:208)
	at org.apache.maven.surefire.booter.ProviderFactory$ProviderProxy.invoke(ProviderFactory.java:158)
	at org.apache.maven.surefire.booter.ProviderFactory.invokeProvider(ProviderFactory.java:86)
	at org.apache.maven.surefire.booter.ForkedBooter.runSuitesInProcess(ForkedBooter.java:153)
	at org.apache.maven.surefire.booter.ForkedBooter.main(ForkedBooter.java:95)
Tests run: 6, Failures: 0, Errors: 0, Skipped: 0, Time elapsed: 30.746 sec
2013-08-04 01:12:19,449 [RegionServer:0;juno.apache.org,57958,1375578714694] WARN  org.apache.hadoop.hbase.regionserver.HRegionServer
- Received close for region we are already opening or closing; 70236052
2013-08-04 01:12:20,751 [SyncThread:0] WARN  org.apache.zookeeper.server.persistence.FileTxnLog
- fsync-ing the write ahead log in SyncThread:0 took 1299ms which will adversely effect operation
latency. See the ZooKeeper troubleshooting guide
Running org.apache.james.domainlist.hbase.HBaseDomainListTest
SLF4J: Class path contains multiple SLF4J bindings.
SLF4J: Found binding in [jar:file:/home/jenkins/jenkins-slave/maven-repositories/0/org/slf4j/slf4j-log4j12/1.7.2/slf4j-log4j12-1.7.2.jar!/org/slf4j/impl/StaticLoggerBinder.class]
SLF4J: Found binding in [jar:file:/home/jenkins/jenkins-slave/maven-repositories/0/org/slf4j/slf4j-simple/1.7.2/slf4j-simple-1.7.2.jar!/org/slf4j/impl/StaticLoggerBinder.class]
SLF4J: See http://www.slf4j.org/codes.html#multiple_bindings for an explanation.
SLF4J: Actual binding is of type [org.slf4j.impl.Log4jLoggerFactory]
2013-08-04 01:12:26,958 [main] WARN  org.apache.hadoop.hdfs.server.namenode.FSNamesystem -
The dfs.support.append option is in your configuration, however append is not supported. This
configuration option is no longer required to enable sync.
2013-08-04 01:12:28,286 [main] WARN  org.apache.hadoop.metrics2.impl.MetricsSystemImpl - Source
name ugi already exists!
2013-08-04 01:12:28,313 [main] WARN  org.apache.hadoop.metrics2.impl.MetricsSystemImpl - Source
name ugi already exists!
2013-08-04 01:12:28,323 [main] WARN  org.apache.hadoop.hdfs.server.namenode.FSNamesystem -
The dfs.support.append option is in your configuration, however append is not supported. This
configuration option is no longer required to enable sync.
Starting DataNode 0 with dfs.data.dir: <https://builds.apache.org/job/james-server-trunk/ws/trunk/data/data-hbase/target/test-data/553600a8-ffac-4b71-85ca-e91651751ee0/dfscluster_f7959ce4-022b-45a7-bc07-f4701b20a5e3/dfs/data/data1,/home/jenkins/jenkins-slave/workspace/james-server-trunk/trunk/data/data-hbase/target/test-data/553600a8-ffac-4b71-85ca-e91651751ee0/dfscluster_f7959ce4-022b-45a7-bc07-f4701b20a5e3/dfs/data/data2>
2013-08-04 01:12:29,386 [main] WARN  org.apache.hadoop.metrics2.impl.MetricsSystemImpl - NameNode
metrics system already initialized!
2013-08-04 01:12:29,386 [main] WARN  org.apache.hadoop.metrics2.impl.MetricsSystemImpl - Source
name ugi already exists!
2013-08-04 01:12:30,614 [main] WARN  org.apache.hadoop.metrics2.impl.MetricsSystemImpl - Source
name jvm already exists!
Cluster is active
2013-08-04 01:12:33,165 [org.apache.hadoop.hdfs.server.datanode.DataXceiver@73a01e8a] WARN
 org.apache.hadoop.util.NativeCodeLoader - Unable to load native-hadoop library for your platform...
using builtin-java classes where applicable
2013-08-04 01:12:42,775 [Master:0;juno.apache.org,51956,1375578752197] WARN  org.apache.hadoop.hbase.zookeeper.RecoverableZooKeeper
- Node /hbase/root-region-server already deleted, and this is not a retry
Tests run: 5, Failures: 0, Errors: 0, Skipped: 0, Time elapsed: 26.1 sec
2013-08-04 01:12:52,538 [RegionServer:0;juno.apache.org,42445,1375578753029] WARN  org.apache.hadoop.hbase.regionserver.HRegionServer
- Received close for region we are already opening or closing; 70236052
Running org.apache.james.user.hbase.HBaseUsersRepositoryTest
SLF4J: Class path contains multiple SLF4J bindings.
SLF4J: Found binding in [jar:file:/home/jenkins/jenkins-slave/maven-repositories/0/org/slf4j/slf4j-log4j12/1.7.2/slf4j-log4j12-1.7.2.jar!/org/slf4j/impl/StaticLoggerBinder.class]
SLF4J: Found binding in [jar:file:/home/jenkins/jenkins-slave/maven-repositories/0/org/slf4j/slf4j-simple/1.7.2/slf4j-simple-1.7.2.jar!/org/slf4j/impl/StaticLoggerBinder.class]
SLF4J: See http://www.slf4j.org/codes.html#multiple_bindings for an explanation.
SLF4J: Actual binding is of type [org.slf4j.impl.Log4jLoggerFactory]
2013-08-04 01:12:57,041 [main] WARN  org.apache.hadoop.hdfs.server.namenode.FSNamesystem -
The dfs.support.append option is in your configuration, however append is not supported. This
configuration option is no longer required to enable sync.
2013-08-04 01:12:59,964 [main] WARN  org.apache.hadoop.metrics2.impl.MetricsSystemImpl - Source
name ugi already exists!
2013-08-04 01:12:59,991 [main] WARN  org.apache.hadoop.metrics2.impl.MetricsSystemImpl - Source
name ugi already exists!
2013-08-04 01:13:00,001 [main] WARN  org.apache.hadoop.hdfs.server.namenode.FSNamesystem -
The dfs.support.append option is in your configuration, however append is not supported. This
configuration option is no longer required to enable sync.
Starting DataNode 0 with dfs.data.dir: <https://builds.apache.org/job/james-server-trunk/ws/trunk/data/data-hbase/target/test-data/74fa415f-00bc-4bc4-81bb-899238448c8d/dfscluster_ba80c3b4-54c2-4b4b-8347-dbca705c4113/dfs/data/data1,/home/jenkins/jenkins-slave/workspace/james-server-trunk/trunk/data/data-hbase/target/test-data/74fa415f-00bc-4bc4-81bb-899238448c8d/dfscluster_ba80c3b4-54c2-4b4b-8347-dbca705c4113/dfs/data/data2>
2013-08-04 01:13:01,052 [main] WARN  org.apache.hadoop.metrics2.impl.MetricsSystemImpl - NameNode
metrics system already initialized!
2013-08-04 01:13:01,053 [main] WARN  org.apache.hadoop.metrics2.impl.MetricsSystemImpl - Source
name ugi already exists!
2013-08-04 01:13:02,025 [main] WARN  org.apache.hadoop.metrics2.impl.MetricsSystemImpl - Source
name jvm already exists!
Cluster is active
2013-08-04 01:13:04,420 [SyncThread:0] WARN  org.apache.zookeeper.server.persistence.FileTxnLog
- fsync-ing the write ahead log in SyncThread:0 took 1179ms which will adversely effect operation
latency. See the ZooKeeper troubleshooting guide
2013-08-04 01:13:04,754 [org.apache.hadoop.hdfs.server.datanode.DataXceiver@49e4585] WARN
 org.apache.hadoop.util.NativeCodeLoader - Unable to load native-hadoop library for your platform...
using builtin-java classes where applicable
2013-08-04 01:13:14,641 [Master:0;juno.apache.org,59431,1375578783201] WARN  org.apache.hadoop.hbase.zookeeper.RecoverableZooKeeper
- Node /hbase/root-region-server already deleted, and this is not a retry
2013-08-04 01:13:17,163 [NIOServerCxn.Factory:0.0.0.0/0.0.0.0:21818] WARN  org.apache.zookeeper.server.NIOServerCnxn
- caught end of stream exception
EndOfStreamException: Unable to read additional data from client sessionid 0x14046e27a2c0002,
likely client has closed socket
	at org.apache.zookeeper.server.NIOServerCnxn.doIO(NIOServerCnxn.java:220)
	at org.apache.zookeeper.server.NIOServerCnxnFactory.run(NIOServerCnxnFactory.java:224)
	at java.lang.Thread.run(Thread.java:679)
Tests run: 7, Failures: 0, Errors: 0, Skipped: 0, Time elapsed: 29.536 sec
2013-08-04 01:13:27,082 [SyncThread:0] WARN  org.apache.zookeeper.server.persistence.FileTxnLog
- fsync-ing the write ahead log in SyncThread:0 took 1154ms which will adversely effect operation
latency. See the ZooKeeper troubleshooting guide
2013-08-04 01:13:27,137 [RegionServer:0;juno.apache.org,39289,1375578784681] WARN  org.apache.hadoop.hbase.regionserver.HRegionServer
- Received close for region we are already opening or closing; 70236052

Results :

Tests run: 22, Failures: 0, Errors: 0, Skipped: 0

Sending e-mails to: server-dev@james.apache.org
Sending e-mails to: server-dev@james.apache.org
ERROR: Maven JVM terminated unexpectedly with exit code 143


---------------------------------------------------------------------
To unsubscribe, e-mail: server-dev-unsubscribe@james.apache.org
For additional commands, e-mail: server-dev-help@james.apache.org


Mime
View raw message