james-server-dev mailing list archives

Site index · List index
Message view « Date » · « Thread »
Top « Date » · « Thread »
From Apache Jenkins Server <jenk...@builds.apache.org>
Subject Build failed in Jenkins: hupa-trunk #332
Date Wed, 21 Aug 2013 16:42:45 GMT
See <https://builds.apache.org/job/hupa-trunk/332/changes>

Changes:

[dongxu] merge

------------------------------------------
[...truncated 846 lines...]
A         client/src/main/java/org/apache/hupa/client/ui/TopBarView.java
A         client/src/main/java/org/apache/hupa/client/ui/__ContentPanel.ui.xml
A         client/src/main/java/org/apache/hupa/client/ui/LabelNode.java
A         client/src/main/java/org/apache/hupa/client/ui/LabelPropertiesView.java
A         client/src/main/java/org/apache/hupa/client/ui/ToolBarView.ui.xml
A         client/src/main/java/org/apache/hupa/client/ui/__ContentPanel.java
A         client/src/main/java/org/apache/hupa/client/ui/AppLayoutImpl.ui.xml
A         client/src/main/java/org/apache/hupa/client/ui/ComposeView.ui.xml
A         client/src/main/java/org/apache/hupa/client/ui/HupaLayout.java
A         client/src/main/java/org/apache/hupa/client/ui/_CenterSettingPanel.java
A         client/src/main/java/org/apache/hupa/client/ui/FolderListView.ui.xml
A         client/src/main/java/org/apache/hupa/client/ui/__OutlinePanel.java
A         client/src/main/java/org/apache/hupa/client/ui/ComposeView.java
A         client/src/main/java/org/apache/hupa/client/ui/AppLayoutImpl.java
A         client/src/main/java/org/apache/hupa/client/ui/LabelListView.ui.xml
A         client/src/main/java/org/apache/hupa/client/ui/FolderListView.java
A         client/src/main/java/org/apache/hupa/client/ui/LoginView.java
A         client/src/main/java/org/apache/hupa/client/ui/LabelListView.java
A         client/src/main/java/org/apache/hupa/client/ui/_CenterContactPanel.ui.xml
A         client/src/main/java/org/apache/hupa/client/ui/SearchBoxView.java
A         client/src/main/java/org/apache/hupa/client/ui/WestView.java
A         client/src/main/java/org/apache/hupa/HupaProd.gwt.xml
A         client/src/main/java/org/apache/hupa/Launcher.java
A         client/src/site
A         client/src/site/site.xml
A         client/src/reporting-site
AU        client/src/reporting-site/site.xml
A         client/src/test
A         client/src/test/java
A         client/src/test/java/org
A         client/src/test/java/org/apache
A         client/src/test/java/org/apache/hupa
A         client/src/test/java/org/apache/hupa/client
A         client/src/test/java/org/apache/hupa/client/mvp
A         client/src/test/java/org/apache/hupa/client/mvp/ContactsPresenterTest.java
A         client/src/test/java/org/apache/hupa/client/mvp/MessageSendPresenterTest.java
A         client/src/test/java/org/apache/hupa/client/rf
A         client/src/test/java/org/apache/hupa/client/rf/SubjectTest.java
A         client/src/test/java/org/apache/hupa/client/mock
A         client/src/test/java/org/apache/hupa/client/mock/MockUploader.java
A         client/src/test/java/org/apache/hupa/client/mock/MockWidget.java
A         client/src/test/java/org/apache/hupa/client/mock/MockMessageSendDisplay.java
A         client/src/test/java/org/apache/hupa/client/validation
A         client/src/test/java/org/apache/hupa/client/validation/EmailListValidatorTest.java
A         client/src/test/java/org/apache/hupa/client/HupaGwtTestCase.java
A         client/src/test/java/org/apache/hupa/client/HupaMvpTestCase.java
A         client/src/test/java/org/apache/hupa/client/guice
A         client/src/test/java/org/apache/hupa/client/guice/GuiceClientTestModule.java
A         client/src/test/java/org/apache/hupa/client/guice/GuiceMvpTestModule.java
A         client/pom.xml
A         client/README.txt
 U        .
At revision 1516205
Parsing POMs
Modules changed, recalculating dependency graph
[trunk] $ /home/hudson/tools/java/latest1.6/bin/java -cp /home/jenkins/jenkins-slave/maven3-agent.jar:/home/hudson/tools/maven/apache-maven-3.0.4/boot/plexus-classworlds-2.4.jar
org.jvnet.hudson.maven3.agent.Maven3Main /home/hudson/tools/maven/apache-maven-3.0.4 /home/jenkins/jenkins-slave/slave.jar
/home/jenkins/jenkins-slave/maven3-interceptor.jar /home/jenkins/jenkins-slave/maven3-interceptor-commons.jar
46356
<===[JENKINS REMOTING CAPACITY]===>channel started
   log4j:WARN No appenders could be found for logger (org.apache.commons.beanutils.converters.BooleanConverter).
log4j:WARN Please initialize the log4j system properly.
Executing Maven:  -B -f <https://builds.apache.org/job/hupa-trunk/ws/trunk/pom.xml>
-Dmaven.repo.local=/home/jenkins/jenkins-slave/maven-repositories/1 -U clean package cobertura:cobertura
-Pprod -Pdemo
Aug 21, 2013 4:42:08 PM org.apache.maven.cli.event.ExecutionEventLogger projectDiscoveryStarted
INFO: Scanning for projects...
Aug 21, 2013 4:42:09 PM org.apache.maven.cli.event.ExecutionEventLogger sessionStarted
INFO: ------------------------------------------------------------------------
Aug 21, 2013 4:42:09 PM org.apache.maven.cli.event.ExecutionEventLogger sessionStarted
INFO: Reactor Build Order:
Aug 21, 2013 4:42:09 PM org.apache.maven.cli.event.ExecutionEventLogger sessionStarted
INFO: 
Aug 21, 2013 4:42:09 PM org.apache.maven.cli.event.ExecutionEventLogger sessionStarted
INFO: Apache James Hupa Parent
Aug 21, 2013 4:42:09 PM org.apache.maven.cli.event.ExecutionEventLogger sessionStarted
INFO: Apache James Hupa Shared
Aug 21, 2013 4:42:09 PM org.apache.maven.cli.event.ExecutionEventLogger sessionStarted
INFO: Apache James Hupa Mock
Aug 21, 2013 4:42:09 PM org.apache.maven.cli.event.ExecutionEventLogger sessionStarted
INFO: Apache James Hupa Server
Aug 21, 2013 4:42:09 PM org.apache.maven.cli.event.ExecutionEventLogger sessionStarted
INFO: Apache James Hupa Widgets
Aug 21, 2013 4:42:09 PM org.apache.maven.cli.event.ExecutionEventLogger sessionStarted
INFO: Apache James Hupa
Downloading: http://repo.maven.apache.org/maven2/org/codehaus/mojo/emma-maven-plugin/maven-metadata.xml
Downloaded: http://repo.maven.apache.org/maven2/org/codehaus/mojo/emma-maven-plugin/maven-metadata.xml
(433 B at 3.7 KB/sec)
Downloading: http://repo.maven.apache.org/maven2/org/codehaus/mojo/emma-maven-plugin/1.0-alpha-3/emma-maven-plugin-1.0-alpha-3.pom
Downloaded: http://repo.maven.apache.org/maven2/org/codehaus/mojo/emma-maven-plugin/1.0-alpha-3/emma-maven-plugin-1.0-alpha-3.pom
(8 KB at 378.7 KB/sec)
Downloading: http://repo.maven.apache.org/maven2/org/codehaus/mojo/emma-maven-plugin/1.0-alpha-3/emma-maven-plugin-1.0-alpha-3.jar
Downloaded: http://repo.maven.apache.org/maven2/org/codehaus/mojo/emma-maven-plugin/1.0-alpha-3/emma-maven-plugin-1.0-alpha-3.jar
(37 KB at 2419.3 KB/sec)
Downloading: http://repo.maven.apache.org/maven2/org/bsc/maven/maven-processor-plugin/maven-metadata.xml
Downloaded: http://repo.maven.apache.org/maven2/org/bsc/maven/maven-processor-plugin/maven-metadata.xml
(782 B at 76.4 KB/sec)
Downloading: http://repo.maven.apache.org/maven2/org/bsc/maven/maven-processor-plugin/2.2.4/maven-processor-plugin-2.2.4.pom
Downloaded: http://repo.maven.apache.org/maven2/org/bsc/maven/maven-processor-plugin/2.2.4/maven-processor-plugin-2.2.4.pom
(11 KB at 971.4 KB/sec)
Downloading: http://repo.maven.apache.org/maven2/org/bsc/maven/maven-processor-plugin/2.2.4/maven-processor-plugin-2.2.4.jar
Downloaded: http://repo.maven.apache.org/maven2/org/bsc/maven/maven-processor-plugin/2.2.4/maven-processor-plugin-2.2.4.jar
(32 KB at 2231.9 KB/sec)
Downloading: http://repo.maven.apache.org/maven2/org/apache/maven/plugins/maven-scm-plugin/1.5/maven-scm-plugin-1.5.jar
Downloaded: http://repo.maven.apache.org/maven2/org/apache/maven/plugins/maven-scm-plugin/1.5/maven-scm-plugin-1.5.jar
(57 KB at 1207.3 KB/sec)
Aug 21, 2013 4:42:12 PM org.apache.maven.cli.event.ExecutionEventLogger projectStarted
INFO:                                                                         
Aug 21, 2013 4:42:12 PM org.apache.maven.cli.event.ExecutionEventLogger projectStarted
INFO: ------------------------------------------------------------------------
Aug 21, 2013 4:42:12 PM org.apache.maven.cli.event.ExecutionEventLogger projectStarted
INFO: Building Apache James Hupa Parent 0.0.5-SNAPSHOT
Aug 21, 2013 4:42:12 PM org.apache.maven.cli.event.ExecutionEventLogger projectStarted
INFO: ------------------------------------------------------------------------
Aug 21, 2013 4:42:13 PM org.apache.maven.cli.event.ExecutionEventLogger mojoStarted
INFO: 
Aug 21, 2013 4:42:13 PM org.apache.maven.cli.event.ExecutionEventLogger mojoStarted
INFO: --- maven-clean-plugin:2.4.1:clean (default-clean) @ hupa-parent ---
Aug 21, 2013 4:42:28 PM org.apache.maven.cli.event.ExecutionEventLogger mojoStarted
INFO: 
Aug 21, 2013 4:42:28 PM org.apache.maven.cli.event.ExecutionEventLogger mojoStarted
INFO: --- maven-remote-resources-plugin:1.2.1:process (default) @ hupa-parent ---
Aug 21, 2013 4:42:29 PM org.apache.maven.cli.event.ExecutionEventLogger mojoStarted
INFO: 
Aug 21, 2013 4:42:29 PM org.apache.maven.cli.event.ExecutionEventLogger mojoStarted
INFO: --- maven-site-plugin:3.0:attach-descriptor (attach-descriptor) @ hupa-parent ---
Aug 21, 2013 4:42:30 PM org.apache.maven.cli.event.ExecutionEventLogger mojoStarted
INFO: 
Aug 21, 2013 4:42:30 PM org.apache.maven.cli.event.ExecutionEventLogger mojoStarted
INFO: --- maven-remote-resources-plugin:1.2.1:process (default) @ hupa-parent ---
Aug 21, 2013 4:42:30 PM org.apache.maven.cli.event.ExecutionEventLogger mojoStarted
INFO: 
Aug 21, 2013 4:42:30 PM org.apache.maven.cli.event.ExecutionEventLogger mojoStarted
INFO: --- cobertura-maven-plugin:2.5.1:instrument (default-cli) @ hupa-parent ---
[INFO] Skipping cobertura mojo for project with packaging type 'pom'
Aug 21, 2013 4:42:31 PM org.apache.maven.cli.event.ExecutionEventLogger mojoStarted
INFO: 
Aug 21, 2013 4:42:31 PM org.apache.maven.cli.event.ExecutionEventLogger mojoStarted
INFO: --- cobertura-maven-plugin:2.5.1:cobertura (default-cli) @ hupa-parent ---
Aug 21, 2013 4:42:31 PM org.apache.maven.cli.event.ExecutionEventLogger projectStarted
INFO:                                                                         
Aug 21, 2013 4:42:31 PM org.apache.maven.cli.event.ExecutionEventLogger projectStarted
INFO: ------------------------------------------------------------------------
Aug 21, 2013 4:42:31 PM org.apache.maven.cli.event.ExecutionEventLogger projectStarted
INFO: Building Apache James Hupa Shared 0.0.5-SNAPSHOT
Aug 21, 2013 4:42:31 PM org.apache.maven.cli.event.ExecutionEventLogger projectStarted
INFO: ------------------------------------------------------------------------
Downloading: http://repo.maven.apache.org/maven2/org/codehaus/mojo/gwt-maven-plugin/2.5.1/gwt-maven-plugin-2.5.1.pom
Downloaded: http://repo.maven.apache.org/maven2/org/codehaus/mojo/gwt-maven-plugin/2.5.1/gwt-maven-plugin-2.5.1.pom
(21 KB at 1335.2 KB/sec)
Downloading: http://repo.maven.apache.org/maven2/org/codehaus/mojo/gwt-maven-plugin/2.5.1/gwt-maven-plugin-2.5.1.jar
Downloaded: http://repo.maven.apache.org/maven2/org/codehaus/mojo/gwt-maven-plugin/2.5.1/gwt-maven-plugin-2.5.1.jar
(181 KB at 4867.9 KB/sec)
Downloading: http://repo1.maven.org/maven2/com/google/gwt/gwt-user/2.5.1/gwt-user-2.5.1.pom
Downloaded: http://repo1.maven.org/maven2/com/google/gwt/gwt-user/2.5.1/gwt-user-2.5.1.pom
(2 KB at 61.1 KB/sec)
Downloading: http://repo1.maven.org/maven2/com/google/gwt/gwt/2.5.1/gwt-2.5.1.pom
Downloaded: http://repo1.maven.org/maven2/com/google/gwt/gwt/2.5.1/gwt-2.5.1.pom (825 B at
50.4 KB/sec)
Downloading: http://repo1.maven.org/maven2/com/google/gwt/gwt-user/2.5.1/gwt-user-2.5.1.jar
Downloaded: http://repo1.maven.org/maven2/com/google/gwt/gwt-user/2.5.1/gwt-user-2.5.1.jar
(28081 KB at 39054.6 KB/sec)
Aug 21, 2013 4:42:32 PM org.apache.maven.cli.event.ExecutionEventLogger mojoStarted
INFO: 
Aug 21, 2013 4:42:32 PM org.apache.maven.cli.event.ExecutionEventLogger mojoStarted
INFO: --- maven-clean-plugin:2.4.1:clean (default-clean) @ hupa-shared ---
Aug 21, 2013 4:42:32 PM org.apache.maven.cli.event.ExecutionEventLogger mojoStarted
INFO: 
Aug 21, 2013 4:42:32 PM org.apache.maven.cli.event.ExecutionEventLogger mojoStarted
INFO: --- maven-remote-resources-plugin:1.2.1:process (default) @ hupa-shared ---
Aug 21, 2013 4:42:32 PM org.apache.maven.cli.event.ExecutionEventLogger mojoStarted
INFO: 
Aug 21, 2013 4:42:32 PM org.apache.maven.cli.event.ExecutionEventLogger mojoStarted
INFO: --- maven-resources-plugin:2.5:resources (default-resources) @ hupa-shared ---
[debug] execute contextualize
[INFO] Using 'UTF-8' encoding to copy filtered resources.
[INFO] skip non existing resourceDirectory <https://builds.apache.org/job/hupa-trunk/ws/trunk/shared/src/main/resources>
[INFO] Copying 3 resources
Aug 21, 2013 4:42:33 PM org.apache.maven.cli.event.ExecutionEventLogger mojoStarted
INFO: 
Aug 21, 2013 4:42:33 PM org.apache.maven.cli.event.ExecutionEventLogger mojoStarted
INFO: --- gwt-maven-plugin:2.5.1:resources (default) @ hupa-shared ---
Downloading: http://repo.maven.apache.org/maven2/com/google/gwt/gwt-dev/2.5.1/gwt-dev-2.5.1.pom
Downloaded: http://repo.maven.apache.org/maven2/com/google/gwt/gwt-dev/2.5.1/gwt-dev-2.5.1.pom
(778 B at 84.4 KB/sec)
Downloading: http://repo.maven.apache.org/maven2/com/google/gwt/gwt-codeserver/2.5.1/gwt-codeserver-2.5.1.pom
Downloaded: http://repo.maven.apache.org/maven2/com/google/gwt/gwt-codeserver/2.5.1/gwt-codeserver-2.5.1.pom
(775 B at 94.6 KB/sec)
Downloading: http://repo.maven.apache.org/maven2/com/google/gwt/gwt-dev/2.5.1/gwt-dev-2.5.1.jar
Downloading: http://repo.maven.apache.org/maven2/com/google/gwt/gwt-codeserver/2.5.1/gwt-codeserver-2.5.1.jar
Downloading: http://repo.maven.apache.org/maven2/com/google/gwt/gwt-user/2.5.1/gwt-user-2.5.1.jar
Downloaded: http://repo.maven.apache.org/maven2/com/google/gwt/gwt-user/2.5.1/gwt-user-2.5.1.jar
(0 B at 0.0 KB/sec)
Downloaded: http://repo.maven.apache.org/maven2/com/google/gwt/gwt-codeserver/2.5.1/gwt-codeserver-2.5.1.jar
(83 KB at 4828.1 KB/sec)
Downloaded: http://repo.maven.apache.org/maven2/com/google/gwt/gwt-dev/2.5.1/gwt-dev-2.5.1.jar
(33063 KB at 22976.2 KB/sec)
[INFO] auto discovered modules [org.apache.hupa.Shared]
[INFO] 163 source files from GWT module org.apache.hupa.Shared
Aug 21, 2013 4:42:36 PM org.apache.maven.cli.event.ExecutionEventLogger mojoStarted
INFO: 
Aug 21, 2013 4:42:36 PM org.apache.maven.cli.event.ExecutionEventLogger mojoStarted
INFO: --- maven-compiler-plugin:2.3.2:compile (default-compile) @ hupa-shared ---
[INFO] Compiling 162 source files to <https://builds.apache.org/job/hupa-trunk/ws/trunk/shared/target/classes>
[INFO] -------------------------------------------------------------
[ERROR] COMPILATION ERROR : 
[INFO] -------------------------------------------------------------
[ERROR] <https://builds.apache.org/job/hupa-trunk/ws/trunk/shared/src/main/java/org/apache/hupa/shared/events/MoveMessageEvent.java>:[44,0]
illegal start of type
[ERROR] <https://builds.apache.org/job/hupa-trunk/ws/trunk/shared/src/main/java/org/apache/hupa/shared/events/MoveMessageEvent.java>:[44,2]
';' expected
[ERROR] <https://builds.apache.org/job/hupa-trunk/ws/trunk/shared/src/main/java/org/apache/hupa/shared/events/MoveMessageEvent.java>:[44,4]
illegal start of type
[ERROR] <https://builds.apache.org/job/hupa-trunk/ws/trunk/shared/src/main/java/org/apache/hupa/shared/events/MoveMessageEvent.java>:[44,6]
<identifier> expected
[ERROR] <https://builds.apache.org/job/hupa-trunk/ws/trunk/shared/src/main/java/org/apache/hupa/shared/events/MoveMessageEvent.java>:[44,7]
';' expected
[ERROR] <https://builds.apache.org/job/hupa-trunk/ws/trunk/shared/src/main/java/org/apache/hupa/shared/events/MoveMessageEvent.java>:[46,0]
illegal start of expression
[ERROR] <https://builds.apache.org/job/hupa-trunk/ws/trunk/shared/src/main/java/org/apache/hupa/shared/events/MoveMessageEvent.java>:[46,2]
illegal start of expression
[ERROR] <https://builds.apache.org/job/hupa-trunk/ws/trunk/shared/src/main/java/org/apache/hupa/shared/events/MoveMessageEvent.java>:[46,4]
illegal start of expression
[ERROR] <https://builds.apache.org/job/hupa-trunk/ws/trunk/shared/src/main/java/org/apache/hupa/shared/events/MoveMessageEvent.java>:[46,6]
illegal start of expression
[ERROR] <https://builds.apache.org/job/hupa-trunk/ws/trunk/shared/src/main/java/org/apache/hupa/shared/events/MoveMessageEvent.java>:[47,4]
illegal start of expression
[ERROR] <https://builds.apache.org/job/hupa-trunk/ws/trunk/shared/src/main/java/org/apache/hupa/shared/events/MoveMessageEvent.java>:[47,38]
')' expected
[ERROR] <https://builds.apache.org/job/hupa-trunk/ws/trunk/shared/src/main/java/org/apache/hupa/shared/events/MoveMessageEvent.java>:[47,48]
illegal start of expression
[ERROR] <https://builds.apache.org/job/hupa-trunk/ws/trunk/shared/src/main/java/org/apache/hupa/shared/events/MoveMessageEvent.java>:[47,49]
';' expected
[ERROR] <https://builds.apache.org/job/hupa-trunk/ws/trunk/shared/src/main/java/org/apache/hupa/shared/events/MoveMessageEvent.java>:[52,0]
illegal start of expression
[ERROR] <https://builds.apache.org/job/hupa-trunk/ws/trunk/shared/src/main/java/org/apache/hupa/shared/events/MoveMessageEvent.java>:[52,3]
illegal start of expression
[ERROR] <https://builds.apache.org/job/hupa-trunk/ws/trunk/shared/src/main/java/org/apache/hupa/shared/events/MoveMessageEvent.java>:[52,6]
illegal start of expression
[ERROR] <https://builds.apache.org/job/hupa-trunk/ws/trunk/shared/src/main/java/org/apache/hupa/shared/events/MoveMessageEvent.java>:[52,13]
';' expected
[ERROR] <https://builds.apache.org/job/hupa-trunk/ws/trunk/shared/src/main/java/org/apache/hupa/shared/events/MoveMessageEvent.java>:[52,14]
not a statement
[ERROR] <https://builds.apache.org/job/hupa-trunk/ws/trunk/shared/src/main/java/org/apache/hupa/shared/events/MoveMessageEvent.java>:[52,48]
';' expected
[INFO] 19 errors 
[INFO] -------------------------------------------------------------
Aug 21, 2013 4:42:37 PM org.apache.maven.cli.event.ExecutionEventLogger logReactorSummary
INFO: ------------------------------------------------------------------------
Aug 21, 2013 4:42:37 PM org.apache.maven.cli.event.ExecutionEventLogger logReactorSummary
INFO: Reactor Summary:
Aug 21, 2013 4:42:37 PM org.apache.maven.cli.event.ExecutionEventLogger logReactorSummary
INFO: 
Aug 21, 2013 4:42:37 PM org.apache.maven.cli.event.ExecutionEventLogger logReactorSummary
INFO: Apache James Hupa Parent .......................... SUCCESS [18.833s]
Aug 21, 2013 4:42:37 PM org.apache.maven.cli.event.ExecutionEventLogger logReactorSummary
INFO: Apache James Hupa Shared .......................... FAILURE [5.913s]
Aug 21, 2013 4:42:37 PM org.apache.maven.cli.event.ExecutionEventLogger logReactorSummary
INFO: Apache James Hupa Mock ............................ SKIPPED
Aug 21, 2013 4:42:37 PM org.apache.maven.cli.event.ExecutionEventLogger logReactorSummary
INFO: Apache James Hupa Server .......................... SKIPPED
Aug 21, 2013 4:42:37 PM org.apache.maven.cli.event.ExecutionEventLogger logReactorSummary
INFO: Apache James Hupa Widgets ......................... SKIPPED
Aug 21, 2013 4:42:37 PM org.apache.maven.cli.event.ExecutionEventLogger logReactorSummary
INFO: Apache James Hupa ................................. SKIPPED
Aug 21, 2013 4:42:37 PM org.apache.maven.cli.event.ExecutionEventLogger logResult
INFO: ------------------------------------------------------------------------
Aug 21, 2013 4:42:37 PM org.apache.maven.cli.event.ExecutionEventLogger logResult
INFO: BUILD FAILURE
Aug 21, 2013 4:42:37 PM org.apache.maven.cli.event.ExecutionEventLogger logStats
INFO: ------------------------------------------------------------------------
Aug 21, 2013 4:42:37 PM org.apache.maven.cli.event.ExecutionEventLogger logStats
INFO: Total time: 29.076s
Aug 21, 2013 4:42:37 PM org.apache.maven.cli.event.ExecutionEventLogger logStats
INFO: Finished at: Wed Aug 21 16:42:37 UTC 2013
Aug 21, 2013 4:42:37 PM org.apache.maven.cli.event.ExecutionEventLogger logStats
INFO: Final Memory: 23M/75M
Aug 21, 2013 4:42:37 PM org.apache.maven.cli.event.ExecutionEventLogger sessionEnded
INFO: ------------------------------------------------------------------------
[JENKINS] Archiving <https://builds.apache.org/job/hupa-trunk/ws/trunk/shared/pom.xml>
to /home/hudson/hudson/jobs/hupa-trunk/modules/org.apache.james.hupa$hupa-shared/builds/2013-08-21_16-41-57/archive/org.apache.james.hupa/hupa-shared/0.0.5-SNAPSHOT/hupa-shared-0.0.5-SNAPSHOT.pom
[JENKINS] Archiving <https://builds.apache.org/job/hupa-trunk/ws/trunk/pom.xml> to /home/hudson/hudson/jobs/hupa-trunk/modules/org.apache.james.hupa$hupa-parent/builds/2013-08-21_16-41-57/archive/org.apache.james.hupa/hupa-parent/0.0.5-SNAPSHOT/hupa-parent-0.0.5-SNAPSHOT.pom
[JENKINS] Archiving <https://builds.apache.org/job/hupa-trunk/ws/trunk/target/hupa-parent-0.0.5-SNAPSHOT-site.xml>
to /home/hudson/hudson/jobs/hupa-trunk/modules/org.apache.james.hupa$hupa-parent/builds/2013-08-21_16-41-57/archive/org.apache.james.hupa/hupa-parent/0.0.5-SNAPSHOT/hupa-parent-0.0.5-SNAPSHOT-site.xml
[JENKINS] Archiving <https://builds.apache.org/job/hupa-trunk/ws/trunk/client/pom.xml>
to /home/hudson/hudson/jobs/hupa-trunk/modules/org.apache.james.hupa$hupa/builds/2013-08-21_16-41-58/archive/org.apache.james.hupa/hupa/0.0.5-SNAPSHOT/hupa-0.0.5-SNAPSHOT.pom
[JENKINS] Archiving <https://builds.apache.org/job/hupa-trunk/ws/trunk/mock/pom.xml>
to /home/hudson/hudson/jobs/hupa-trunk/modules/org.apache.james.hupa$hupa-mock/builds/2013-08-21_16-41-57/archive/org.apache.james.hupa/hupa-mock/0.0.5-SNAPSHOT/hupa-mock-0.0.5-SNAPSHOT.pom
[JENKINS] Archiving <https://builds.apache.org/job/hupa-trunk/ws/trunk/widgets/pom.xml>
to /home/hudson/hudson/jobs/hupa-trunk/modules/org.apache.james.hupa$hupa-widgets/builds/2013-08-21_16-41-57/archive/org.apache.james.hupa/hupa-widgets/0.0.5-SNAPSHOT/hupa-widgets-0.0.5-SNAPSHOT.pom
[JENKINS] Archiving <https://builds.apache.org/job/hupa-trunk/ws/trunk/server/pom.xml>
to /home/hudson/hudson/jobs/hupa-trunk/modules/org.apache.james.hupa$hupa-server/builds/2013-08-21_16-41-57/archive/org.apache.james.hupa/hupa-server/0.0.5-SNAPSHOT/hupa-server-0.0.5-SNAPSHOT.pom
Waiting for Jenkins to finish collecting data
Sending e-mails to: server-dev@james.apache.org
channel stopped
Skipping Cobertura coverage report as build was not UNSTABLE or better ...

---------------------------------------------------------------------
To unsubscribe, e-mail: server-dev-unsubscribe@james.apache.org
For additional commands, e-mail: server-dev-help@james.apache.org


Mime
View raw message