james-server-dev mailing list archives

Site index · List index
Message view « Date » · « Thread »
Top « Date » · « Thread »
From Apache Jenkins Server <jenk...@builds.apache.org>
Subject Build failed in Jenkins: hupa-trunk #333
Date Thu, 22 Aug 2013 15:32:16 GMT
See <https://builds.apache.org/job/hupa-trunk/333/changes>

Changes:

[dongxu] first correct commit

------------------------------------------
[...truncated 963 lines...]
Aug 22, 2013 3:31:54 PM org.apache.maven.cli.event.ExecutionEventLogger mojoStarted
INFO: 
Aug 22, 2013 3:31:54 PM org.apache.maven.cli.event.ExecutionEventLogger mojoStarted
INFO: --- maven-remote-resources-plugin:1.2.1:process (default) @ hupa-parent ---
Aug 22, 2013 3:31:54 PM org.apache.maven.cli.event.ExecutionEventLogger mojoStarted
INFO: 
Aug 22, 2013 3:31:54 PM org.apache.maven.cli.event.ExecutionEventLogger mojoStarted
INFO: --- maven-site-plugin:3.0:attach-descriptor (attach-descriptor) @ hupa-parent ---
Aug 22, 2013 3:31:55 PM org.apache.maven.cli.event.ExecutionEventLogger mojoStarted
INFO: 
Aug 22, 2013 3:31:55 PM org.apache.maven.cli.event.ExecutionEventLogger mojoStarted
INFO: --- maven-remote-resources-plugin:1.2.1:process (default) @ hupa-parent ---
Aug 22, 2013 3:31:55 PM org.apache.maven.cli.event.ExecutionEventLogger mojoStarted
INFO: 
Aug 22, 2013 3:31:55 PM org.apache.maven.cli.event.ExecutionEventLogger mojoStarted
INFO: --- cobertura-maven-plugin:2.5.1:instrument (default-cli) @ hupa-parent ---
[INFO] Skipping cobertura mojo for project with packaging type 'pom'
Aug 22, 2013 3:31:55 PM org.apache.maven.cli.event.ExecutionEventLogger mojoStarted
INFO: 
Aug 22, 2013 3:31:55 PM org.apache.maven.cli.event.ExecutionEventLogger mojoStarted
INFO: --- cobertura-maven-plugin:2.5.1:cobertura (default-cli) @ hupa-parent ---
Aug 22, 2013 3:31:56 PM org.apache.maven.cli.event.ExecutionEventLogger projectStarted
INFO:                                                                         
Aug 22, 2013 3:31:56 PM org.apache.maven.cli.event.ExecutionEventLogger projectStarted
INFO: ------------------------------------------------------------------------
Aug 22, 2013 3:31:56 PM org.apache.maven.cli.event.ExecutionEventLogger projectStarted
INFO: Building Apache James Hupa Shared 0.0.3-SNAPSHOT
Aug 22, 2013 3:31:56 PM org.apache.maven.cli.event.ExecutionEventLogger projectStarted
INFO: ------------------------------------------------------------------------
Downloading: http://repo.maven.apache.org/maven2/org/codehaus/mojo/gwt-maven-plugin/2.5.1/gwt-maven-plugin-2.5.1.pom
Downloaded: http://repo.maven.apache.org/maven2/org/codehaus/mojo/gwt-maven-plugin/2.5.1/gwt-maven-plugin-2.5.1.pom
(21 KB at 147.3 KB/sec)
Downloading: http://repo.maven.apache.org/maven2/org/codehaus/mojo/gwt-maven-plugin/2.5.1/gwt-maven-plugin-2.5.1.jar
Downloaded: http://repo.maven.apache.org/maven2/org/codehaus/mojo/gwt-maven-plugin/2.5.1/gwt-maven-plugin-2.5.1.jar
(181 KB at 608.5 KB/sec)
Downloading: http://repo1.maven.org/maven2/com/google/gwt/gwt-user/2.5.1/gwt-user-2.5.1.pom
Downloaded: http://repo1.maven.org/maven2/com/google/gwt/gwt-user/2.5.1/gwt-user-2.5.1.pom
(2 KB at 14.5 KB/sec)
Downloading: http://repo1.maven.org/maven2/com/google/gwt/gwt/2.5.1/gwt-2.5.1.pom
Downloaded: http://repo1.maven.org/maven2/com/google/gwt/gwt/2.5.1/gwt-2.5.1.pom (825 B at
14.6 KB/sec)
Downloading: http://repo1.maven.org/maven2/com/google/gwt/gwt-user/2.5.1/gwt-user-2.5.1.jar
Downloaded: http://repo1.maven.org/maven2/com/google/gwt/gwt-user/2.5.1/gwt-user-2.5.1.jar
(28081 KB at 6248.4 KB/sec)
Aug 22, 2013 3:32:01 PM org.apache.maven.cli.event.ExecutionEventLogger mojoStarted
INFO: 
Aug 22, 2013 3:32:01 PM org.apache.maven.cli.event.ExecutionEventLogger mojoStarted
INFO: --- maven-clean-plugin:2.4.1:clean (default-clean) @ hupa-shared ---
Aug 22, 2013 3:32:01 PM org.apache.maven.cli.event.ExecutionEventLogger mojoStarted
INFO: 
Aug 22, 2013 3:32:01 PM org.apache.maven.cli.event.ExecutionEventLogger mojoStarted
INFO: --- maven-remote-resources-plugin:1.2.1:process (default) @ hupa-shared ---
Aug 22, 2013 3:32:01 PM org.apache.maven.cli.event.ExecutionEventLogger mojoStarted
INFO: 
Aug 22, 2013 3:32:01 PM org.apache.maven.cli.event.ExecutionEventLogger mojoStarted
INFO: --- maven-resources-plugin:2.5:resources (default-resources) @ hupa-shared ---
[debug] execute contextualize
[INFO] Using 'UTF-8' encoding to copy filtered resources.
[INFO] skip non existing resourceDirectory <https://builds.apache.org/job/hupa-trunk/ws/trunk/shared/src/main/resources>
[INFO] Copying 3 resources
Aug 22, 2013 3:32:01 PM org.apache.maven.cli.event.ExecutionEventLogger mojoStarted
INFO: 
Aug 22, 2013 3:32:01 PM org.apache.maven.cli.event.ExecutionEventLogger mojoStarted
INFO: --- gwt-maven-plugin:2.5.1:resources (default) @ hupa-shared ---
Downloading: http://repo.maven.apache.org/maven2/com/google/gwt/gwt-dev/2.5.1/gwt-dev-2.5.1.pom
Downloaded: http://repo.maven.apache.org/maven2/com/google/gwt/gwt-dev/2.5.1/gwt-dev-2.5.1.pom
(778 B at 8.5 KB/sec)
Downloading: http://repo.maven.apache.org/maven2/com/google/gwt/gwt-codeserver/2.5.1/gwt-codeserver-2.5.1.pom
Downloaded: http://repo.maven.apache.org/maven2/com/google/gwt/gwt-codeserver/2.5.1/gwt-codeserver-2.5.1.pom
(775 B at 8.7 KB/sec)
Downloading: http://repo.maven.apache.org/maven2/com/google/gwt/gwt-dev/2.5.1/gwt-dev-2.5.1.jar
Downloading: http://repo.maven.apache.org/maven2/com/google/gwt/gwt-codeserver/2.5.1/gwt-codeserver-2.5.1.jar
Downloading: http://repo.maven.apache.org/maven2/com/google/gwt/gwt-user/2.5.1/gwt-user-2.5.1.jar
Downloaded: http://repo.maven.apache.org/maven2/com/google/gwt/gwt-user/2.5.1/gwt-user-2.5.1.jar
(0 B at 0.0 KB/sec)
Downloaded: http://repo.maven.apache.org/maven2/com/google/gwt/gwt-codeserver/2.5.1/gwt-codeserver-2.5.1.jar
(83 KB at 279.2 KB/sec)
Downloaded: http://repo.maven.apache.org/maven2/com/google/gwt/gwt-dev/2.5.1/gwt-dev-2.5.1.jar
(33063 KB at 5225.6 KB/sec)
[INFO] auto discovered modules [org.apache.hupa.Shared]
[INFO] 163 source files from GWT module org.apache.hupa.Shared
Aug 22, 2013 3:32:09 PM org.apache.maven.cli.event.ExecutionEventLogger mojoStarted
INFO: 
Aug 22, 2013 3:32:09 PM org.apache.maven.cli.event.ExecutionEventLogger mojoStarted
INFO: --- maven-compiler-plugin:2.3.2:compile (default-compile) @ hupa-shared ---
[INFO] Compiling 162 source files to <https://builds.apache.org/job/hupa-trunk/ws/trunk/shared/target/classes>
[INFO] -------------------------------------------------------------
[ERROR] COMPILATION ERROR : 
[INFO] -------------------------------------------------------------
[ERROR] <https://builds.apache.org/job/hupa-trunk/ws/trunk/shared/src/main/java/org/apache/hupa/shared/rpc/DeleteFolder.java>:[24,41]
package net.customware.gwt.dispatch.shared does not exist
[ERROR] <https://builds.apache.org/job/hupa-trunk/ws/trunk/shared/src/main/java/org/apache/hupa/shared/rpc/DeleteFolder.java>:[28,37]
cannot find symbol
symbol: class Action
public class DeleteFolder implements Action<GenericResult> , Serializable{
[ERROR] <https://builds.apache.org/job/hupa-trunk/ws/trunk/shared/src/main/java/org/apache/hupa/shared/rpc/GenericResult.java>:[24,41]
package net.customware.gwt.dispatch.shared does not exist
[ERROR] <https://builds.apache.org/job/hupa-trunk/ws/trunk/shared/src/main/java/org/apache/hupa/shared/rpc/GenericResult.java>:[26,38]
cannot find symbol
symbol: class Result
public class GenericResult implements Result, Serializable {
[ERROR] <https://builds.apache.org/job/hupa-trunk/ws/trunk/shared/src/main/java/org/apache/hupa/shared/rpc/DeleteFolder.java>:[28,43]
interface expected here
[ERROR] <https://builds.apache.org/job/hupa-trunk/ws/trunk/shared/src/main/java/org/apache/hupa/shared/rpc/TagMessage.java>:[26,41]
package net.customware.gwt.dispatch.shared does not exist
[ERROR] <https://builds.apache.org/job/hupa-trunk/ws/trunk/shared/src/main/java/org/apache/hupa/shared/rpc/TagMessage.java>:[31,35]
cannot find symbol
symbol: class Action
public class TagMessage implements Action<GenericResult>, Serializable {
[ERROR] <https://builds.apache.org/job/hupa-trunk/ws/trunk/shared/src/main/java/org/apache/hupa/shared/rpc/TagMessage.java>:[31,41]
interface expected here
[ERROR] <https://builds.apache.org/job/hupa-trunk/ws/trunk/shared/src/main/java/org/apache/hupa/shared/rpc/SendMessage.java>:[25,41]
package net.customware.gwt.dispatch.shared does not exist
[ERROR] <https://builds.apache.org/job/hupa-trunk/ws/trunk/shared/src/main/java/org/apache/hupa/shared/rpc/SendMessage.java>:[29,36]
cannot find symbol
symbol: class Action
public class SendMessage implements Action<GenericResult>, Serializable {
[ERROR] <https://builds.apache.org/job/hupa-trunk/ws/trunk/shared/src/main/java/org/apache/hupa/shared/rpc/SendMessage.java>:[29,42]
interface expected here
[ERROR] <https://builds.apache.org/job/hupa-trunk/ws/trunk/shared/src/main/java/org/apache/hupa/shared/rpc/LogoutUser.java>:[24,41]
package net.customware.gwt.dispatch.shared does not exist
[ERROR] <https://builds.apache.org/job/hupa-trunk/ws/trunk/shared/src/main/java/org/apache/hupa/shared/rpc/LogoutUser.java>:[27,35]
cannot find symbol
symbol: class Action
public class LogoutUser implements Action<LogoutUserResult>, Serializable {
[ERROR] <https://builds.apache.org/job/hupa-trunk/ws/trunk/shared/src/main/java/org/apache/hupa/shared/rpc/LogoutUserResult.java>:[24,41]
package net.customware.gwt.dispatch.shared does not exist
[ERROR] <https://builds.apache.org/job/hupa-trunk/ws/trunk/shared/src/main/java/org/apache/hupa/shared/rpc/LogoutUserResult.java>:[28,41]
cannot find symbol
symbol: class Result
public class LogoutUserResult implements Result, Serializable {
[ERROR] <https://builds.apache.org/job/hupa-trunk/ws/trunk/shared/src/main/java/org/apache/hupa/shared/rpc/LogoutUser.java>:[27,41]
interface expected here
[ERROR] <https://builds.apache.org/job/hupa-trunk/ws/trunk/shared/src/main/java/org/apache/hupa/shared/rpc/IdleResult.java>:[24,41]
package net.customware.gwt.dispatch.shared does not exist
[ERROR] <https://builds.apache.org/job/hupa-trunk/ws/trunk/shared/src/main/java/org/apache/hupa/shared/rpc/IdleResult.java>:[26,35]
cannot find symbol
symbol: class Result
public class IdleResult implements Result, Serializable {
[ERROR] <https://builds.apache.org/job/hupa-trunk/ws/trunk/shared/src/main/java/org/apache/hupa/shared/rpc/RenameFolder.java>:[24,41]
package net.customware.gwt.dispatch.shared does not exist
[ERROR] <https://builds.apache.org/job/hupa-trunk/ws/trunk/shared/src/main/java/org/apache/hupa/shared/rpc/RenameFolder.java>:[28,37]
cannot find symbol
symbol: class Action
public class RenameFolder implements Action<GenericResult>, Serializable {
[ERROR] <https://builds.apache.org/job/hupa-trunk/ws/trunk/shared/src/main/java/org/apache/hupa/shared/rpc/RenameFolder.java>:[28,43]
interface expected here
[ERROR] <https://builds.apache.org/job/hupa-trunk/ws/trunk/shared/src/main/java/org/apache/hupa/shared/rpc/DeleteMessage.java>:[24,41]
package net.customware.gwt.dispatch.shared does not exist
[ERROR] <https://builds.apache.org/job/hupa-trunk/ws/trunk/shared/src/main/java/org/apache/hupa/shared/rpc/DeleteMessage.java>:[28,38]
cannot find symbol
symbol: class Action
public class DeleteMessage implements Action<DeleteMessageResult>, Serializable {
[ERROR] <https://builds.apache.org/job/hupa-trunk/ws/trunk/shared/src/main/java/org/apache/hupa/shared/rpc/DeleteMessageResult.java>:[24,41]
package net.customware.gwt.dispatch.shared does not exist
[ERROR] <https://builds.apache.org/job/hupa-trunk/ws/trunk/shared/src/main/java/org/apache/hupa/shared/rpc/DeleteMessageResult.java>:[29,44]
cannot find symbol
symbol: class Result
public class DeleteMessageResult implements Result, Serializable {
[ERROR] <https://builds.apache.org/job/hupa-trunk/ws/trunk/shared/src/main/java/org/apache/hupa/shared/rpc/DeleteMessage.java>:[28,44]
interface expected here
[ERROR] <https://builds.apache.org/job/hupa-trunk/ws/trunk/shared/src/main/java/org/apache/hupa/shared/rpc/FetchMessagesResult.java>:[45,41]
package net.customware.gwt.dispatch.shared does not exist
[ERROR] <https://builds.apache.org/job/hupa-trunk/ws/trunk/shared/src/main/java/org/apache/hupa/shared/rpc/FetchMessagesResult.java>:[47,44]
cannot find symbol
symbol: class Result
public class FetchMessagesResult implements Result, Serializable {
[ERROR] <https://builds.apache.org/job/hupa-trunk/ws/trunk/shared/src/main/java/org/apache/hupa/shared/rpc/GetMessageDetailsResult.java>:[26,41]
package net.customware.gwt.dispatch.shared does not exist
[ERROR] <https://builds.apache.org/job/hupa-trunk/ws/trunk/shared/src/main/java/org/apache/hupa/shared/rpc/GetMessageDetailsResult.java>:[28,48]
cannot find symbol
symbol: class Result
public class GetMessageDetailsResult implements Result, Serializable {
[ERROR] <https://builds.apache.org/job/hupa-trunk/ws/trunk/shared/src/main/java/org/apache/hupa/shared/rpc/CheckSessionResult.java>:[26,41]
package net.customware.gwt.dispatch.shared does not exist
[ERROR] <https://builds.apache.org/job/hupa-trunk/ws/trunk/shared/src/main/java/org/apache/hupa/shared/rpc/CheckSessionResult.java>:[28,43]
cannot find symbol
symbol: class Result
public class CheckSessionResult implements Result, Serializable {
[ERROR] <https://builds.apache.org/job/hupa-trunk/ws/trunk/shared/src/main/java/org/apache/hupa/shared/rpc/CreateFolder.java>:[24,41]
package net.customware.gwt.dispatch.shared does not exist
[ERROR] <https://builds.apache.org/job/hupa-trunk/ws/trunk/shared/src/main/java/org/apache/hupa/shared/rpc/CreateFolder.java>:[28,37]
cannot find symbol
symbol: class Action
public class CreateFolder implements Action<GenericResult>, Serializable{
[ERROR] <https://builds.apache.org/job/hupa-trunk/ws/trunk/shared/src/main/java/org/apache/hupa/shared/rpc/CreateFolder.java>:[28,43]
interface expected here
[ERROR] <https://builds.apache.org/job/hupa-trunk/ws/trunk/shared/src/main/java/org/apache/hupa/shared/rpc/Idle.java>:[24,41]
package net.customware.gwt.dispatch.shared does not exist
[ERROR] <https://builds.apache.org/job/hupa-trunk/ws/trunk/shared/src/main/java/org/apache/hupa/shared/rpc/Idle.java>:[27,29]
cannot find symbol
symbol: class Action
public class Idle implements Action<IdleResult>, Serializable {
[ERROR] <https://builds.apache.org/job/hupa-trunk/ws/trunk/shared/src/main/java/org/apache/hupa/shared/rpc/Idle.java>:[27,35]
interface expected here
[ERROR] <https://builds.apache.org/job/hupa-trunk/ws/trunk/shared/src/main/java/org/apache/hupa/shared/rpc/FetchMessages.java>:[24,41]
package net.customware.gwt.dispatch.shared does not exist
[ERROR] <https://builds.apache.org/job/hupa-trunk/ws/trunk/shared/src/main/java/org/apache/hupa/shared/rpc/FetchMessages.java>:[28,38]
cannot find symbol
symbol: class Action
public class FetchMessages implements Action<FetchMessagesResult>, Serializable {
[ERROR] <https://builds.apache.org/job/hupa-trunk/ws/trunk/shared/src/main/java/org/apache/hupa/shared/rpc/FetchMessages.java>:[28,44]
interface expected here
[ERROR] <https://builds.apache.org/job/hupa-trunk/ws/trunk/shared/src/main/java/org/apache/hupa/shared/rpc/LoginUser.java>:[26,41]
package net.customware.gwt.dispatch.shared does not exist
[ERROR] <https://builds.apache.org/job/hupa-trunk/ws/trunk/shared/src/main/java/org/apache/hupa/shared/rpc/LoginUser.java>:[28,34]
cannot find symbol
symbol: class Action
public class LoginUser implements Action<LoginUserResult>, Serializable {
[ERROR] <https://builds.apache.org/job/hupa-trunk/ws/trunk/shared/src/main/java/org/apache/hupa/shared/rpc/LoginUserResult.java>:[24,41]
package net.customware.gwt.dispatch.shared does not exist
[ERROR] <https://builds.apache.org/job/hupa-trunk/ws/trunk/shared/src/main/java/org/apache/hupa/shared/rpc/LoginUserResult.java>:[28,40]
cannot find symbol
symbol: class Result
public class LoginUserResult implements Result, Serializable {
[ERROR] <https://builds.apache.org/job/hupa-trunk/ws/trunk/shared/src/main/java/org/apache/hupa/shared/rpc/LoginUser.java>:[28,40]
interface expected here
[ERROR] <https://builds.apache.org/job/hupa-trunk/ws/trunk/shared/src/main/java/org/apache/hupa/shared/rpc/CheckSession.java>:[24,41]
package net.customware.gwt.dispatch.shared does not exist
[ERROR] <https://builds.apache.org/job/hupa-trunk/ws/trunk/shared/src/main/java/org/apache/hupa/shared/rpc/CheckSession.java>:[27,37]
cannot find symbol
symbol: class Action
public class CheckSession implements Action<CheckSessionResult>, Serializable {
[ERROR] <https://builds.apache.org/job/hupa-trunk/ws/trunk/shared/src/main/java/org/apache/hupa/shared/rpc/CheckSession.java>:[27,43]
interface expected here
[ERROR] <https://builds.apache.org/job/hupa-trunk/ws/trunk/shared/src/main/java/org/apache/hupa/shared/rpc/FetchFolders.java>:[24,41]
package net.customware.gwt.dispatch.shared does not exist
[ERROR] <https://builds.apache.org/job/hupa-trunk/ws/trunk/shared/src/main/java/org/apache/hupa/shared/rpc/FetchFolders.java>:[27,37]
cannot find symbol
symbol: class Action
public class FetchFolders implements Action<FetchFoldersResult>, Serializable {
[ERROR] <https://builds.apache.org/job/hupa-trunk/ws/trunk/shared/src/main/java/org/apache/hupa/shared/rpc/FetchFoldersResult.java>:[28,41]
package net.customware.gwt.dispatch.shared does not exist
[ERROR] <https://builds.apache.org/job/hupa-trunk/ws/trunk/shared/src/main/java/org/apache/hupa/shared/rpc/FetchFoldersResult.java>:[30,43]
cannot find symbol
symbol: class Result
public class FetchFoldersResult implements Result, Serializable {
[ERROR] <https://builds.apache.org/job/hupa-trunk/ws/trunk/shared/src/main/java/org/apache/hupa/shared/rpc/FetchFolders.java>:[27,43]
interface expected here
[ERROR] <https://builds.apache.org/job/hupa-trunk/ws/trunk/shared/src/main/java/org/apache/hupa/shared/rpc/RawMessageResult.java>:[24,41]
package net.customware.gwt.dispatch.shared does not exist
[ERROR] <https://builds.apache.org/job/hupa-trunk/ws/trunk/shared/src/main/java/org/apache/hupa/shared/rpc/RawMessageResult.java>:[26,41]
cannot find symbol
symbol: class Result
public class RawMessageResult implements Result, Serializable {
[ERROR] <https://builds.apache.org/job/hupa-trunk/ws/trunk/shared/src/main/java/org/apache/hupa/shared/rpc/RawMessage.java>:[25,41]
package net.customware.gwt.dispatch.shared does not exist
[ERROR] <https://builds.apache.org/job/hupa-trunk/ws/trunk/shared/src/main/java/org/apache/hupa/shared/rpc/RawMessage.java>:[29,35]
cannot find symbol
symbol: class Action
public class RawMessage implements Action<RawMessageResult>, Serializable {
[ERROR] <https://builds.apache.org/job/hupa-trunk/ws/trunk/shared/src/main/java/org/apache/hupa/shared/rpc/RawMessage.java>:[29,41]
interface expected here
[ERROR] <https://builds.apache.org/job/hupa-trunk/ws/trunk/shared/src/main/java/org/apache/hupa/shared/rpc/Contacts.java>:[24,41]
package net.customware.gwt.dispatch.shared does not exist
[ERROR] <https://builds.apache.org/job/hupa-trunk/ws/trunk/shared/src/main/java/org/apache/hupa/shared/rpc/Contacts.java>:[26,33]
cannot find symbol
symbol: class Action
public class Contacts implements Action<ContactsResult>, Serializable{
[ERROR] <https://builds.apache.org/job/hupa-trunk/ws/trunk/shared/src/main/java/org/apache/hupa/shared/rpc/Contacts.java>:[26,39]
interface expected here
[ERROR] <https://builds.apache.org/job/hupa-trunk/ws/trunk/shared/src/main/java/org/apache/hupa/shared/rpc/MoveMessage.java>:[24,41]
package net.customware.gwt.dispatch.shared does not exist
[ERROR] <https://builds.apache.org/job/hupa-trunk/ws/trunk/shared/src/main/java/org/apache/hupa/shared/rpc/MoveMessage.java>:[28,36]
cannot find symbol
symbol: class Action
public class MoveMessage implements Action<MoveMessageResult>, Serializable {
[ERROR] <https://builds.apache.org/job/hupa-trunk/ws/trunk/shared/src/main/java/org/apache/hupa/shared/rpc/MoveMessage.java>:[28,42]
interface expected here
[ERROR] <https://builds.apache.org/job/hupa-trunk/ws/trunk/shared/src/main/java/org/apache/hupa/shared/rpc/SetFlag.java>:[25,41]
package net.customware.gwt.dispatch.shared does not exist
[ERROR] <https://builds.apache.org/job/hupa-trunk/ws/trunk/shared/src/main/java/org/apache/hupa/shared/rpc/SetFlag.java>:[30,32]
cannot find symbol
symbol: class Action
public class SetFlag implements Action<GenericResult>, Serializable {
[ERROR] <https://builds.apache.org/job/hupa-trunk/ws/trunk/shared/src/main/java/org/apache/hupa/shared/rpc/SetFlag.java>:[30,38]
interface expected here
[ERROR] <https://builds.apache.org/job/hupa-trunk/ws/trunk/shared/src/main/java/org/apache/hupa/shared/rpc/GetMessageDetails.java>:[25,41]
package net.customware.gwt.dispatch.shared does not exist
[ERROR] <https://builds.apache.org/job/hupa-trunk/ws/trunk/shared/src/main/java/org/apache/hupa/shared/rpc/GetMessageDetails.java>:[29,42]
cannot find symbol
symbol: class Action
public class GetMessageDetails implements Action<GetMessageDetailsResult>, Serializable
{
[ERROR] <https://builds.apache.org/job/hupa-trunk/ws/trunk/shared/src/main/java/org/apache/hupa/shared/rpc/GetMessageDetails.java>:[29,48]
interface expected here
[INFO] 71 errors 
[INFO] -------------------------------------------------------------
Aug 22, 2013 3:32:11 PM org.apache.maven.cli.event.ExecutionEventLogger logReactorSummary
INFO: ------------------------------------------------------------------------
Aug 22, 2013 3:32:11 PM org.apache.maven.cli.event.ExecutionEventLogger logReactorSummary
INFO: Reactor Summary:
Aug 22, 2013 3:32:11 PM org.apache.maven.cli.event.ExecutionEventLogger logReactorSummary
INFO: 
Aug 22, 2013 3:32:11 PM org.apache.maven.cli.event.ExecutionEventLogger logReactorSummary
INFO: Apache James Hupa Parent .......................... SUCCESS [3.947s]
Aug 22, 2013 3:32:11 PM org.apache.maven.cli.event.ExecutionEventLogger logReactorSummary
INFO: Apache James Hupa Shared .......................... FAILURE [14.791s]
Aug 22, 2013 3:32:11 PM org.apache.maven.cli.event.ExecutionEventLogger logReactorSummary
INFO: Apache James Hupa Mock ............................ SKIPPED
Aug 22, 2013 3:32:11 PM org.apache.maven.cli.event.ExecutionEventLogger logReactorSummary
INFO: Apache James Hupa Server .......................... SKIPPED
Aug 22, 2013 3:32:11 PM org.apache.maven.cli.event.ExecutionEventLogger logReactorSummary
INFO: Apache James Hupa Widgets ......................... SKIPPED
Aug 22, 2013 3:32:11 PM org.apache.maven.cli.event.ExecutionEventLogger logReactorSummary
INFO: Apache James Hupa ................................. SKIPPED
Aug 22, 2013 3:32:11 PM org.apache.maven.cli.event.ExecutionEventLogger logResult
INFO: ------------------------------------------------------------------------
Aug 22, 2013 3:32:11 PM org.apache.maven.cli.event.ExecutionEventLogger logResult
INFO: BUILD FAILURE
Aug 22, 2013 3:32:11 PM org.apache.maven.cli.event.ExecutionEventLogger logStats
INFO: ------------------------------------------------------------------------
Aug 22, 2013 3:32:11 PM org.apache.maven.cli.event.ExecutionEventLogger logStats
INFO: Total time: 23.215s
Aug 22, 2013 3:32:11 PM org.apache.maven.cli.event.ExecutionEventLogger logStats
INFO: Finished at: Thu Aug 22 15:32:11 UTC 2013
Aug 22, 2013 3:32:11 PM org.apache.maven.cli.event.ExecutionEventLogger logStats
INFO: Final Memory: 26M/69M
Aug 22, 2013 3:32:11 PM org.apache.maven.cli.event.ExecutionEventLogger sessionEnded
INFO: ------------------------------------------------------------------------
[JENKINS] Archiving <https://builds.apache.org/job/hupa-trunk/ws/trunk/shared/pom.xml>
to /home/hudson/hudson/jobs/hupa-trunk/modules/org.apache.james.hupa$hupa-shared/builds/2013-08-22_15-31-44/archive/org.apache.james.hupa/hupa-shared/0.0.3-SNAPSHOT/hupa-shared-0.0.3-SNAPSHOT.pom
[JENKINS] Archiving <https://builds.apache.org/job/hupa-trunk/ws/trunk/pom.xml> to /home/hudson/hudson/jobs/hupa-trunk/modules/org.apache.james.hupa$hupa-parent/builds/2013-08-22_15-31-44/archive/org.apache.james.hupa/hupa-parent/0.0.3-SNAPSHOT/hupa-parent-0.0.3-SNAPSHOT.pom
[JENKINS] Archiving <https://builds.apache.org/job/hupa-trunk/ws/trunk/target/hupa-parent-0.0.3-SNAPSHOT-site.xml>
to /home/hudson/hudson/jobs/hupa-trunk/modules/org.apache.james.hupa$hupa-parent/builds/2013-08-22_15-31-44/archive/org.apache.james.hupa/hupa-parent/0.0.3-SNAPSHOT/hupa-parent-0.0.3-SNAPSHOT-site.xml
[JENKINS] Archiving <https://builds.apache.org/job/hupa-trunk/ws/trunk/client/pom.xml>
to /home/hudson/hudson/jobs/hupa-trunk/modules/org.apache.james.hupa$hupa/builds/2013-08-22_15-31-44/archive/org.apache.james.hupa/hupa/0.0.3-SNAPSHOT/hupa-0.0.3-SNAPSHOT.pom
[JENKINS] Archiving <https://builds.apache.org/job/hupa-trunk/ws/trunk/mock/pom.xml>
to /home/hudson/hudson/jobs/hupa-trunk/modules/org.apache.james.hupa$hupa-mock/builds/2013-08-22_15-31-44/archive/org.apache.james.hupa/hupa-mock/0.0.3-SNAPSHOT/hupa-mock-0.0.3-SNAPSHOT.pom
[JENKINS] Archiving <https://builds.apache.org/job/hupa-trunk/ws/trunk/widgets/pom.xml>
to /home/hudson/hudson/jobs/hupa-trunk/modules/org.apache.james.hupa$hupa-widgets/builds/2013-08-22_15-31-44/archive/org.apache.james.hupa/hupa-widgets/0.0.3-SNAPSHOT/hupa-widgets-0.0.3-SNAPSHOT.pom
[JENKINS] Archiving <https://builds.apache.org/job/hupa-trunk/ws/trunk/server/pom.xml>
to /home/hudson/hudson/jobs/hupa-trunk/modules/org.apache.james.hupa$hupa-server/builds/2013-08-22_15-31-44/archive/org.apache.james.hupa/hupa-server/0.0.3-SNAPSHOT/hupa-server-0.0.3-SNAPSHOT.pom
Waiting for Jenkins to finish collecting data
Sending e-mails to: server-dev@james.apache.org
channel stopped
Skipping Cobertura coverage report as build was not UNSTABLE or better ...

---------------------------------------------------------------------
To unsubscribe, e-mail: server-dev-unsubscribe@james.apache.org
For additional commands, e-mail: server-dev-help@james.apache.org


Mime
View raw message