james-server-dev mailing list archives

Site index · List index
Message view « Date » · « Thread »
Top « Date » · « Thread »
From Apache Jenkins Server <jenk...@builds.apache.org>
Subject Build failed in Jenkins: hupa-trunk #334
Date Thu, 22 Aug 2013 16:21:12 GMT
See <https://builds.apache.org/job/hupa-trunk/334/changes>

Changes:

[dongxu] commit

------------------------------------------
Started by an SCM change
Building remotely on ubuntu3 in workspace <https://builds.apache.org/job/hupa-trunk/ws/>
Updating http://svn.apache.org/repos/asf/james/hupa/trunk at revision '2013-08-22T16:21:10.728
+0000'
U         client/src/main/java/org/apache/hupa/Hupa.gwt.xml
U         client/src/main/java/org/apache/hupa/client/bundles/HupaImageBundle.java
U         client/src/main/java/org/apache/hupa/client/dnd/PagingScrollTableRowDragController.java
U         client/src/main/java/org/apache/hupa/client/HupaConstants.java
U         client/src/main/java/org/apache/hupa/client/HupaCSS.java
U         client/src/main/java/org/apache/hupa/HupaProd.gwt.xml
U         client/pom.xml
U         server/src/main/java/org/apache/hupa/server/preferences/UserPreferencesStorage.java
U         shared/src/main/java/org/apache/hupa/shared/events/ReplyMessageEvent.java
U         README.txt
At revision 1516500
Parsing POMs
ERROR: Failed to parse POMs
hudson.util.IOException2: remote file operation failed: <https://builds.apache.org/job/hupa-trunk/ws/trunk>
at hudson.remoting.Channel@7b266772:ubuntu3
	at hudson.FilePath.act(FilePath.java:905)
	at hudson.FilePath.act(FilePath.java:882)
	at hudson.maven.MavenModuleSetBuild$MavenModuleSetBuildExecution.parsePoms(MavenModuleSetBuild.java:920)
	at hudson.maven.MavenModuleSetBuild$MavenModuleSetBuildExecution.doRun(MavenModuleSetBuild.java:652)
	at hudson.model.AbstractBuild$AbstractBuildExecution.run(AbstractBuild.java:567)
	at hudson.model.Run.execute(Run.java:1603)
	at hudson.maven.MavenModuleSetBuild.run(MavenModuleSetBuild.java:506)
	at hudson.model.ResourceController.execute(ResourceController.java:88)
	at hudson.model.Executor.run(Executor.java:247)
Caused by: hudson.remoting.ProxyException: hudson.maven.MavenModuleSetBuild$MavenExecutionException:
org.apache.maven.project.ProjectBuildingException: Some problems were encountered while processing
the POMs:
[WARNING] 'parent.relativePath' points at org.apache.james.hupa:hupa-parent instead of org.apache.hupa:hupa-parent,
please verify your project structure @ line 25, column 13
[FATAL] Non-resolvable parent POM: Could not find artifact org.apache.hupa:hupa-parent:pom:0.0.2-SNAPSHOT
and 'parent.relativePath' points at wrong local POM @ line 25, column 13

	at hudson.maven.MavenModuleSetBuild$PomParser.invoke(MavenModuleSetBuild.java:1323)
	at hudson.maven.MavenModuleSetBuild$PomParser.invoke(MavenModuleSetBuild.java:1058)
	at hudson.FilePath$FileCallableWrapper.call(FilePath.java:2417)
	at hudson.remoting.UserRequest.perform(UserRequest.java:118)
	at hudson.remoting.UserRequest.perform(UserRequest.java:48)
	at hudson.remoting.Request$2.run(Request.java:326)
	at hudson.remoting.InterceptingExecutorService$1.call(InterceptingExecutorService.java:72)
	at java.util.concurrent.FutureTask$Sync.innerRun(FutureTask.java:334)
	at java.util.concurrent.FutureTask.run(FutureTask.java:166)
	at java.util.concurrent.ThreadPoolExecutor.runWorker(ThreadPoolExecutor.java:1146)
	at java.util.concurrent.ThreadPoolExecutor$Worker.run(ThreadPoolExecutor.java:615)
	at java.lang.Thread.run(Thread.java:679)
Caused by: hudson.remoting.ProxyException: org.apache.maven.project.ProjectBuildingException:
Some problems were encountered while processing the POMs:
[WARNING] 'parent.relativePath' points at org.apache.james.hupa:hupa-parent instead of org.apache.hupa:hupa-parent,
please verify your project structure @ line 25, column 13
[FATAL] Non-resolvable parent POM: Could not find artifact org.apache.hupa:hupa-parent:pom:0.0.2-SNAPSHOT
and 'parent.relativePath' points at wrong local POM @ line 25, column 13

	at org.apache.maven.project.DefaultProjectBuilder.build(DefaultProjectBuilder.java:364)
	at hudson.maven.MavenEmbedder.buildProjects(MavenEmbedder.java:361)
	at hudson.maven.MavenEmbedder.readProjects(MavenEmbedder.java:331)
	at hudson.maven.MavenModuleSetBuild$PomParser.invoke(MavenModuleSetBuild.java:1260)
	... 11 more
Skipping Cobertura coverage report as build was not UNSTABLE or better ...

---------------------------------------------------------------------
To unsubscribe, e-mail: server-dev-unsubscribe@james.apache.org
For additional commands, e-mail: server-dev-help@james.apache.org


Mime
View raw message