james-server-dev mailing list archives

Site index · List index
Message view « Date » · « Thread »
Top « Date » · « Thread »
From Apache Jenkins Server <jenk...@builds.apache.org>
Subject Build failed in Jenkins: james-server-trunk » Apache James :: Server :: Data :: File Persistence #3977
Date Wed, 07 Aug 2013 10:28:02 GMT
See <https://builds.apache.org/job/james-server-trunk/org.apache.james$james-server-data-file/3977/>

------------------------------------------
[...truncated 88 lines...]
	at org.junit.runners.ParentRunner$2.evaluate(ParentRunner.java:229)
	at org.junit.runners.ParentRunner.run(ParentRunner.java:309)
	at org.apache.maven.surefire.junit4.JUnit4Provider.execute(JUnit4Provider.java:264)
	at org.apache.maven.surefire.junit4.JUnit4Provider.executeTestSet(JUnit4Provider.java:153)
	at org.apache.maven.surefire.junit4.JUnit4Provider.invoke(JUnit4Provider.java:124)
	at sun.reflect.NativeMethodAccessorImpl.invoke0(Native Method)
	at sun.reflect.NativeMethodAccessorImpl.invoke(NativeMethodAccessorImpl.java:57)
	at sun.reflect.DelegatingMethodAccessorImpl.invoke(DelegatingMethodAccessorImpl.java:43)
	at java.lang.reflect.Method.invoke(Method.java:616)
	at org.apache.maven.surefire.util.ReflectionUtils.invokeMethodWithArray2(ReflectionUtils.java:208)
	at org.apache.maven.surefire.booter.ProviderFactory$ProviderProxy.invoke(ProviderFactory.java:158)
	at org.apache.maven.surefire.booter.ProviderFactory.invokeProvider(ProviderFactory.java:86)
	at org.apache.maven.surefire.booter.ForkedBooter.runSuitesInProcess(ForkedBooter.java:153)
	at org.apache.maven.surefire.booter.ForkedBooter.main(ForkedBooter.java:95)
[main] ERROR MockLog - Exception during regexMap processing: 
java.util.regex.PatternSyntaxException: Regex should be formatted as regex:<regular-expression>:<parameterized-string>
near index 0
regex:(.+)@test
^
	at org.apache.james.rrt.lib.RecipientRewriteTableUtil.regexMap(RecipientRewriteTableUtil.java:67)
	at org.apache.james.rrt.lib.AbstractRecipientRewriteTable.getMappings(AbstractRecipientRewriteTable.java:137)
	at org.apache.james.rrt.lib.AbstractRecipientRewriteTable.getMappings(AbstractRecipientRewriteTable.java:114)
	at org.apache.james.rrt.lib.AbstractRecipientRewriteTableTest.testStoreAndRetrieveRegexMapping(AbstractRecipientRewriteTableTest.java:96)
	at sun.reflect.NativeMethodAccessorImpl.invoke0(Native Method)
	at sun.reflect.NativeMethodAccessorImpl.invoke(NativeMethodAccessorImpl.java:57)
	at sun.reflect.DelegatingMethodAccessorImpl.invoke(DelegatingMethodAccessorImpl.java:43)
	at java.lang.reflect.Method.invoke(Method.java:616)
	at org.junit.runners.model.FrameworkMethod$1.runReflectiveCall(FrameworkMethod.java:47)
	at org.junit.internal.runners.model.ReflectiveCallable.run(ReflectiveCallable.java:12)
	at org.junit.runners.model.FrameworkMethod.invokeExplosively(FrameworkMethod.java:44)
	at org.junit.internal.runners.statements.InvokeMethod.evaluate(InvokeMethod.java:17)
	at org.junit.internal.runners.statements.RunBefores.evaluate(RunBefores.java:26)
	at org.junit.internal.runners.statements.RunAfters.evaluate(RunAfters.java:27)
	at org.junit.runners.ParentRunner.runLeaf(ParentRunner.java:271)
	at org.junit.runners.BlockJUnit4ClassRunner.runChild(BlockJUnit4ClassRunner.java:70)
	at org.junit.runners.BlockJUnit4ClassRunner.runChild(BlockJUnit4ClassRunner.java:50)
	at org.junit.runners.ParentRunner$3.run(ParentRunner.java:238)
	at org.junit.runners.ParentRunner$1.schedule(ParentRunner.java:63)
	at org.junit.runners.ParentRunner.runChildren(ParentRunner.java:236)
	at org.junit.runners.ParentRunner.access$000(ParentRunner.java:53)
	at org.junit.runners.ParentRunner$2.evaluate(ParentRunner.java:229)
	at org.junit.runners.ParentRunner.run(ParentRunner.java:309)
	at org.apache.maven.surefire.junit4.JUnit4Provider.execute(JUnit4Provider.java:264)
	at org.apache.maven.surefire.junit4.JUnit4Provider.executeTestSet(JUnit4Provider.java:153)
	at org.apache.maven.surefire.junit4.JUnit4Provider.invoke(JUnit4Provider.java:124)
	at sun.reflect.NativeMethodAccessorImpl.invoke0(Native Method)
	at sun.reflect.NativeMethodAccessorImpl.invoke(NativeMethodAccessorImpl.java:57)
	at sun.reflect.DelegatingMethodAccessorImpl.invoke(DelegatingMethodAccessorImpl.java:43)
	at java.lang.reflect.Method.invoke(Method.java:616)
	at org.apache.maven.surefire.util.ReflectionUtils.invokeMethodWithArray2(ReflectionUtils.java:208)
	at org.apache.maven.surefire.booter.ProviderFactory$ProviderProxy.invoke(ProviderFactory.java:158)
	at org.apache.maven.surefire.booter.ProviderFactory.invokeProvider(ProviderFactory.java:86)
	at org.apache.maven.surefire.booter.ForkedBooter.runSuitesInProcess(ForkedBooter.java:153)
	at org.apache.maven.surefire.booter.ForkedBooter.main(ForkedBooter.java:95)
Tests run: 6, Failures: 0, Errors: 0, Skipped: 0, Time elapsed: 0.198 sec
Running org.apache.james.domainlist.xml.XMLDomainListTest
[main] INFO MockLog - Set autodetect to: false
[main] INFO MockLog - Set autodetectIP to: false
[main] INFO MockLog - Local host is: localhost
[main] INFO MockLog - Set autodetect to: true
[main] INFO MockLog - Set autodetectIP to: false
[main] INFO MockLog - Local host is: localhost
[main] INFO MockLog - Set autodetect to: true
[main] INFO MockLog - Set autodetectIP to: false
[main] INFO MockLog - Local host is: local
[main] INFO MockLog - Set autodetect to: false
[main] INFO MockLog - Set autodetectIP to: false
[main] INFO MockLog - Local host is: localhost
Tests run: 4, Failures: 0, Errors: 0, Skipped: 0, Time elapsed: 0.165 sec
Running org.apache.james.user.file.UsersFileRepositoryTest
[main] INFO MockLog - Init org.apache.james.repository.file.FilePersistentObjectRepository
Store
[main] INFO MockLog - org.apache.james.repository.file.FilePersistentObjectRepository opened
in target/var/users
[main] INFO MockLog - Init org.apache.james.repository.file.FilePersistentObjectRepository
Store
[main] INFO MockLog - org.apache.james.repository.file.FilePersistentObjectRepository opened
in target/var/users
[main] INFO MockLog - Init org.apache.james.repository.file.FilePersistentObjectRepository
Store
[main] INFO MockLog - org.apache.james.repository.file.FilePersistentObjectRepository opened
in target/var/users
[main] INFO MockLog - Init org.apache.james.repository.file.FilePersistentObjectRepository
Store
[main] INFO MockLog - org.apache.james.repository.file.FilePersistentObjectRepository opened
in target/var/users
[main] INFO MockLog - Init org.apache.james.repository.file.FilePersistentObjectRepository
Store
[main] INFO MockLog - org.apache.james.repository.file.FilePersistentObjectRepository opened
in target/var/users
[main] INFO MockLog - Init org.apache.james.repository.file.FilePersistentObjectRepository
Store
[main] INFO MockLog - org.apache.james.repository.file.FilePersistentObjectRepository opened
in target/var/users
[main] INFO MockLog - Init org.apache.james.repository.file.FilePersistentObjectRepository
Store
[main] INFO MockLog - org.apache.james.repository.file.FilePersistentObjectRepository opened
in target/var/users
[main] INFO MockLog - Init org.apache.james.repository.file.FilePersistentObjectRepository
Store
[main] INFO MockLog - org.apache.james.repository.file.FilePersistentObjectRepository opened
in target/var/users
[main] INFO MockLog - Init org.apache.james.repository.file.FilePersistentObjectRepository
Store
[main] INFO MockLog - org.apache.james.repository.file.FilePersistentObjectRepository opened
in target/var/users
[main] INFO MockLog - Init org.apache.james.repository.file.FilePersistentObjectRepository
Store
[main] INFO MockLog - org.apache.james.repository.file.FilePersistentObjectRepository opened
in target/var/users
[main] INFO MockLog - Init org.apache.james.repository.file.FilePersistentObjectRepository
Store
[main] INFO MockLog - org.apache.james.repository.file.FilePersistentObjectRepository opened
in target/var/users
[main] INFO MockLog - Init org.apache.james.repository.file.FilePersistentObjectRepository
Store
[main] INFO MockLog - org.apache.james.repository.file.FilePersistentObjectRepository opened
in target/var/users
[main] INFO MockLog - Init org.apache.james.repository.file.FilePersistentObjectRepository
Store
[main] INFO MockLog - org.apache.james.repository.file.FilePersistentObjectRepository opened
in target/var/users
[main] INFO MockLog - Init org.apache.james.repository.file.FilePersistentObjectRepository
Store
[main] INFO MockLog - org.apache.james.repository.file.FilePersistentObjectRepository opened
in target/var/users
Tests run: 7, Failures: 0, Errors: 0, Skipped: 0, Time elapsed: 0.234 sec
Running org.apache.james.mailrepository.FileMailRepositoryTest
[JENKINS] Recording test results
[main] INFO MockLog - Init org.apache.james.repository.file.FilePersistentObjectRepository
Store
[main] INFO MockLog - org.apache.james.repository.file.FilePersistentObjectRepository opened
in target/var/mr
[main] INFO MockLog - Init org.apache.james.repository.file.FilePersistentStreamRepository
Store
[main] INFO MockLog - org.apache.james.repository.file.FilePersistentStreamRepository opened
in target/var/mr
[main] WARN MockLog - Exception retrieving mail: java.lang.RuntimeException: Exception caught
while retrieving an object, cause: java.io.FileNotFoundException: <https://builds.apache.org/job/james-server-trunk/org.apache.james$james-server-data-file/ws/target/var/mr/72616E646F6D.Repository.FileObjectStore>
(No such file or directory), so we're deleting it.
[main] INFO MockLog - Init org.apache.james.repository.file.FilePersistentObjectRepository
Store
[main] INFO MockLog - org.apache.james.repository.file.FilePersistentObjectRepository opened
in target/var/mr
[main] INFO MockLog - Init org.apache.james.repository.file.FilePersistentStreamRepository
Store
[main] INFO MockLog - org.apache.james.repository.file.FilePersistentStreamRepository opened
in target/var/mr
[main] INFO MockLog - Init org.apache.james.repository.file.FilePersistentObjectRepository
Store
[main] INFO MockLog - org.apache.james.repository.file.FilePersistentObjectRepository opened
in target/var/mr
[main] INFO MockLog - Init org.apache.james.repository.file.FilePersistentStreamRepository
Store
[main] INFO MockLog - org.apache.james.repository.file.FilePersistentStreamRepository opened
in target/var/mr
[main] INFO MockLog - Init org.apache.james.repository.file.FilePersistentObjectRepository
Store
[main] INFO MockLog - org.apache.james.repository.file.FilePersistentObjectRepository opened
in target/var/mr
[main] INFO MockLog - Init org.apache.james.repository.file.FilePersistentStreamRepository
Store
[main] INFO MockLog - org.apache.james.repository.file.FilePersistentStreamRepository opened
in target/var/mr
[main] INFO MockLog - Init org.apache.james.repository.file.FilePersistentObjectRepository
Store
[main] INFO MockLog - org.apache.james.repository.file.FilePersistentObjectRepository opened
in target/var/mr
[main] INFO MockLog - Init org.apache.james.repository.file.FilePersistentStreamRepository
Store
[main] INFO MockLog - org.apache.james.repository.file.FilePersistentStreamRepository opened
in target/var/mr
Tests run: 5, Failures: 0, Errors: 0, Skipped: 0, Time elapsed: 0.28 sec
Running org.apache.james.mailrepository.MBoxMailRepositoryTest
Tests run: 1, Failures: 0, Errors: 0, Skipped: 0, Time elapsed: 0.192 sec

Results :

Tests run: 23, Failures: 0, Errors: 0, Skipped: 0

Aug 7, 2013 10:25:26 AM org.apache.maven.cli.event.ExecutionEventLogger mojoStarted
INFO: 
Aug 7, 2013 10:25:26 AM org.apache.maven.cli.event.ExecutionEventLogger mojoStarted
INFO: --- maven-bundle-plugin:2.3.7:bundle (default-bundle) @ james-server-data-file ---
Aug 7, 2013 10:25:26 AM org.apache.maven.cli.event.ExecutionEventLogger mojoStarted
INFO: 
Aug 7, 2013 10:25:26 AM org.apache.maven.cli.event.ExecutionEventLogger mojoStarted
INFO: --- maven-jar-plugin:2.4:jar (jar) @ james-server-data-file ---
Aug 7, 2013 10:25:27 AM org.apache.maven.cli.event.ExecutionEventLogger mojoStarted
INFO: 
Aug 7, 2013 10:25:27 AM org.apache.maven.cli.event.ExecutionEventLogger mojoStarted
INFO: --- maven-jar-plugin:2.4:test-jar (test-jar) @ james-server-data-file ---
[INFO] Building jar: <https://builds.apache.org/job/james-server-trunk/org.apache.james$james-server-data-file/ws/target/james-server-data-file-3.0.0-beta5-SNAPSHOT-tests.jar>
Aug 7, 2013 10:25:28 AM hudson.maven.ExecutedMojo <init>
WARNING: Failed to getClass for org.apache.maven.plugin.source.SourceJarMojo
Aug 7, 2013 10:25:28 AM org.apache.maven.cli.event.ExecutionEventLogger mojoStarted
INFO: 
Aug 7, 2013 10:25:28 AM org.apache.maven.cli.event.ExecutionEventLogger mojoStarted
INFO: --- maven-source-plugin:2.2.1:jar (attach-sources) @ james-server-data-file ---
[INFO] Building jar: <https://builds.apache.org/job/james-server-trunk/org.apache.james$james-server-data-file/ws/target/james-server-data-file-3.0.0-beta5-SNAPSHOT-sources.jar>
Aug 7, 2013 10:25:30 AM hudson.maven.ExecutedMojo <init>
WARNING: Failed to getClass for org.apache.maven.plugin.source.TestSourceJarMojo
Aug 7, 2013 10:25:30 AM org.apache.maven.cli.event.ExecutionEventLogger mojoStarted
INFO: 
Aug 7, 2013 10:25:30 AM org.apache.maven.cli.event.ExecutionEventLogger mojoStarted
INFO: --- maven-source-plugin:2.2.1:test-jar (attach-sources) @ james-server-data-file ---
[INFO] Building jar: <https://builds.apache.org/job/james-server-trunk/org.apache.james$james-server-data-file/ws/target/james-server-data-file-3.0.0-beta5-SNAPSHOT-test-sources.jar>
Aug 7, 2013 10:25:33 AM org.apache.maven.cli.event.ExecutionEventLogger mojoStarted
INFO: 
Aug 7, 2013 10:25:33 AM org.apache.maven.cli.event.ExecutionEventLogger mojoStarted
INFO: --- maven-site-plugin:3.2:attach-descriptor (attach-descriptor) @ james-server-data-file
---
Aug 7, 2013 10:25:33 AM org.apache.maven.cli.event.ExecutionEventLogger mojoStarted
INFO: 
Aug 7, 2013 10:25:33 AM org.apache.maven.cli.event.ExecutionEventLogger mojoStarted
INFO: --- maven-install-plugin:2.3.1:install (default-install) @ james-server-data-file ---
[INFO] Installing <https://builds.apache.org/job/james-server-trunk/org.apache.james$james-server-data-file/ws/target/james-server-data-file-3.0.0-beta5-SNAPSHOT.jar>
to /home/jenkins/jenkins-slave/maven-repositories/1/org/apache/james/james-server-data-file/3.0.0-beta5-SNAPSHOT/james-server-data-file-3.0.0-beta5-SNAPSHOT.jar
[INFO] Installing <https://builds.apache.org/job/james-server-trunk/org.apache.james$james-server-data-file/ws/pom.xml>
to /home/jenkins/jenkins-slave/maven-repositories/1/org/apache/james/james-server-data-file/3.0.0-beta5-SNAPSHOT/james-server-data-file-3.0.0-beta5-SNAPSHOT.pom
[INFO] Installing <https://builds.apache.org/job/james-server-trunk/org.apache.james$james-server-data-file/ws/target/james-server-data-file-3.0.0-beta5-SNAPSHOT-tests.jar>
to /home/jenkins/jenkins-slave/maven-repositories/1/org/apache/james/james-server-data-file/3.0.0-beta5-SNAPSHOT/james-server-data-file-3.0.0-beta5-SNAPSHOT-tests.jar
[INFO] Installing <https://builds.apache.org/job/james-server-trunk/org.apache.james$james-server-data-file/ws/target/james-server-data-file-3.0.0-beta5-SNAPSHOT-sources.jar>
to /home/jenkins/jenkins-slave/maven-repositories/1/org/apache/james/james-server-data-file/3.0.0-beta5-SNAPSHOT/james-server-data-file-3.0.0-beta5-SNAPSHOT-sources.jar
[INFO] Installing <https://builds.apache.org/job/james-server-trunk/org.apache.james$james-server-data-file/ws/target/james-server-data-file-3.0.0-beta5-SNAPSHOT-test-sources.jar>
to /home/jenkins/jenkins-slave/maven-repositories/1/org/apache/james/james-server-data-file/3.0.0-beta5-SNAPSHOT/james-server-data-file-3.0.0-beta5-SNAPSHOT-test-sources.jar
Aug 7, 2013 10:25:33 AM org.apache.maven.cli.event.ExecutionEventLogger mojoStarted
INFO: 
Aug 7, 2013 10:25:33 AM org.apache.maven.cli.event.ExecutionEventLogger mojoStarted
INFO: --- maven-bundle-plugin:2.3.7:install (default-install) @ james-server-data-file ---
[INFO] Installing org/apache/james/james-server-data-file/3.0.0-beta5-SNAPSHOT/james-server-data-file-3.0.0-beta5-SNAPSHOT.jar
[INFO] Writing OBR metadata
[JENKINS] Recording test results
Aug 7, 2013 10:25:37 AM org.apache.maven.cli.event.ExecutionEventLogger mojoStarted
INFO: 
Aug 7, 2013 10:25:37 AM org.apache.maven.cli.event.ExecutionEventLogger mojoStarted
INFO: --- maven-remote-resources-plugin:1.4:process (default) @ james-server-data-file ---
Aug 7, 2013 10:25:37 AM org.apache.maven.cli.event.ExecutionEventLogger mojoStarted
INFO: 
Aug 7, 2013 10:25:37 AM org.apache.maven.cli.event.ExecutionEventLogger mojoStarted
INFO: --- maven-resources-plugin:2.6:resources (default-resources) @ james-server-data-file
---
[INFO] Using 'UTF-8' encoding to copy filtered resources.
[INFO] skip non existing resourceDirectory <https://builds.apache.org/job/james-server-trunk/org.apache.james$james-server-data-file/ws/src/main/resources>
[INFO] Copying 3 resources
[INFO] Copying 3 resources
Aug 7, 2013 10:25:37 AM org.apache.maven.cli.event.ExecutionEventLogger mojoStarted
INFO: 
Aug 7, 2013 10:25:37 AM org.apache.maven.cli.event.ExecutionEventLogger mojoStarted
INFO: --- maven-compiler-plugin:3.0:compile (default-compile) @ james-server-data-file ---
[INFO] Changes detected - recompiling the module!
[INFO] Compiling 6 source files to <https://builds.apache.org/job/james-server-trunk/org.apache.james$james-server-data-file/ws/target/classes>
[WARNING] <https://builds.apache.org/job/james-server-trunk/org.apache.james$james-server-data-file/ws/src/main/java/org/apache/james/user/file/UsersFileRepository.java>:
<https://builds.apache.org/job/james-server-trunk/org.apache.james$james-server-data-file/ws/src/main/java/org/apache/james/user/file/UsersFileRepository.java>
uses or overrides a deprecated API.
[WARNING] <https://builds.apache.org/job/james-server-trunk/org.apache.james$james-server-data-file/ws/src/main/java/org/apache/james/user/file/UsersFileRepository.java>:
Recompile with -Xlint:deprecation for details.
[WARNING] <https://builds.apache.org/job/james-server-trunk/org.apache.james$james-server-data-file/ws/src/main/java/org/apache/james/mailrepository/file/FileMailRepository.java>:
<https://builds.apache.org/job/james-server-trunk/org.apache.james$james-server-data-file/ws/src/main/java/org/apache/james/mailrepository/file/FileMailRepository.java>
uses unchecked or unsafe operations.
[WARNING] <https://builds.apache.org/job/james-server-trunk/org.apache.james$james-server-data-file/ws/src/main/java/org/apache/james/mailrepository/file/FileMailRepository.java>:
Recompile with -Xlint:unchecked for details.
Aug 7, 2013 10:25:38 AM org.apache.maven.cli.event.ExecutionEventLogger mojoStarted
INFO: 
Aug 7, 2013 10:25:38 AM org.apache.maven.cli.event.ExecutionEventLogger mojoStarted
INFO: --- maven-resources-plugin:2.6:testResources (default-testResources) @ james-server-data-file
---
[INFO] Using 'UTF-8' encoding to copy filtered resources.
[INFO] Copying 1 resource
[INFO] Copying 3 resources
[INFO] Copying 3 resources
Aug 7, 2013 10:25:38 AM org.apache.maven.cli.event.ExecutionEventLogger mojoStarted
INFO: 
Aug 7, 2013 10:25:38 AM org.apache.maven.cli.event.ExecutionEventLogger mojoStarted
INFO: --- maven-compiler-plugin:3.0:testCompile (default-testCompile) @ james-server-data-file
---
[INFO] Changes detected - recompiling the module!
[INFO] Compiling 5 source files to <https://builds.apache.org/job/james-server-trunk/org.apache.james$james-server-data-file/ws/target/test-classes>
[WARNING] <https://builds.apache.org/job/james-server-trunk/org.apache.james$james-server-data-file/ws/src/test/java/org/apache/james/user/file/UsersFileRepositoryTest.java>:
<https://builds.apache.org/job/james-server-trunk/org.apache.james$james-server-data-file/ws/src/test/java/org/apache/james/user/file/UsersFileRepositoryTest.java>
uses or overrides a deprecated API.
[WARNING] <https://builds.apache.org/job/james-server-trunk/org.apache.james$james-server-data-file/ws/src/test/java/org/apache/james/user/file/UsersFileRepositoryTest.java>:
Recompile with -Xlint:deprecation for details.
Aug 7, 2013 10:25:38 AM org.apache.maven.cli.event.ExecutionEventLogger mojoStarted
INFO: 
Aug 7, 2013 10:25:38 AM org.apache.maven.cli.event.ExecutionEventLogger mojoStarted
INFO: --- maven-surefire-plugin:2.13:test (default-test) @ james-server-data-file ---
[INFO] Skipping execution of surefire because it has already been run for this configuration
Aug 7, 2013 10:25:38 AM org.apache.maven.cli.event.ExecutionEventLogger mojoStarted
INFO: 
Aug 7, 2013 10:25:38 AM org.apache.maven.cli.event.ExecutionEventLogger mojoStarted
INFO: --- maven-bundle-plugin:2.3.7:bundle (default-bundle) @ james-server-data-file ---
Aug 7, 2013 10:25:39 AM org.apache.maven.cli.event.ExecutionEventLogger mojoStarted
INFO: 
Aug 7, 2013 10:25:39 AM org.apache.maven.cli.event.ExecutionEventLogger mojoStarted
INFO: --- maven-jar-plugin:2.4:jar (jar) @ james-server-data-file ---
Aug 7, 2013 10:25:40 AM org.apache.maven.cli.event.ExecutionEventLogger mojoStarted
INFO: 
Aug 7, 2013 10:25:40 AM org.apache.maven.cli.event.ExecutionEventLogger mojoStarted
INFO: --- maven-jar-plugin:2.4:test-jar (test-jar) @ james-server-data-file ---
[INFO] Building jar: <https://builds.apache.org/job/james-server-trunk/org.apache.james$james-server-data-file/ws/target/james-server-data-file-3.0.0-beta5-SNAPSHOT-tests.jar>
[WARNING] Artifact org.apache.james:james-server-data-file:test-jar:tests:3.0.0-beta5-SNAPSHOT
already attached to project, ignoring duplicate
Aug 7, 2013 10:25:41 AM hudson.maven.ExecutedMojo <init>
WARNING: Failed to getClass for org.apache.maven.plugin.source.SourceJarMojo
Aug 7, 2013 10:25:41 AM org.apache.maven.cli.event.ExecutionEventLogger mojoStarted
INFO: 
Aug 7, 2013 10:25:41 AM org.apache.maven.cli.event.ExecutionEventLogger mojoStarted
INFO: --- maven-source-plugin:2.2.1:jar (attach-sources) @ james-server-data-file ---
[INFO] Building jar: <https://builds.apache.org/job/james-server-trunk/org.apache.james$james-server-data-file/ws/target/james-server-data-file-3.0.0-beta5-SNAPSHOT-sources.jar>
[WARNING] Artifact org.apache.james:james-server-data-file:java-source:sources:3.0.0-beta5-SNAPSHOT
already attached to project, ignoring duplicate
Aug 7, 2013 10:25:45 AM hudson.maven.ExecutedMojo <init>
WARNING: Failed to getClass for org.apache.maven.plugin.source.TestSourceJarMojo
Aug 7, 2013 10:25:45 AM org.apache.maven.cli.event.ExecutionEventLogger mojoStarted
INFO: 
Aug 7, 2013 10:25:45 AM org.apache.maven.cli.event.ExecutionEventLogger mojoStarted
INFO: --- maven-source-plugin:2.2.1:test-jar (attach-sources) @ james-server-data-file ---
[INFO] Building jar: <https://builds.apache.org/job/james-server-trunk/org.apache.james$james-server-data-file/ws/target/james-server-data-file-3.0.0-beta5-SNAPSHOT-test-sources.jar>
[WARNING] Artifact org.apache.james:james-server-data-file:java-source:test-sources:3.0.0-beta5-SNAPSHOT
already attached to project, ignoring duplicate

---------------------------------------------------------------------
To unsubscribe, e-mail: server-dev-unsubscribe@james.apache.org
For additional commands, e-mail: server-dev-help@james.apache.org


Mime
View raw message