james-server-dev mailing list archives

Site index · List index
Message view « Date » · « Thread »
Top « Date » · « Thread »
From Apache Jenkins Server <jenk...@builds.apache.org>
Subject Build failed in Jenkins: hupa-trunk » Apache James Hupa Shared #331
Date Wed, 21 Aug 2013 14:12:27 GMT
See <https://builds.apache.org/job/hupa-trunk/org.apache.james.hupa$hupa-shared/331/changes>

Changes:

[dongxu] Merge branch 'gs' into gsvn

------------------------------------------
Aug 21, 2013 2:12:11 PM org.apache.maven.cli.event.ExecutionEventLogger projectStarted
INFO:                                                                         
Aug 21, 2013 2:12:11 PM org.apache.maven.cli.event.ExecutionEventLogger projectStarted
INFO: ------------------------------------------------------------------------
Aug 21, 2013 2:12:11 PM org.apache.maven.cli.event.ExecutionEventLogger projectStarted
INFO: Building Apache James Hupa Shared 0.0.5-SNAPSHOT
Aug 21, 2013 2:12:11 PM org.apache.maven.cli.event.ExecutionEventLogger projectStarted
INFO: ------------------------------------------------------------------------
Downloading: http://repo.maven.apache.org/maven2/org/codehaus/mojo/gwt-maven-plugin/2.5.1/gwt-maven-plugin-2.5.1.pom
Downloaded: http://repo.maven.apache.org/maven2/org/codehaus/mojo/gwt-maven-plugin/2.5.1/gwt-maven-plugin-2.5.1.pom
(21 KB at 1820.7 KB/sec)
Downloading: http://repo.maven.apache.org/maven2/org/codehaus/mojo/gwt-maven-plugin/2.5.1/gwt-maven-plugin-2.5.1.jar
Downloaded: http://repo.maven.apache.org/maven2/org/codehaus/mojo/gwt-maven-plugin/2.5.1/gwt-maven-plugin-2.5.1.jar
(181 KB at 5628.5 KB/sec)
Downloading: http://repo1.maven.org/maven2/com/google/gwt/gwt-user/2.5.1/gwt-user-2.5.1.pom
Downloaded: http://repo1.maven.org/maven2/com/google/gwt/gwt-user/2.5.1/gwt-user-2.5.1.pom
(2 KB at 61.1 KB/sec)
Downloading: http://repo1.maven.org/maven2/com/google/gwt/gwt/2.5.1/gwt-2.5.1.pom
Downloaded: http://repo1.maven.org/maven2/com/google/gwt/gwt/2.5.1/gwt-2.5.1.pom (825 B at
89.5 KB/sec)
Downloading: http://repo1.maven.org/maven2/com/google/gwt/gwt-user/2.5.1/gwt-user-2.5.1.jar
Downloaded: http://repo1.maven.org/maven2/com/google/gwt/gwt-user/2.5.1/gwt-user-2.5.1.jar
(28081 KB at 8608.3 KB/sec)
Aug 21, 2013 2:12:14 PM org.apache.maven.cli.event.ExecutionEventLogger mojoStarted
INFO: 
Aug 21, 2013 2:12:14 PM org.apache.maven.cli.event.ExecutionEventLogger mojoStarted
INFO: --- maven-clean-plugin:2.4.1:clean (default-clean) @ hupa-shared ---
Aug 21, 2013 2:12:15 PM org.apache.maven.cli.event.ExecutionEventLogger mojoStarted
INFO: 
Aug 21, 2013 2:12:15 PM org.apache.maven.cli.event.ExecutionEventLogger mojoStarted
INFO: --- maven-remote-resources-plugin:1.2.1:process (default) @ hupa-shared ---
Aug 21, 2013 2:12:15 PM org.apache.maven.cli.event.ExecutionEventLogger mojoStarted
INFO: 
Aug 21, 2013 2:12:15 PM org.apache.maven.cli.event.ExecutionEventLogger mojoStarted
INFO: --- maven-resources-plugin:2.5:resources (default-resources) @ hupa-shared ---
[debug] execute contextualize
[INFO] Using 'UTF-8' encoding to copy filtered resources.
[INFO] skip non existing resourceDirectory <https://builds.apache.org/job/hupa-trunk/org.apache.james.hupa$hupa-shared/ws/src/main/resources>
[INFO] Copying 3 resources
Aug 21, 2013 2:12:15 PM org.apache.maven.cli.event.ExecutionEventLogger mojoStarted
INFO: 
Aug 21, 2013 2:12:15 PM org.apache.maven.cli.event.ExecutionEventLogger mojoStarted
INFO: --- gwt-maven-plugin:2.5.1:resources (default) @ hupa-shared ---
Downloading: http://repo.maven.apache.org/maven2/com/google/gwt/gwt-dev/2.5.1/gwt-dev-2.5.1.pom
Downloaded: http://repo.maven.apache.org/maven2/com/google/gwt/gwt-dev/2.5.1/gwt-dev-2.5.1.pom
(778 B at 95.0 KB/sec)
Downloading: http://repo.maven.apache.org/maven2/com/google/gwt/gwt-codeserver/2.5.1/gwt-codeserver-2.5.1.pom
Downloaded: http://repo.maven.apache.org/maven2/com/google/gwt/gwt-codeserver/2.5.1/gwt-codeserver-2.5.1.pom
(775 B at 94.6 KB/sec)
Downloading: http://repo.maven.apache.org/maven2/com/google/gwt/gwt-dev/2.5.1/gwt-dev-2.5.1.jar
Downloading: http://repo.maven.apache.org/maven2/com/google/gwt/gwt-codeserver/2.5.1/gwt-codeserver-2.5.1.jar
Downloading: http://repo.maven.apache.org/maven2/com/google/gwt/gwt-user/2.5.1/gwt-user-2.5.1.jar
Downloaded: http://repo.maven.apache.org/maven2/com/google/gwt/gwt-user/2.5.1/gwt-user-2.5.1.jar
(0 B at 0.0 KB/sec)
Downloaded: http://repo.maven.apache.org/maven2/com/google/gwt/gwt-codeserver/2.5.1/gwt-codeserver-2.5.1.jar
(83 KB at 2051.9 KB/sec)
Downloaded: http://repo.maven.apache.org/maven2/com/google/gwt/gwt-dev/2.5.1/gwt-dev-2.5.1.jar
(33063 KB at 47709.5 KB/sec)
[INFO] auto discovered modules [org.apache.hupa.Shared]
[INFO] 121 source files from GWT module org.apache.hupa.Shared
Aug 21, 2013 2:12:17 PM org.apache.maven.cli.event.ExecutionEventLogger mojoStarted
INFO: 
Aug 21, 2013 2:12:17 PM org.apache.maven.cli.event.ExecutionEventLogger mojoStarted
INFO: --- maven-compiler-plugin:2.3.2:compile (default-compile) @ hupa-shared ---
[INFO] Compiling 120 source files to <https://builds.apache.org/job/hupa-trunk/org.apache.james.hupa$hupa-shared/ws/target/classes>
[INFO] -------------------------------------------------------------
[ERROR] COMPILATION ERROR : 
[INFO] -------------------------------------------------------------
[ERROR] <https://builds.apache.org/job/hupa-trunk/org.apache.james.hupa$hupa-shared/ws/src/main/java/org/apache/hupa/shared/events/MoveMessageEvent.java>:[44,0]
illegal start of type
[ERROR] <https://builds.apache.org/job/hupa-trunk/org.apache.james.hupa$hupa-shared/ws/src/main/java/org/apache/hupa/shared/events/MoveMessageEvent.java>:[44,2]
';' expected
[ERROR] <https://builds.apache.org/job/hupa-trunk/org.apache.james.hupa$hupa-shared/ws/src/main/java/org/apache/hupa/shared/events/MoveMessageEvent.java>:[44,4]
illegal start of type
[ERROR] <https://builds.apache.org/job/hupa-trunk/org.apache.james.hupa$hupa-shared/ws/src/main/java/org/apache/hupa/shared/events/MoveMessageEvent.java>:[44,6]
<identifier> expected
[ERROR] <https://builds.apache.org/job/hupa-trunk/org.apache.james.hupa$hupa-shared/ws/src/main/java/org/apache/hupa/shared/events/MoveMessageEvent.java>:[44,7]
';' expected
[ERROR] <https://builds.apache.org/job/hupa-trunk/org.apache.james.hupa$hupa-shared/ws/src/main/java/org/apache/hupa/shared/events/MoveMessageEvent.java>:[46,0]
illegal start of expression
[ERROR] <https://builds.apache.org/job/hupa-trunk/org.apache.james.hupa$hupa-shared/ws/src/main/java/org/apache/hupa/shared/events/MoveMessageEvent.java>:[46,2]
illegal start of expression
[ERROR] <https://builds.apache.org/job/hupa-trunk/org.apache.james.hupa$hupa-shared/ws/src/main/java/org/apache/hupa/shared/events/MoveMessageEvent.java>:[46,4]
illegal start of expression
[ERROR] <https://builds.apache.org/job/hupa-trunk/org.apache.james.hupa$hupa-shared/ws/src/main/java/org/apache/hupa/shared/events/MoveMessageEvent.java>:[46,6]
illegal start of expression
[ERROR] <https://builds.apache.org/job/hupa-trunk/org.apache.james.hupa$hupa-shared/ws/src/main/java/org/apache/hupa/shared/events/MoveMessageEvent.java>:[47,4]
illegal start of expression
[ERROR] <https://builds.apache.org/job/hupa-trunk/org.apache.james.hupa$hupa-shared/ws/src/main/java/org/apache/hupa/shared/events/MoveMessageEvent.java>:[47,38]
')' expected
[ERROR] <https://builds.apache.org/job/hupa-trunk/org.apache.james.hupa$hupa-shared/ws/src/main/java/org/apache/hupa/shared/events/MoveMessageEvent.java>:[47,48]
illegal start of expression
[ERROR] <https://builds.apache.org/job/hupa-trunk/org.apache.james.hupa$hupa-shared/ws/src/main/java/org/apache/hupa/shared/events/MoveMessageEvent.java>:[47,49]
';' expected
[ERROR] <https://builds.apache.org/job/hupa-trunk/org.apache.james.hupa$hupa-shared/ws/src/main/java/org/apache/hupa/shared/events/MoveMessageEvent.java>:[52,0]
illegal start of expression
[ERROR] <https://builds.apache.org/job/hupa-trunk/org.apache.james.hupa$hupa-shared/ws/src/main/java/org/apache/hupa/shared/events/MoveMessageEvent.java>:[52,3]
illegal start of expression
[ERROR] <https://builds.apache.org/job/hupa-trunk/org.apache.james.hupa$hupa-shared/ws/src/main/java/org/apache/hupa/shared/events/MoveMessageEvent.java>:[52,6]
illegal start of expression
[ERROR] <https://builds.apache.org/job/hupa-trunk/org.apache.james.hupa$hupa-shared/ws/src/main/java/org/apache/hupa/shared/events/MoveMessageEvent.java>:[52,13]
';' expected
[ERROR] <https://builds.apache.org/job/hupa-trunk/org.apache.james.hupa$hupa-shared/ws/src/main/java/org/apache/hupa/shared/events/MoveMessageEvent.java>:[52,14]
not a statement
[ERROR] <https://builds.apache.org/job/hupa-trunk/org.apache.james.hupa$hupa-shared/ws/src/main/java/org/apache/hupa/shared/events/MoveMessageEvent.java>:[52,48]
';' expected
[INFO] 19 errors 
[INFO] -------------------------------------------------------------

---------------------------------------------------------------------
To unsubscribe, e-mail: server-dev-unsubscribe@james.apache.org
For additional commands, e-mail: server-dev-help@james.apache.org


Mime
View raw message