james-server-dev mailing list archives

Site index · List index
Message view « Date » · « Thread »
Top « Date » · « Thread »
From Apache Jenkins Server <jenk...@builds.apache.org>
Subject Build failed in Jenkins: hupa-trunk #350
Date Mon, 23 Sep 2013 07:12:15 GMT
See <https://builds.apache.org/job/hupa-trunk/350/changes>

Changes:

[manolo] Big Commit: Fix everything broken after using "git svn" to merge hupa-evo from apache-extras.

------------------------------------------
[...truncated 342 lines...]
Downloaded: http://repo.maven.apache.org/maven2/org/bsc/maven/maven-processor-plugin/maven-metadata.xml
(782 B at 36.4 KB/sec)
Downloading: http://repo.maven.apache.org/maven2/org/bsc/maven/maven-processor-plugin/2.2.4/maven-processor-plugin-2.2.4.pom
Downloaded: http://repo.maven.apache.org/maven2/org/bsc/maven/maven-processor-plugin/2.2.4/maven-processor-plugin-2.2.4.pom
(11 KB at 971.4 KB/sec)
Downloading: http://repo.maven.apache.org/maven2/org/bsc/maven/maven-processor-plugin/2.2.4/maven-processor-plugin-2.2.4.jar
Downloaded: http://repo.maven.apache.org/maven2/org/bsc/maven/maven-processor-plugin/2.2.4/maven-processor-plugin-2.2.4.jar
(32 KB at 2403.5 KB/sec)
Downloading: http://repo.maven.apache.org/maven2/org/apache/maven/plugins/maven-scm-plugin/1.5/maven-scm-plugin-1.5.jar
Downloaded: http://repo.maven.apache.org/maven2/org/apache/maven/plugins/maven-scm-plugin/1.5/maven-scm-plugin-1.5.jar
(57 KB at 317.0 KB/sec)
Downloading: http://repo.maven.apache.org/maven2/org/apache/maven/plugins/maven-surefire-report-plugin/2.10/maven-surefire-report-plugin-2.10.jar
Downloaded: http://repo.maven.apache.org/maven2/org/apache/maven/plugins/maven-surefire-report-plugin/2.10/maven-surefire-report-plugin-2.10.jar
(42 KB at 2420.7 KB/sec)
Sep 23, 2013 7:11:46 AM org.apache.maven.cli.event.ExecutionEventLogger projectStarted
INFO:                                                                         
Sep 23, 2013 7:11:46 AM org.apache.maven.cli.event.ExecutionEventLogger projectStarted
INFO: ------------------------------------------------------------------------
Sep 23, 2013 7:11:46 AM org.apache.maven.cli.event.ExecutionEventLogger projectStarted
INFO: Building Apache James Hupa Parent 0.0.5-SNAPSHOT
Sep 23, 2013 7:11:46 AM org.apache.maven.cli.event.ExecutionEventLogger projectStarted
INFO: ------------------------------------------------------------------------
Sep 23, 2013 7:11:46 AM org.apache.maven.cli.event.ExecutionEventLogger mojoStarted
INFO: 
Sep 23, 2013 7:11:46 AM org.apache.maven.cli.event.ExecutionEventLogger mojoStarted
INFO: --- maven-clean-plugin:2.4.1:clean (default-clean) @ hupa-parent ---
Sep 23, 2013 7:11:58 AM org.apache.maven.cli.event.ExecutionEventLogger mojoStarted
INFO: 
Sep 23, 2013 7:11:58 AM org.apache.maven.cli.event.ExecutionEventLogger mojoStarted
INFO: --- maven-remote-resources-plugin:1.2.1:process (default) @ hupa-parent ---
Sep 23, 2013 7:11:59 AM org.apache.maven.cli.event.ExecutionEventLogger mojoStarted
INFO: 
Sep 23, 2013 7:11:59 AM org.apache.maven.cli.event.ExecutionEventLogger mojoStarted
INFO: --- maven-site-plugin:3.0:attach-descriptor (attach-descriptor) @ hupa-parent ---
Sep 23, 2013 7:12:02 AM org.apache.maven.cli.event.ExecutionEventLogger mojoStarted
INFO: 
Sep 23, 2013 7:12:02 AM org.apache.maven.cli.event.ExecutionEventLogger mojoStarted
INFO: --- maven-remote-resources-plugin:1.2.1:process (default) @ hupa-parent ---
Sep 23, 2013 7:12:02 AM org.apache.maven.cli.event.ExecutionEventLogger mojoStarted
INFO: 
Sep 23, 2013 7:12:02 AM org.apache.maven.cli.event.ExecutionEventLogger mojoStarted
INFO: --- cobertura-maven-plugin:2.5.1:instrument (default-cli) @ hupa-parent ---
[INFO] Skipping cobertura mojo for project with packaging type 'pom'
Sep 23, 2013 7:12:03 AM org.apache.maven.cli.event.ExecutionEventLogger mojoStarted
INFO: 
Sep 23, 2013 7:12:03 AM org.apache.maven.cli.event.ExecutionEventLogger mojoStarted
INFO: --- cobertura-maven-plugin:2.5.1:cobertura (default-cli) @ hupa-parent ---
Sep 23, 2013 7:12:04 AM org.apache.maven.cli.event.ExecutionEventLogger projectStarted
INFO:                                                                         
Sep 23, 2013 7:12:04 AM org.apache.maven.cli.event.ExecutionEventLogger projectStarted
INFO: ------------------------------------------------------------------------
Sep 23, 2013 7:12:04 AM org.apache.maven.cli.event.ExecutionEventLogger projectStarted
INFO: Building Apache James Hupa Shared 0.0.5-SNAPSHOT
Sep 23, 2013 7:12:04 AM org.apache.maven.cli.event.ExecutionEventLogger projectStarted
INFO: ------------------------------------------------------------------------
Downloading: http://repo.maven.apache.org/maven2/org/codehaus/mojo/gwt-maven-plugin/2.5.1/gwt-maven-plugin-2.5.1.pom
Downloaded: http://repo.maven.apache.org/maven2/org/codehaus/mojo/gwt-maven-plugin/2.5.1/gwt-maven-plugin-2.5.1.pom
(21 KB at 1540.6 KB/sec)
Downloading: http://repo.maven.apache.org/maven2/org/codehaus/mojo/gwt-maven-plugin/2.5.1/gwt-maven-plugin-2.5.1.jar
Downloaded: http://repo.maven.apache.org/maven2/org/codehaus/mojo/gwt-maven-plugin/2.5.1/gwt-maven-plugin-2.5.1.jar
(181 KB at 1699.2 KB/sec)
Downloading: http://repo1.maven.org/maven2/com/google/gwt/gwt-user/2.5.1/gwt-user-2.5.1.pom
Sep 23, 2013 7:12:04 AM org.apache.maven.wagon.providers.http.httpclient.impl.client.DefaultRequestDirector
tryConnect
INFO: I/O exception (java.net.NoRouteToHostException) caught when connecting to the target
host: No route to host
Sep 23, 2013 7:12:04 AM org.apache.maven.wagon.providers.http.httpclient.impl.client.DefaultRequestDirector
tryConnect
INFO: Retrying connect
Downloaded: http://repo1.maven.org/maven2/com/google/gwt/gwt-user/2.5.1/gwt-user-2.5.1.pom
(2 KB at 89.3 KB/sec)
Downloading: http://repo1.maven.org/maven2/com/google/gwt/gwt/2.5.1/gwt-2.5.1.pom
Downloaded: http://repo1.maven.org/maven2/com/google/gwt/gwt/2.5.1/gwt-2.5.1.pom (825 B at
38.4 KB/sec)
Downloading: http://repo1.maven.org/maven2/com/google/gwt/gwt-user/2.5.1/gwt-user-2.5.1.jar
Downloaded: http://repo1.maven.org/maven2/com/google/gwt/gwt-user/2.5.1/gwt-user-2.5.1.jar
(28081 KB at 42099.3 KB/sec)
Sep 23, 2013 7:12:05 AM org.apache.maven.cli.event.ExecutionEventLogger mojoStarted
INFO: 
Sep 23, 2013 7:12:05 AM org.apache.maven.cli.event.ExecutionEventLogger mojoStarted
INFO: --- maven-clean-plugin:2.4.1:clean (default-clean) @ hupa-shared ---
Sep 23, 2013 7:12:05 AM org.apache.maven.cli.event.ExecutionEventLogger mojoStarted
INFO: 
Sep 23, 2013 7:12:05 AM org.apache.maven.cli.event.ExecutionEventLogger mojoStarted
INFO: --- maven-remote-resources-plugin:1.2.1:process (default) @ hupa-shared ---
Sep 23, 2013 7:12:05 AM org.apache.maven.cli.event.ExecutionEventLogger mojoStarted
INFO: 
Sep 23, 2013 7:12:05 AM org.apache.maven.cli.event.ExecutionEventLogger mojoStarted
INFO: --- maven-resources-plugin:2.5:resources (default-resources) @ hupa-shared ---
[debug] execute contextualize
[INFO] Using 'UTF-8' encoding to copy filtered resources.
[INFO] skip non existing resourceDirectory <https://builds.apache.org/job/hupa-trunk/ws/trunk/shared/src/main/resources>
[INFO] Copying 3 resources
Sep 23, 2013 7:12:05 AM org.apache.maven.cli.event.ExecutionEventLogger mojoStarted
INFO: 
Sep 23, 2013 7:12:05 AM org.apache.maven.cli.event.ExecutionEventLogger mojoStarted
INFO: --- gwt-maven-plugin:2.5.1:resources (default) @ hupa-shared ---
Downloading: http://repo.maven.apache.org/maven2/com/google/gwt/gwt-dev/2.5.1/gwt-dev-2.5.1.pom
Downloaded: http://repo.maven.apache.org/maven2/com/google/gwt/gwt-dev/2.5.1/gwt-dev-2.5.1.pom
(778 B at 84.4 KB/sec)
Downloading: http://repo.maven.apache.org/maven2/com/google/gwt/gwt-codeserver/2.5.1/gwt-codeserver-2.5.1.pom
Downloaded: http://repo.maven.apache.org/maven2/com/google/gwt/gwt-codeserver/2.5.1/gwt-codeserver-2.5.1.pom
(775 B at 75.7 KB/sec)
Downloading: http://repo.maven.apache.org/maven2/com/google/gwt/gwt-dev/2.5.1/gwt-dev-2.5.1.jar
Downloading: http://repo.maven.apache.org/maven2/com/google/gwt/gwt-codeserver/2.5.1/gwt-codeserver-2.5.1.jar
Downloading: http://repo.maven.apache.org/maven2/com/google/gwt/gwt-user/2.5.1/gwt-user-2.5.1.jar
Downloaded: http://repo.maven.apache.org/maven2/com/google/gwt/gwt-codeserver/2.5.1/gwt-codeserver-2.5.1.jar
(83 KB at 3908.4 KB/sec)
Downloaded: http://repo.maven.apache.org/maven2/com/google/gwt/gwt-user/2.5.1/gwt-user-2.5.1.jar
(0 B at 0.0 KB/sec)
Downloaded: http://repo.maven.apache.org/maven2/com/google/gwt/gwt-dev/2.5.1/gwt-dev-2.5.1.jar
(33063 KB at 39501.4 KB/sec)
[INFO] auto discovered modules [org.apache.hupa.Shared]
[INFO] 133 source files from GWT module org.apache.hupa.Shared
Sep 23, 2013 7:12:07 AM org.apache.maven.cli.event.ExecutionEventLogger mojoStarted
INFO: 
Sep 23, 2013 7:12:07 AM org.apache.maven.cli.event.ExecutionEventLogger mojoStarted
INFO: --- maven-compiler-plugin:2.3.2:compile (default-compile) @ hupa-shared ---
[INFO] Compiling 132 source files to <https://builds.apache.org/job/hupa-trunk/ws/trunk/shared/target/classes>
[INFO] -------------------------------------------------------------
[ERROR] COMPILATION ERROR : 
[INFO] -------------------------------------------------------------
[ERROR] <https://builds.apache.org/job/hupa-trunk/ws/trunk/shared/src/main/java/org/apache/hupa/shared/rpc/DeleteFolder.java>:[26,0]
class, interface, or enum expected
[ERROR] <https://builds.apache.org/job/hupa-trunk/ws/trunk/shared/src/main/java/org/apache/hupa/shared/rpc/DeleteFolder.java>:[31,0]
class, interface, or enum expected
[ERROR] <https://builds.apache.org/job/hupa-trunk/ws/trunk/shared/src/main/java/org/apache/hupa/shared/rpc/DeleteFolder.java>:[33,0]
class, interface, or enum expected
[ERROR] <https://builds.apache.org/job/hupa-trunk/ws/trunk/shared/src/main/java/org/apache/hupa/shared/rpc/DeleteFolder.java>:[36,0]
class, interface, or enum expected
[ERROR] <https://builds.apache.org/job/hupa-trunk/ws/trunk/shared/src/main/java/org/apache/hupa/shared/rpc/DeleteFolder.java>:[36,65]
unclosed character literal
[ERROR] <https://builds.apache.org/job/hupa-trunk/ws/trunk/shared/src/main/java/org/apache/hupa/shared/rpc/DeleteFolder.java>:[36,132]
unclosed character literal
[ERROR] <https://builds.apache.org/job/hupa-trunk/ws/trunk/shared/src/main/java/org/apache/hupa/shared/rpc/DeleteFolder.java>:[39,0]
class, interface, or enum expected
[ERROR] <https://builds.apache.org/job/hupa-trunk/ws/trunk/shared/src/main/java/org/apache/hupa/shared/rpc/DeleteFolder.java>:[39,56]
unclosed character literal
[ERROR] <https://builds.apache.org/job/hupa-trunk/ws/trunk/shared/src/main/java/org/apache/hupa/shared/rpc/DeleteFolder.java>:[42,0]
class, interface, or enum expected
[ERROR] <https://builds.apache.org/job/hupa-trunk/ws/trunk/shared/src/main/java/org/apache/hupa/shared/rpc/DeleteFolder.java>:[42,56]
<identifier> expected
[ERROR] <https://builds.apache.org/job/hupa-trunk/ws/trunk/shared/src/main/java/org/apache/hupa/shared/rpc/DeleteFolder.java>:[48,0]
illegal start of type
[ERROR] <https://builds.apache.org/job/hupa-trunk/ws/trunk/shared/src/main/java/org/apache/hupa/shared/rpc/DeleteFolder.java>:[48,2]
';' expected
[ERROR] <https://builds.apache.org/job/hupa-trunk/ws/trunk/shared/src/main/java/org/apache/hupa/shared/rpc/DeleteFolder.java>:[48,4]
illegal start of type
[ERROR] <https://builds.apache.org/job/hupa-trunk/ws/trunk/shared/src/main/java/org/apache/hupa/shared/rpc/DeleteFolder.java>:[48,6]
<identifier> expected
[ERROR] <https://builds.apache.org/job/hupa-trunk/ws/trunk/shared/src/main/java/org/apache/hupa/shared/rpc/DeleteFolder.java>:[48,7]
';' expected
[ERROR] <https://builds.apache.org/job/hupa-trunk/ws/trunk/shared/src/main/java/org/apache/hupa/shared/rpc/DeleteFolder.java>:[49,0]
illegal start of type
[ERROR] <https://builds.apache.org/job/hupa-trunk/ws/trunk/shared/src/main/java/org/apache/hupa/shared/rpc/DeleteFolder.java>:[49,2]
<identifier> expected
[ERROR] <https://builds.apache.org/job/hupa-trunk/ws/trunk/shared/src/main/java/org/apache/hupa/shared/rpc/DeleteFolder.java>:[49,4]
';' expected
[ERROR] <https://builds.apache.org/job/hupa-trunk/ws/trunk/shared/src/main/java/org/apache/hupa/shared/rpc/DeleteFolder.java>:[49,12]
> expected
[ERROR] <https://builds.apache.org/job/hupa-trunk/ws/trunk/shared/src/main/java/org/apache/hupa/shared/rpc/DeleteFolder.java>:[50,0]
illegal start of type
[ERROR] <https://builds.apache.org/job/hupa-trunk/ws/trunk/shared/src/main/java/org/apache/hupa/shared/rpc/DeleteFolder.java>:[50,2]
<identifier> expected
[ERROR] <https://builds.apache.org/job/hupa-trunk/ws/trunk/shared/src/main/java/org/apache/hupa/shared/rpc/DeleteFolder.java>:[50,4]
'(' expected
[ERROR] <https://builds.apache.org/job/hupa-trunk/ws/trunk/shared/src/main/java/org/apache/hupa/shared/rpc/DeleteFolder.java>:[50,12]
> expected
[ERROR] <https://builds.apache.org/job/hupa-trunk/ws/trunk/shared/src/main/java/org/apache/hupa/shared/rpc/DeleteFolder.java>:[51,4]
illegal start of type
[ERROR] <https://builds.apache.org/job/hupa-trunk/ws/trunk/shared/src/main/java/org/apache/hupa/shared/rpc/DeleteFolder.java>:[51,28]
'(' expected
[ERROR] <https://builds.apache.org/job/hupa-trunk/ws/trunk/shared/src/main/java/org/apache/hupa/shared/rpc/DeleteFolder.java>:[51,34]
<identifier> expected
[ERROR] <https://builds.apache.org/job/hupa-trunk/ws/trunk/shared/src/main/java/org/apache/hupa/shared/rpc/DeleteFolder.java>:[54,0]
illegal start of expression
[ERROR] <https://builds.apache.org/job/hupa-trunk/ws/trunk/shared/src/main/java/org/apache/hupa/shared/rpc/DeleteFolder.java>:[54,2]
illegal start of expression
[ERROR] <https://builds.apache.org/job/hupa-trunk/ws/trunk/shared/src/main/java/org/apache/hupa/shared/rpc/DeleteFolder.java>:[54,4]
illegal start of expression
[ERROR] <https://builds.apache.org/job/hupa-trunk/ws/trunk/shared/src/main/java/org/apache/hupa/shared/rpc/DeleteFolder.java>:[54,6]
illegal start of expression
[ERROR] <https://builds.apache.org/job/hupa-trunk/ws/trunk/shared/src/main/java/org/apache/hupa/shared/rpc/DeleteFolder.java>:[55,4]
illegal start of expression
[ERROR] <https://builds.apache.org/job/hupa-trunk/ws/trunk/shared/src/main/java/org/apache/hupa/shared/rpc/DeleteFolder.java>:[57,4]
illegal start of expression
[ERROR] <https://builds.apache.org/job/hupa-trunk/ws/trunk/shared/src/main/java/org/apache/hupa/shared/rpc/DeleteFolder.java>:[57,34]
')' expected
[ERROR] <https://builds.apache.org/job/hupa-trunk/ws/trunk/shared/src/main/java/org/apache/hupa/shared/rpc/DeleteFolder.java>:[57,41]
illegal start of expression
[ERROR] <https://builds.apache.org/job/hupa-trunk/ws/trunk/shared/src/main/java/org/apache/hupa/shared/rpc/DeleteFolder.java>:[57,42]
';' expected
[ERROR] <https://builds.apache.org/job/hupa-trunk/ws/trunk/shared/src/main/java/org/apache/hupa/shared/rpc/DeleteFolder.java>:[58,0]
illegal start of expression
[ERROR] <https://builds.apache.org/job/hupa-trunk/ws/trunk/shared/src/main/java/org/apache/hupa/shared/rpc/DeleteFolder.java>:[58,6]
illegal start of expression
[ERROR] <https://builds.apache.org/job/hupa-trunk/ws/trunk/shared/src/main/java/org/apache/hupa/shared/rpc/DeleteFolder.java>:[58,13]
';' expected
[ERROR] <https://builds.apache.org/job/hupa-trunk/ws/trunk/shared/src/main/java/org/apache/hupa/shared/rpc/DeleteFolder.java>:[59,2]
illegal start of expression
[ERROR] <https://builds.apache.org/job/hupa-trunk/ws/trunk/shared/src/main/java/org/apache/hupa/shared/rpc/DeleteFolder.java>:[59,4]
illegal start of expression
[ERROR] <https://builds.apache.org/job/hupa-trunk/ws/trunk/shared/src/main/java/org/apache/hupa/shared/rpc/DeleteFolder.java>:[59,6]
illegal start of expression
[ERROR] <https://builds.apache.org/job/hupa-trunk/ws/trunk/shared/src/main/java/org/apache/hupa/shared/rpc/DeleteFolder.java>:[60,4]
illegal start of expression
[ERROR] <https://builds.apache.org/job/hupa-trunk/ws/trunk/shared/src/main/java/org/apache/hupa/shared/rpc/DeleteFolder.java>:[62,4]
illegal start of expression
[ERROR] <https://builds.apache.org/job/hupa-trunk/ws/trunk/shared/src/main/java/org/apache/hupa/shared/rpc/DeleteFolder.java>:[62,39]
')' expected
[ERROR] <https://builds.apache.org/job/hupa-trunk/ws/trunk/shared/src/main/java/org/apache/hupa/shared/rpc/DeleteFolder.java>:[62,46]
illegal start of expression
[ERROR] <https://builds.apache.org/job/hupa-trunk/ws/trunk/shared/src/main/java/org/apache/hupa/shared/rpc/DeleteFolder.java>:[62,47]
';' expected
[ERROR] <https://builds.apache.org/job/hupa-trunk/ws/trunk/shared/src/main/java/org/apache/hupa/shared/rpc/DeleteFolder.java>:[63,0]
illegal start of expression
[ERROR] <https://builds.apache.org/job/hupa-trunk/ws/trunk/shared/src/main/java/org/apache/hupa/shared/rpc/DeleteFolder.java>:[63,6]
illegal start of expression
[ERROR] <https://builds.apache.org/job/hupa-trunk/ws/trunk/shared/src/main/java/org/apache/hupa/shared/rpc/DeleteFolder.java>:[63,11]
';' expected
[ERROR] <https://builds.apache.org/job/hupa-trunk/ws/trunk/shared/src/main/java/org/apache/hupa/shared/rpc/DeleteFolder.java>:[63,19]
';' expected
[ERROR] <https://builds.apache.org/job/hupa-trunk/ws/trunk/shared/src/main/java/org/apache/hupa/shared/rpc/DeleteFolder.java>:[63,29]
';' expected
[ERROR] <https://builds.apache.org/job/hupa-trunk/ws/trunk/shared/src/main/java/org/apache/hupa/shared/rpc/DeleteFolder.java>:[63,38]
';' expected
[ERROR] <https://builds.apache.org/job/hupa-trunk/ws/trunk/shared/src/main/java/org/apache/hupa/shared/rpc/DeleteFolder.java>:[63,49]
';' expected
[ERROR] <https://builds.apache.org/job/hupa-trunk/ws/trunk/shared/src/main/java/org/apache/hupa/shared/rpc/DeleteFolder.java>:[63,60]
';' expected
[ERROR] <https://builds.apache.org/job/hupa-trunk/ws/trunk/shared/src/main/java/org/apache/hupa/shared/rpc/DeleteFolder.java>:[63,65]
unclosed character literal
[ERROR] <https://builds.apache.org/job/hupa-trunk/ws/trunk/shared/src/main/java/org/apache/hupa/shared/rpc/DeleteFolder.java>:[63,61]
not a statement
[ERROR] <https://builds.apache.org/job/hupa-trunk/ws/trunk/shared/src/main/java/org/apache/hupa/shared/rpc/DeleteFolder.java>:[63,87]
';' expected
[ERROR] <https://builds.apache.org/job/hupa-trunk/ws/trunk/shared/src/main/java/org/apache/hupa/shared/rpc/DeleteFolder.java>:[63,96]
';' expected
[ERROR] <https://builds.apache.org/job/hupa-trunk/ws/trunk/shared/src/main/java/org/apache/hupa/shared/rpc/DeleteFolder.java>:[63,97]
not a statement
[ERROR] <https://builds.apache.org/job/hupa-trunk/ws/trunk/shared/src/main/java/org/apache/hupa/shared/rpc/DeleteFolder.java>:[63,104]
';' expected
[ERROR] <https://builds.apache.org/job/hupa-trunk/ws/trunk/shared/src/main/java/org/apache/hupa/shared/rpc/DeleteFolder.java>:[63,115]
';' expected
[ERROR] <https://builds.apache.org/job/hupa-trunk/ws/trunk/shared/src/main/java/org/apache/hupa/shared/rpc/DeleteFolder.java>:[63,126]
';' expected
[ERROR] <https://builds.apache.org/job/hupa-trunk/ws/trunk/shared/src/main/java/org/apache/hupa/shared/rpc/DeleteFolder.java>:[63,132]
unclosed character literal
[ERROR] <https://builds.apache.org/job/hupa-trunk/ws/trunk/shared/src/main/java/org/apache/hupa/shared/rpc/DeleteFolder.java>:[63,139]
not a statement
[ERROR] <https://builds.apache.org/job/hupa-trunk/ws/trunk/shared/src/main/java/org/apache/hupa/shared/rpc/DeleteFolder.java>:[63,147]
';' expected
[ERROR] <https://builds.apache.org/job/hupa-trunk/ws/trunk/shared/src/main/java/org/apache/hupa/shared/rpc/DeleteFolder.java>:[63,156]
';' expected
[ERROR] <https://builds.apache.org/job/hupa-trunk/ws/trunk/shared/src/main/java/org/apache/hupa/shared/rpc/DeleteFolder.java>:[65,4]
illegal start of expression
[ERROR] <https://builds.apache.org/job/hupa-trunk/ws/trunk/shared/src/main/java/org/apache/hupa/shared/rpc/DeleteFolder.java>:[67,4]
illegal start of expression
[ERROR] <https://builds.apache.org/job/hupa-trunk/ws/trunk/shared/src/main/java/org/apache/hupa/shared/rpc/DeleteFolder.java>:[67,34]
')' expected
[ERROR] <https://builds.apache.org/job/hupa-trunk/ws/trunk/shared/src/main/java/org/apache/hupa/shared/rpc/DeleteFolder.java>:[67,41]
illegal start of expression
[ERROR] <https://builds.apache.org/job/hupa-trunk/ws/trunk/shared/src/main/java/org/apache/hupa/shared/rpc/DeleteFolder.java>:[67,42]
';' expected
[ERROR] <https://builds.apache.org/job/hupa-trunk/ws/trunk/shared/src/main/java/org/apache/hupa/shared/rpc/DeleteFolder.java>:[68,0]
illegal start of expression
[ERROR] <https://builds.apache.org/job/hupa-trunk/ws/trunk/shared/src/main/java/org/apache/hupa/shared/rpc/DeleteFolder.java>:[68,6]
illegal start of expression
[ERROR] <https://builds.apache.org/job/hupa-trunk/ws/trunk/shared/src/main/java/org/apache/hupa/shared/rpc/DeleteFolder.java>:[68,12]
';' expected
[ERROR] <https://builds.apache.org/job/hupa-trunk/ws/trunk/shared/src/main/java/org/apache/hupa/shared/rpc/DeleteFolder.java>:[68,27]
';' expected
[ERROR] <https://builds.apache.org/job/hupa-trunk/ws/trunk/shared/src/main/java/org/apache/hupa/shared/rpc/DeleteFolder.java>:[68,28]
not a statement
[ERROR] <https://builds.apache.org/job/hupa-trunk/ws/trunk/shared/src/main/java/org/apache/hupa/shared/rpc/DeleteFolder.java>:[68,38]
';' expected
[ERROR] <https://builds.apache.org/job/hupa-trunk/ws/trunk/shared/src/main/java/org/apache/hupa/shared/rpc/DeleteFolder.java>:[68,49]
';' expected
[ERROR] <https://builds.apache.org/job/hupa-trunk/ws/trunk/shared/src/main/java/org/apache/hupa/shared/rpc/DeleteFolder.java>:[68,56]
unclosed character literal
[ERROR] <https://builds.apache.org/job/hupa-trunk/ws/trunk/shared/src/main/java/org/apache/hupa/shared/rpc/DeleteFolder.java>:[68,50]
not a statement
[ERROR] <https://builds.apache.org/job/hupa-trunk/ws/trunk/shared/src/main/java/org/apache/hupa/shared/rpc/DeleteFolder.java>:[68,74]
';' expected
[ERROR] <https://builds.apache.org/job/hupa-trunk/ws/trunk/shared/src/main/java/org/apache/hupa/shared/rpc/DeleteFolder.java>:[68,90]
';' expected
[ERROR] <https://builds.apache.org/job/hupa-trunk/ws/trunk/shared/src/main/java/org/apache/hupa/shared/rpc/DeleteFolder.java>:[68,98]
';' expected
[ERROR] <https://builds.apache.org/job/hupa-trunk/ws/trunk/shared/src/main/java/org/apache/hupa/shared/rpc/DeleteFolder.java>:[68,108]
';' expected
[ERROR] <https://builds.apache.org/job/hupa-trunk/ws/trunk/shared/src/main/java/org/apache/hupa/shared/rpc/DeleteFolder.java>:[68,127]
';' expected
[ERROR] <https://builds.apache.org/job/hupa-trunk/ws/trunk/shared/src/main/java/org/apache/hupa/shared/rpc/DeleteFolder.java>:[75,0]
illegal start of type
[ERROR] <https://builds.apache.org/job/hupa-trunk/ws/trunk/shared/src/main/java/org/apache/hupa/shared/rpc/DeleteFolder.java>:[75,2]
';' expected
[ERROR] <https://builds.apache.org/job/hupa-trunk/ws/trunk/shared/src/main/java/org/apache/hupa/shared/rpc/DeleteFolder.java>:[75,4]
illegal start of type
[ERROR] <https://builds.apache.org/job/hupa-trunk/ws/trunk/shared/src/main/java/org/apache/hupa/shared/rpc/DeleteFolder.java>:[75,6]
<identifier> expected
[ERROR] <https://builds.apache.org/job/hupa-trunk/ws/trunk/shared/src/main/java/org/apache/hupa/shared/rpc/DeleteFolder.java>:[75,7]
';' expected
[ERROR] <https://builds.apache.org/job/hupa-trunk/ws/trunk/shared/src/main/java/org/apache/hupa/shared/rpc/DeleteFolder.java>:[76,0]
illegal start of type
[ERROR] <https://builds.apache.org/job/hupa-trunk/ws/trunk/shared/src/main/java/org/apache/hupa/shared/rpc/DeleteFolder.java>:[76,2]
<identifier> expected
[ERROR] <https://builds.apache.org/job/hupa-trunk/ws/trunk/shared/src/main/java/org/apache/hupa/shared/rpc/DeleteFolder.java>:[76,4]
';' expected
[ERROR] <https://builds.apache.org/job/hupa-trunk/ws/trunk/shared/src/main/java/org/apache/hupa/shared/rpc/DeleteFolder.java>:[76,12]
> expected
[ERROR] <https://builds.apache.org/job/hupa-trunk/ws/trunk/shared/src/main/java/org/apache/hupa/shared/rpc/DeleteFolder.java>:[77,0]
illegal start of type
[ERROR] <https://builds.apache.org/job/hupa-trunk/ws/trunk/shared/src/main/java/org/apache/hupa/shared/rpc/DeleteFolder.java>:[77,2]
<identifier> expected
[ERROR] <https://builds.apache.org/job/hupa-trunk/ws/trunk/shared/src/main/java/org/apache/hupa/shared/rpc/DeleteFolder.java>:[77,4]
'(' expected
[ERROR] <https://builds.apache.org/job/hupa-trunk/ws/trunk/shared/src/main/java/org/apache/hupa/shared/rpc/DeleteFolder.java>:[77,12]
> expected
[ERROR] <https://builds.apache.org/job/hupa-trunk/ws/trunk/shared/src/main/java/org/apache/hupa/shared/rpc/DeleteFolder.java>:[78,4]
illegal start of type
[ERROR] <https://builds.apache.org/job/hupa-trunk/ws/trunk/shared/src/main/java/org/apache/hupa/shared/rpc/DeleteFolder.java>:[78,27]
'(' expected
[INFO] 100 errors 
[INFO] -------------------------------------------------------------
Sep 23, 2013 7:12:09 AM org.apache.maven.cli.event.ExecutionEventLogger logReactorSummary
INFO: ------------------------------------------------------------------------
Sep 23, 2013 7:12:09 AM org.apache.maven.cli.event.ExecutionEventLogger logReactorSummary
INFO: Reactor Summary:
Sep 23, 2013 7:12:09 AM org.apache.maven.cli.event.ExecutionEventLogger logReactorSummary
INFO: 
Sep 23, 2013 7:12:09 AM org.apache.maven.cli.event.ExecutionEventLogger logReactorSummary
INFO: Apache James Hupa Parent .......................... SUCCESS [17.984s]
Sep 23, 2013 7:12:09 AM org.apache.maven.cli.event.ExecutionEventLogger logReactorSummary
INFO: Apache James Hupa Shared .......................... FAILURE [4.919s]
Sep 23, 2013 7:12:09 AM org.apache.maven.cli.event.ExecutionEventLogger logReactorSummary
INFO: Apache James Hupa Mock ............................ SKIPPED
Sep 23, 2013 7:12:09 AM org.apache.maven.cli.event.ExecutionEventLogger logReactorSummary
INFO: Apache James Hupa Server .......................... SKIPPED
Sep 23, 2013 7:12:09 AM org.apache.maven.cli.event.ExecutionEventLogger logReactorSummary
INFO: Apache James Hupa Widgets ......................... SKIPPED
Sep 23, 2013 7:12:09 AM org.apache.maven.cli.event.ExecutionEventLogger logReactorSummary
INFO: Apache James Hupa ................................. SKIPPED
Sep 23, 2013 7:12:09 AM org.apache.maven.cli.event.ExecutionEventLogger logResult
INFO: ------------------------------------------------------------------------
Sep 23, 2013 7:12:09 AM org.apache.maven.cli.event.ExecutionEventLogger logResult
INFO: BUILD FAILURE
Sep 23, 2013 7:12:09 AM org.apache.maven.cli.event.ExecutionEventLogger logStats
INFO: ------------------------------------------------------------------------
Sep 23, 2013 7:12:09 AM org.apache.maven.cli.event.ExecutionEventLogger logStats
INFO: Total time: 27.522s
Sep 23, 2013 7:12:09 AM org.apache.maven.cli.event.ExecutionEventLogger logStats
INFO: Finished at: Mon Sep 23 07:12:09 UTC 2013
Sep 23, 2013 7:12:09 AM org.apache.maven.cli.event.ExecutionEventLogger logStats
INFO: Final Memory: 23M/73M
Sep 23, 2013 7:12:09 AM org.apache.maven.cli.event.ExecutionEventLogger sessionEnded
INFO: ------------------------------------------------------------------------
[JENKINS] Archiving <https://builds.apache.org/job/hupa-trunk/ws/trunk/shared/pom.xml>
to /home/hudson/hudson/jobs/hupa-trunk/modules/org.apache.james.hupa$hupa-shared/builds/2013-09-23_07-11-29/archive/org.apache.james.hupa/hupa-shared/0.0.5-SNAPSHOT/hupa-shared-0.0.5-SNAPSHOT.pom
[JENKINS] Archiving <https://builds.apache.org/job/hupa-trunk/ws/trunk/pom.xml> to /home/hudson/hudson/jobs/hupa-trunk/modules/org.apache.james.hupa$hupa-parent/builds/2013-09-23_07-11-29/archive/org.apache.james.hupa/hupa-parent/0.0.5-SNAPSHOT/hupa-parent-0.0.5-SNAPSHOT.pom
[JENKINS] Archiving <https://builds.apache.org/job/hupa-trunk/ws/trunk/target/hupa-parent-0.0.5-SNAPSHOT-site.xml>
to /home/hudson/hudson/jobs/hupa-trunk/modules/org.apache.james.hupa$hupa-parent/builds/2013-09-23_07-11-29/archive/org.apache.james.hupa/hupa-parent/0.0.5-SNAPSHOT/hupa-parent-0.0.5-SNAPSHOT-site.xml
[JENKINS] Archiving <https://builds.apache.org/job/hupa-trunk/ws/trunk/client/pom.xml>
to /home/hudson/hudson/jobs/hupa-trunk/modules/org.apache.james.hupa$hupa/builds/2013-09-23_07-11-30/archive/org.apache.james.hupa/hupa/0.0.5-SNAPSHOT/hupa-0.0.5-SNAPSHOT.pom
[JENKINS] Archiving <https://builds.apache.org/job/hupa-trunk/ws/trunk/mock/pom.xml>
to /home/hudson/hudson/jobs/hupa-trunk/modules/org.apache.james.hupa$hupa-mock/builds/2013-09-23_07-11-30/archive/org.apache.james.hupa/hupa-mock/0.0.5-SNAPSHOT/hupa-mock-0.0.5-SNAPSHOT.pom
[JENKINS] Archiving <https://builds.apache.org/job/hupa-trunk/ws/trunk/widgets/pom.xml>
to /home/hudson/hudson/jobs/hupa-trunk/modules/org.apache.james.hupa$hupa-widgets/builds/2013-09-23_07-11-30/archive/org.apache.james.hupa/hupa-widgets/0.0.5-SNAPSHOT/hupa-widgets-0.0.5-SNAPSHOT.pom
[JENKINS] Archiving <https://builds.apache.org/job/hupa-trunk/ws/trunk/server/pom.xml>
to /home/hudson/hudson/jobs/hupa-trunk/modules/org.apache.james.hupa$hupa-server/builds/2013-09-23_07-11-30/archive/org.apache.james.hupa/hupa-server/0.0.5-SNAPSHOT/hupa-server-0.0.5-SNAPSHOT.pom
Waiting for Jenkins to finish collecting data
Sending e-mails to: server-dev@james.apache.org
channel stopped
Skipping Cobertura coverage report as build was not UNSTABLE or better ...

---------------------------------------------------------------------
To unsubscribe, e-mail: server-dev-unsubscribe@james.apache.org
For additional commands, e-mail: server-dev-help@james.apache.org


Mime
View raw message