james-server-dev mailing list archives

Site index · List index
Message view « Date » · « Thread »
Top « Date » · « Thread »
From Apache Jenkins Server <jenk...@builds.apache.org>
Subject Build failed in Jenkins: hupa-trunk #344
Date Thu, 12 Sep 2013 04:13:29 GMT
See <https://builds.apache.org/job/hupa-trunk/344/changes>

Changes:

[dongxu] beautify the multiuploader

[dongxu] ignore the cc or bcc addresses when they are hidden elements

[dongxu] make add operation buttons work according to the click events

[dongxu] add style for the choose file button

[dongxu] event register for compose activity, and try to update the version of gwtuploader
but found some exceptions

[dongxu] scrub code

[dongxu] fixed the requestfactory's quirk

[dongxu] coping with java.lang.IllegalArgumentException: uid

[dongxu] coping with reply and forward sending message

[dongxu] make attachments sending work as expected

[dongxu] add user label, yet issue46 occur

------------------------------------------
Started by an SCM change
Building remotely on ubuntu3 in workspace <https://builds.apache.org/job/hupa-trunk/ws/>
Updating http://svn.apache.org/repos/asf/james/hupa/trunk at revision '2013-09-12T04:13:27.092
+0000'
U         client/src/main/webapp/styles.css
U         client/src/main/java/org/apache/hupa/client/rf/HupaRequestFactory.java
D         client/src/main/java/org/apache/hupa/client/ui/ComposeHeaderView.ui.xml
D         client/src/main/java/org/apache/hupa/client/ui/ComposeContentView.ui.xml
D         client/src/main/java/org/apache/hupa/client/ui/ComposeStatusView.ui.xml
U         client/src/main/java/org/apache/hupa/client/ui/ComposeView.java
U         client/src/main/java/org/apache/hupa/client/ui/FoldersTreeViewModel.java
U         client/src/main/java/org/apache/hupa/client/ui/ComposeView.ui.xml
U         client/src/main/java/org/apache/hupa/client/ui/ToolBarView.java
U         client/src/main/java/org/apache/hupa/client/ui/MessageListView.java
U         client/src/main/java/org/apache/hupa/client/place/ComposePlace.java
U         client/src/main/java/org/apache/hupa/client/mapper/ComposeActivityMapper.java
U         client/src/main/java/org/apache/hupa/client/activity/ToolBarActivity.java
U         client/src/main/java/org/apache/hupa/client/activity/ComposeActivity.java
U         client/src/main/java/org/apache/hupa/client/activity/MessageContentActivity.java
U         client/src/main/java/org/apache/hupa/client/activity/TopBarActivity.java
U         client/src/main/java/org/apache/hupa/HupaProd.gwt.xml
U         server/src/main/java/org/apache/hupa/server/service/SendReplyMessageServiceImpl.java
U         server/src/main/java/org/apache/hupa/server/service/SendForwardMessageServiceImpl.java
U         shared/src/main/java/org/apache/hupa/shared/domain/SendForwardMessageAction.java
U         shared/src/main/java/org/apache/hupa/shared/data/SendForwardMessageActionImpl.java
At revision 1522312
Parsing POMs
ERROR: Failed to parse POMs
hudson.util.IOException2: remote file operation failed: <https://builds.apache.org/job/hupa-trunk/ws/trunk>
at hudson.remoting.Channel@c8a260d:ubuntu3
	at hudson.FilePath.act(FilePath.java:905)
	at hudson.FilePath.act(FilePath.java:882)
	at hudson.maven.MavenModuleSetBuild$MavenModuleSetBuildExecution.parsePoms(MavenModuleSetBuild.java:920)
	at hudson.maven.MavenModuleSetBuild$MavenModuleSetBuildExecution.doRun(MavenModuleSetBuild.java:652)
	at hudson.model.AbstractBuild$AbstractBuildExecution.run(AbstractBuild.java:567)
	at hudson.model.Run.execute(Run.java:1603)
	at hudson.maven.MavenModuleSetBuild.run(MavenModuleSetBuild.java:506)
	at hudson.model.ResourceController.execute(ResourceController.java:88)
	at hudson.model.Executor.run(Executor.java:246)
Caused by: hudson.remoting.ProxyException: hudson.maven.MavenModuleSetBuild$MavenExecutionException:
org.apache.maven.project.ProjectBuildingException: Some problems were encountered while processing
the POMs:
[FATAL] Non-parseable POM <https://builds.apache.org/job/hupa-trunk/ws/trunk/pom.xml>:
expected start tag name and not < (position: START_DOCUMENT seen ...overning permissions
and limitations\n    under the License.\n-->\n<<... @20:3)  @ line 20, column 3

	at hudson.maven.MavenModuleSetBuild$PomParser.invoke(MavenModuleSetBuild.java:1323)
	at hudson.maven.MavenModuleSetBuild$PomParser.invoke(MavenModuleSetBuild.java:1058)
	at hudson.FilePath$FileCallableWrapper.call(FilePath.java:2423)
	at hudson.remoting.UserRequest.perform(UserRequest.java:118)
	at hudson.remoting.UserRequest.perform(UserRequest.java:48)
	at hudson.remoting.Request$2.run(Request.java:326)
	at hudson.remoting.InterceptingExecutorService$1.call(InterceptingExecutorService.java:72)
	at java.util.concurrent.FutureTask$Sync.innerRun(FutureTask.java:334)
	at java.util.concurrent.FutureTask.run(FutureTask.java:166)
	at java.util.concurrent.ThreadPoolExecutor.runWorker(ThreadPoolExecutor.java:1146)
	at java.util.concurrent.ThreadPoolExecutor$Worker.run(ThreadPoolExecutor.java:615)
	at java.lang.Thread.run(Thread.java:679)
Caused by: hudson.remoting.ProxyException: org.apache.maven.project.ProjectBuildingException:
Some problems were encountered while processing the POMs:
[FATAL] Non-parseable POM <https://builds.apache.org/job/hupa-trunk/ws/trunk/pom.xml>:
expected start tag name and not < (position: START_DOCUMENT seen ...overning permissions
and limitations\n    under the License.\n-->\n<<... @20:3)  @ line 20, column 3

	at org.apache.maven.project.DefaultProjectBuilder.build(DefaultProjectBuilder.java:364)
	at hudson.maven.MavenEmbedder.buildProjects(MavenEmbedder.java:361)
	at hudson.maven.MavenEmbedder.readProjects(MavenEmbedder.java:331)
	at hudson.maven.MavenModuleSetBuild$PomParser.invoke(MavenModuleSetBuild.java:1260)
	... 11 more
Skipping Cobertura coverage report as build was not UNSTABLE or better ...

---------------------------------------------------------------------
To unsubscribe, e-mail: server-dev-unsubscribe@james.apache.org
For additional commands, e-mail: server-dev-help@james.apache.org


Mime
View raw message