james-server-dev mailing list archives

Site index · List index
Message view « Date » · « Thread »
Top « Date » · « Thread »
From Apache Jenkins Server <jenk...@builds.apache.org>
Subject Build failed in Jenkins: james-server-trunk » Apache James :: Server :: SMTP #4050
Date Sun, 29 Sep 2013 10:20:27 GMT
See <https://builds.apache.org/job/james-server-trunk/org.apache.james$james-server-protocols-smtp/4050/>

------------------------------------------
[...truncated 137 lines...]
Sep 29, 2013 10:17:29 AM org.apache.maven.cli.event.ExecutionEventLogger mojoStarted
INFO: 
Sep 29, 2013 10:17:29 AM org.apache.maven.cli.event.ExecutionEventLogger mojoStarted
INFO: --- maven-jar-plugin:2.4:jar (jar) @ james-server-protocols-smtp ---
Sep 29, 2013 10:17:30 AM org.apache.maven.cli.event.ExecutionEventLogger mojoStarted
INFO: 
Sep 29, 2013 10:17:30 AM org.apache.maven.cli.event.ExecutionEventLogger mojoStarted
INFO: --- maven-jar-plugin:2.4:test-jar (test-jar) @ james-server-protocols-smtp ---
[INFO] Building jar: <https://builds.apache.org/job/james-server-trunk/org.apache.james$james-server-protocols-smtp/ws/target/james-server-protocols-smtp-3.0.0-beta5-SNAPSHOT-tests.jar>
Sep 29, 2013 10:17:30 AM hudson.maven.ExecutedMojo <init>
WARNING: Failed to getClass for org.apache.maven.plugin.source.SourceJarMojo
Sep 29, 2013 10:17:30 AM org.apache.maven.cli.event.ExecutionEventLogger mojoStarted
INFO: 
Sep 29, 2013 10:17:30 AM org.apache.maven.cli.event.ExecutionEventLogger mojoStarted
INFO: --- maven-source-plugin:2.2.1:jar (attach-sources) @ james-server-protocols-smtp ---
[INFO] Building jar: <https://builds.apache.org/job/james-server-trunk/org.apache.james$james-server-protocols-smtp/ws/target/james-server-protocols-smtp-3.0.0-beta5-SNAPSHOT-sources.jar>
Sep 29, 2013 10:17:32 AM hudson.maven.ExecutedMojo <init>
WARNING: Failed to getClass for org.apache.maven.plugin.source.TestSourceJarMojo
Sep 29, 2013 10:17:32 AM org.apache.maven.cli.event.ExecutionEventLogger mojoStarted
INFO: 
Sep 29, 2013 10:17:32 AM org.apache.maven.cli.event.ExecutionEventLogger mojoStarted
INFO: --- maven-source-plugin:2.2.1:test-jar (attach-sources) @ james-server-protocols-smtp
---
[INFO] Building jar: <https://builds.apache.org/job/james-server-trunk/org.apache.james$james-server-protocols-smtp/ws/target/james-server-protocols-smtp-3.0.0-beta5-SNAPSHOT-test-sources.jar>
Sep 29, 2013 10:17:33 AM org.apache.maven.cli.event.ExecutionEventLogger mojoStarted
INFO: 
Sep 29, 2013 10:17:33 AM org.apache.maven.cli.event.ExecutionEventLogger mojoStarted
INFO: --- maven-site-plugin:3.2:attach-descriptor (attach-descriptor) @ james-server-protocols-smtp
---
Sep 29, 2013 10:17:33 AM org.apache.maven.cli.event.ExecutionEventLogger mojoStarted
INFO: 
Sep 29, 2013 10:17:33 AM org.apache.maven.cli.event.ExecutionEventLogger mojoStarted
INFO: --- maven-install-plugin:2.3.1:install (default-install) @ james-server-protocols-smtp
---
[INFO] Installing <https://builds.apache.org/job/james-server-trunk/org.apache.james$james-server-protocols-smtp/ws/target/james-server-protocols-smtp-3.0.0-beta5-SNAPSHOT.jar>
to /home/jenkins/jenkins-slave/maven-repositories/0/org/apache/james/james-server-protocols-smtp/3.0.0-beta5-SNAPSHOT/james-server-protocols-smtp-3.0.0-beta5-SNAPSHOT.jar
[INFO] Installing <https://builds.apache.org/job/james-server-trunk/org.apache.james$james-server-protocols-smtp/ws/pom.xml>
to /home/jenkins/jenkins-slave/maven-repositories/0/org/apache/james/james-server-protocols-smtp/3.0.0-beta5-SNAPSHOT/james-server-protocols-smtp-3.0.0-beta5-SNAPSHOT.pom
[INFO] Installing <https://builds.apache.org/job/james-server-trunk/org.apache.james$james-server-protocols-smtp/ws/target/james-server-protocols-smtp-3.0.0-beta5-SNAPSHOT-tests.jar>
to /home/jenkins/jenkins-slave/maven-repositories/0/org/apache/james/james-server-protocols-smtp/3.0.0-beta5-SNAPSHOT/james-server-protocols-smtp-3.0.0-beta5-SNAPSHOT-tests.jar
[INFO] Installing <https://builds.apache.org/job/james-server-trunk/org.apache.james$james-server-protocols-smtp/ws/target/james-server-protocols-smtp-3.0.0-beta5-SNAPSHOT-sources.jar>
to /home/jenkins/jenkins-slave/maven-repositories/0/org/apache/james/james-server-protocols-smtp/3.0.0-beta5-SNAPSHOT/james-server-protocols-smtp-3.0.0-beta5-SNAPSHOT-sources.jar
[INFO] Installing <https://builds.apache.org/job/james-server-trunk/org.apache.james$james-server-protocols-smtp/ws/target/james-server-protocols-smtp-3.0.0-beta5-SNAPSHOT-test-sources.jar>
to /home/jenkins/jenkins-slave/maven-repositories/0/org/apache/james/james-server-protocols-smtp/3.0.0-beta5-SNAPSHOT/james-server-protocols-smtp-3.0.0-beta5-SNAPSHOT-test-sources.jar
Sep 29, 2013 10:17:34 AM org.apache.maven.cli.event.ExecutionEventLogger mojoStarted
INFO: 
Sep 29, 2013 10:17:34 AM org.apache.maven.cli.event.ExecutionEventLogger mojoStarted
INFO: --- maven-bundle-plugin:2.3.7:install (default-install) @ james-server-protocols-smtp
---
[WARNING] Exception while updating local OBR: Unable to read repository xml: file:/home/jenkins/jenkins-slave/maven-repositories/0/repository.xml
org.apache.maven.plugin.MojoExecutionException: Unable to read repository xml: file:/home/jenkins/jenkins-slave/maven-repositories/0/repository.xml
	at org.apache.felix.obrplugin.ObrUpdate.parseRepositoryXml(ObrUpdate.java:324)
	at org.apache.felix.obrplugin.ObrInstall.execute(ObrInstall.java:141)
	at org.apache.maven.plugin.DefaultBuildPluginManager.executeMojo(DefaultBuildPluginManager.java:101)
	at org.apache.maven.lifecycle.internal.MojoExecutor.execute(MojoExecutor.java:209)
	at org.apache.maven.lifecycle.internal.MojoExecutor.execute(MojoExecutor.java:153)
	at org.apache.maven.lifecycle.internal.MojoExecutor.execute(MojoExecutor.java:145)
	at org.apache.maven.lifecycle.internal.LifecycleModuleBuilder.buildProject(LifecycleModuleBuilder.java:84)
	at org.apache.maven.lifecycle.internal.LifecycleModuleBuilder.buildProject(LifecycleModuleBuilder.java:59)
	at org.apache.maven.lifecycle.internal.LifecycleStarter.singleThreadedBuild(LifecycleStarter.java:183)
	at org.apache.maven.lifecycle.internal.LifecycleStarter.execute(LifecycleStarter.java:161)
	at org.apache.maven.DefaultMaven.doExecute(DefaultMaven.java:320)
	at org.apache.maven.DefaultMaven.execute(DefaultMaven.java:156)
	at org.jvnet.hudson.maven3.launcher.Maven3Launcher.main(Maven3Launcher.java:117)
	at sun.reflect.NativeMethodAccessorImpl.invoke0(Native Method)
	at sun.reflect.NativeMethodAccessorImpl.invoke(NativeMethodAccessorImpl.java:57)
	at sun.reflect.DelegatingMethodAccessorImpl.invoke(DelegatingMethodAccessorImpl.java:43)
	at java.lang.reflect.Method.invoke(Method.java:616)
	at org.codehaus.plexus.classworlds.launcher.Launcher.launchStandard(Launcher.java:329)
	at org.codehaus.plexus.classworlds.launcher.Launcher.launch(Launcher.java:239)
	at org.jvnet.hudson.maven3.agent.Maven3Main.launch(Maven3Main.java:178)
	at sun.reflect.NativeMethodAccessorImpl.invoke0(Native Method)
	at sun.reflect.NativeMethodAccessorImpl.invoke(NativeMethodAccessorImpl.java:57)
	at sun.reflect.DelegatingMethodAccessorImpl.invoke(DelegatingMethodAccessorImpl.java:43)
	at java.lang.reflect.Method.invoke(Method.java:616)
	at hudson.maven.Maven3Builder.call(Maven3Builder.java:130)
	at hudson.maven.Maven3Builder.call(Maven3Builder.java:67)
	at hudson.remoting.UserRequest.perform(UserRequest.java:118)
	at hudson.remoting.UserRequest.perform(UserRequest.java:48)
	at hudson.remoting.Request$2.run(Request.java:326)
	at hudson.remoting.InterceptingExecutorService$1.call(InterceptingExecutorService.java:72)
	at java.util.concurrent.FutureTask$Sync.innerRun(FutureTask.java:334)
	at java.util.concurrent.FutureTask.run(FutureTask.java:166)
	at java.util.concurrent.ThreadPoolExecutor.runWorker(ThreadPoolExecutor.java:1146)
	at java.util.concurrent.ThreadPoolExecutor$Worker.run(ThreadPoolExecutor.java:615)
	at java.lang.Thread.run(Thread.java:679)
Caused by: org.xmlpull.v1.XmlPullParserException: unexpected type (position:END_DOCUMENT null@3:1
in java.io.InputStreamReader@18e14cd1) 
	at org.kxml2.io.KXmlParser.exception(Unknown Source)
	at org.kxml2.io.KXmlParser.nextTag(Unknown Source)
	at org.apache.felix.bundlerepository.impl.PullParser.parseRepository(PullParser.java:43)
	at org.apache.felix.bundlerepository.impl.DataModelHelperImpl.repository(DataModelHelperImpl.java:147)
	at org.apache.felix.bundlerepository.impl.DataModelHelperImpl.repository(DataModelHelperImpl.java:118)
	at org.apache.felix.obrplugin.ObrUpdate.parseRepositoryXml(ObrUpdate.java:316)
	... 34 more
Sep 29, 2013 10:17:34 AM org.apache.maven.cli.event.ExecutionEventLogger mojoStarted
INFO: 
Sep 29, 2013 10:17:34 AM org.apache.maven.cli.event.ExecutionEventLogger mojoStarted
INFO: --- maven-remote-resources-plugin:1.4:process (default) @ james-server-protocols-smtp
---
Sep 29, 2013 10:17:34 AM org.apache.maven.cli.event.ExecutionEventLogger mojoStarted
INFO: 
Sep 29, 2013 10:17:34 AM org.apache.maven.cli.event.ExecutionEventLogger mojoStarted
INFO: --- maven-resources-plugin:2.6:resources (default-resources) @ james-server-protocols-smtp
---
[INFO] Using 'UTF-8' encoding to copy filtered resources.
[INFO] Copying 3 resources
[INFO] Copying 3 resources
[INFO] Copying 3 resources
Sep 29, 2013 10:17:34 AM org.apache.maven.cli.event.ExecutionEventLogger mojoStarted
INFO: 
Sep 29, 2013 10:17:34 AM org.apache.maven.cli.event.ExecutionEventLogger mojoStarted
INFO: --- maven-compiler-plugin:3.0:compile (default-compile) @ james-server-protocols-smtp
---
[INFO] Changes detected - recompiling the module!
[INFO] Compiling 49 source files to <https://builds.apache.org/job/james-server-trunk/org.apache.james$james-server-protocols-smtp/ws/target/classes>
[WARNING] <https://builds.apache.org/job/james-server-trunk/org.apache.james$james-server-protocols-smtp/ws/src/main/java/org/apache/james/smtpserver/DataLineJamesMessageHookHandler.java>:
Some input files use unchecked or unsafe operations.
[WARNING] <https://builds.apache.org/job/james-server-trunk/org.apache.james$james-server-protocols-smtp/ws/src/main/java/org/apache/james/smtpserver/DataLineJamesMessageHookHandler.java>:
Recompile with -Xlint:unchecked for details.
Sep 29, 2013 10:17:34 AM org.apache.maven.cli.event.ExecutionEventLogger mojoStarted
INFO: 
Sep 29, 2013 10:17:34 AM org.apache.maven.cli.event.ExecutionEventLogger mojoStarted
INFO: --- maven-resources-plugin:2.6:testResources (default-testResources) @ james-server-protocols-smtp
---
[INFO] Using 'UTF-8' encoding to copy filtered resources.
[INFO] Copying 1 resource
[INFO] Copying 3 resources
[INFO] Copying 3 resources
Sep 29, 2013 10:17:35 AM org.apache.maven.cli.event.ExecutionEventLogger mojoStarted
INFO: 
Sep 29, 2013 10:17:35 AM org.apache.maven.cli.event.ExecutionEventLogger mojoStarted
INFO: --- maven-compiler-plugin:3.0:testCompile (default-testCompile) @ james-server-protocols-smtp
---
[INFO] Changes detected - recompiling the module!
[INFO] Compiling 18 source files to <https://builds.apache.org/job/james-server-trunk/org.apache.james$james-server-protocols-smtp/ws/target/test-classes>
[WARNING] <https://builds.apache.org/job/james-server-trunk/org.apache.james$james-server-protocols-smtp/ws/src/test/java/org/apache/james/smtpserver/SMTPServerTest.java>:
Some input files use or override a deprecated API.
[WARNING] <https://builds.apache.org/job/james-server-trunk/org.apache.james$james-server-protocols-smtp/ws/src/test/java/org/apache/james/smtpserver/SMTPServerTest.java>:
Recompile with -Xlint:deprecation for details.
[WARNING] <https://builds.apache.org/job/james-server-trunk/org.apache.james$james-server-protocols-smtp/ws/src/test/java/org/apache/james/smtpserver/ValidRcptMXTest.java>:
Some input files use unchecked or unsafe operations.
[WARNING] <https://builds.apache.org/job/james-server-trunk/org.apache.james$james-server-protocols-smtp/ws/src/test/java/org/apache/james/smtpserver/ValidRcptMXTest.java>:
Recompile with -Xlint:unchecked for details.
Sep 29, 2013 10:17:35 AM org.apache.maven.cli.event.ExecutionEventLogger mojoStarted
INFO: 
Sep 29, 2013 10:17:35 AM org.apache.maven.cli.event.ExecutionEventLogger mojoStarted
INFO: --- maven-surefire-plugin:2.13:test (default-test) @ james-server-protocols-smtp ---
[INFO] Skipping execution of surefire because it has already been run for this configuration
[JENKINS] Recording test resultsSep 29, 2013 10:17:35 AM org.apache.maven.cli.event.ExecutionEventLogger
mojoStarted
INFO: 
Sep 29, 2013 10:17:35 AM org.apache.maven.cli.event.ExecutionEventLogger mojoStarted
INFO: --- maven-bundle-plugin:2.3.7:bundle (default-bundle) @ james-server-protocols-smtp
---

Sep 29, 2013 10:17:35 AM org.apache.maven.cli.event.ExecutionEventLogger mojoStarted
INFO: 
Sep 29, 2013 10:17:35 AM org.apache.maven.cli.event.ExecutionEventLogger mojoStarted
INFO: --- maven-jar-plugin:2.4:jar (jar) @ james-server-protocols-smtp ---
Sep 29, 2013 10:17:36 AM org.apache.maven.cli.event.ExecutionEventLogger mojoStarted
INFO: 
Sep 29, 2013 10:17:36 AM org.apache.maven.cli.event.ExecutionEventLogger mojoStarted
INFO: --- maven-jar-plugin:2.4:test-jar (test-jar) @ james-server-protocols-smtp ---
[INFO] Building jar: <https://builds.apache.org/job/james-server-trunk/org.apache.james$james-server-protocols-smtp/ws/target/james-server-protocols-smtp-3.0.0-beta5-SNAPSHOT-tests.jar>
[WARNING] Artifact org.apache.james:james-server-protocols-smtp:test-jar:tests:3.0.0-beta5-SNAPSHOT
already attached to project, ignoring duplicate
Sep 29, 2013 10:17:37 AM hudson.maven.ExecutedMojo <init>
WARNING: Failed to getClass for org.apache.maven.plugin.source.SourceJarMojo
Sep 29, 2013 10:17:37 AM org.apache.maven.cli.event.ExecutionEventLogger mojoStarted
INFO: 
Sep 29, 2013 10:17:37 AM org.apache.maven.cli.event.ExecutionEventLogger mojoStarted
INFO: --- maven-source-plugin:2.2.1:jar (attach-sources) @ james-server-protocols-smtp ---
[INFO] Building jar: <https://builds.apache.org/job/james-server-trunk/org.apache.james$james-server-protocols-smtp/ws/target/james-server-protocols-smtp-3.0.0-beta5-SNAPSHOT-sources.jar>
[WARNING] Artifact org.apache.james:james-server-protocols-smtp:java-source:sources:3.0.0-beta5-SNAPSHOT
already attached to project, ignoring duplicate
Sep 29, 2013 10:17:39 AM hudson.maven.ExecutedMojo <init>
WARNING: Failed to getClass for org.apache.maven.plugin.source.TestSourceJarMojo
Sep 29, 2013 10:17:39 AM org.apache.maven.cli.event.ExecutionEventLogger mojoStarted
INFO: 
Sep 29, 2013 10:17:39 AM org.apache.maven.cli.event.ExecutionEventLogger mojoStarted
INFO: --- maven-source-plugin:2.2.1:test-jar (attach-sources) @ james-server-protocols-smtp
---
[INFO] Building jar: <https://builds.apache.org/job/james-server-trunk/org.apache.james$james-server-protocols-smtp/ws/target/james-server-protocols-smtp-3.0.0-beta5-SNAPSHOT-test-sources.jar>
[WARNING] Artifact org.apache.james:james-server-protocols-smtp:java-source:test-sources:3.0.0-beta5-SNAPSHOT
already attached to project, ignoring duplicate
Sep 29, 2013 10:17:41 AM org.apache.maven.cli.event.ExecutionEventLogger mojoStarted
INFO: 
Sep 29, 2013 10:17:41 AM org.apache.maven.cli.event.ExecutionEventLogger mojoStarted
INFO: --- maven-site-plugin:3.2:attach-descriptor (attach-descriptor) @ james-server-protocols-smtp
---
Sep 29, 2013 10:17:41 AM org.apache.maven.cli.event.ExecutionEventLogger mojoStarted
INFO: 
Sep 29, 2013 10:17:41 AM org.apache.maven.cli.event.ExecutionEventLogger mojoStarted
INFO: --- maven-install-plugin:2.3.1:install (default-install) @ james-server-protocols-smtp
---
[INFO] Installing <https://builds.apache.org/job/james-server-trunk/org.apache.james$james-server-protocols-smtp/ws/target/james-server-protocols-smtp-3.0.0-beta5-SNAPSHOT.jar>
to /home/jenkins/jenkins-slave/maven-repositories/0/org/apache/james/james-server-protocols-smtp/3.0.0-beta5-SNAPSHOT/james-server-protocols-smtp-3.0.0-beta5-SNAPSHOT.jar
[INFO] Installing <https://builds.apache.org/job/james-server-trunk/org.apache.james$james-server-protocols-smtp/ws/pom.xml>
to /home/jenkins/jenkins-slave/maven-repositories/0/org/apache/james/james-server-protocols-smtp/3.0.0-beta5-SNAPSHOT/james-server-protocols-smtp-3.0.0-beta5-SNAPSHOT.pom
[INFO] Installing <https://builds.apache.org/job/james-server-trunk/org.apache.james$james-server-protocols-smtp/ws/target/james-server-protocols-smtp-3.0.0-beta5-SNAPSHOT-tests.jar>
to /home/jenkins/jenkins-slave/maven-repositories/0/org/apache/james/james-server-protocols-smtp/3.0.0-beta5-SNAPSHOT/james-server-protocols-smtp-3.0.0-beta5-SNAPSHOT-tests.jar
[INFO] Installing <https://builds.apache.org/job/james-server-trunk/org.apache.james$james-server-protocols-smtp/ws/target/james-server-protocols-smtp-3.0.0-beta5-SNAPSHOT-sources.jar>
to /home/jenkins/jenkins-slave/maven-repositories/0/org/apache/james/james-server-protocols-smtp/3.0.0-beta5-SNAPSHOT/james-server-protocols-smtp-3.0.0-beta5-SNAPSHOT-sources.jar
[INFO] Installing <https://builds.apache.org/job/james-server-trunk/org.apache.james$james-server-protocols-smtp/ws/target/james-server-protocols-smtp-3.0.0-beta5-SNAPSHOT-test-sources.jar>
to /home/jenkins/jenkins-slave/maven-repositories/0/org/apache/james/james-server-protocols-smtp/3.0.0-beta5-SNAPSHOT/james-server-protocols-smtp-3.0.0-beta5-SNAPSHOT-test-sources.jar
Sep 29, 2013 10:17:41 AM org.apache.maven.cli.event.ExecutionEventLogger mojoStarted
INFO: 
Sep 29, 2013 10:17:41 AM org.apache.maven.cli.event.ExecutionEventLogger mojoStarted
INFO: --- maven-bundle-plugin:2.3.7:install (default-install) @ james-server-protocols-smtp
---
[WARNING] Exception while updating local OBR: Unable to read repository xml: file:/home/jenkins/jenkins-slave/maven-repositories/0/repository.xml
org.apache.maven.plugin.MojoExecutionException: Unable to read repository xml: file:/home/jenkins/jenkins-slave/maven-repositories/0/repository.xml
	at org.apache.felix.obrplugin.ObrUpdate.parseRepositoryXml(ObrUpdate.java:324)
	at org.apache.felix.obrplugin.ObrInstall.execute(ObrInstall.java:141)
	at org.apache.maven.plugin.DefaultBuildPluginManager.executeMojo(DefaultBuildPluginManager.java:101)
	at org.apache.maven.lifecycle.internal.MojoExecutor.execute(MojoExecutor.java:209)
	at org.apache.maven.lifecycle.internal.MojoExecutor.execute(MojoExecutor.java:153)
	at org.apache.maven.lifecycle.internal.MojoExecutor.execute(MojoExecutor.java:145)
	at org.apache.maven.lifecycle.internal.LifecycleModuleBuilder.buildProject(LifecycleModuleBuilder.java:84)
	at org.apache.maven.lifecycle.internal.LifecycleModuleBuilder.buildProject(LifecycleModuleBuilder.java:59)
	at org.apache.maven.lifecycle.internal.LifecycleStarter.singleThreadedBuild(LifecycleStarter.java:183)
	at org.apache.maven.lifecycle.internal.LifecycleStarter.execute(LifecycleStarter.java:161)
	at org.apache.maven.DefaultMaven.doExecute(DefaultMaven.java:320)
	at org.apache.maven.DefaultMaven.execute(DefaultMaven.java:156)
	at org.jvnet.hudson.maven3.launcher.Maven3Launcher.main(Maven3Launcher.java:117)
	at sun.reflect.NativeMethodAccessorImpl.invoke0(Native Method)
	at sun.reflect.NativeMethodAccessorImpl.invoke(NativeMethodAccessorImpl.java:57)
	at sun.reflect.DelegatingMethodAccessorImpl.invoke(DelegatingMethodAccessorImpl.java:43)
	at java.lang.reflect.Method.invoke(Method.java:616)
	at org.codehaus.plexus.classworlds.launcher.Launcher.launchStandard(Launcher.java:329)
	at org.codehaus.plexus.classworlds.launcher.Launcher.launch(Launcher.java:239)
	at org.jvnet.hudson.maven3.agent.Maven3Main.launch(Maven3Main.java:178)
	at sun.reflect.NativeMethodAccessorImpl.invoke0(Native Method)
	at sun.reflect.NativeMethodAccessorImpl.invoke(NativeMethodAccessorImpl.java:57)
	at sun.reflect.DelegatingMethodAccessorImpl.invoke(DelegatingMethodAccessorImpl.java:43)
	at java.lang.reflect.Method.invoke(Method.java:616)
	at hudson.maven.Maven3Builder.call(Maven3Builder.java:130)
	at hudson.maven.Maven3Builder.call(Maven3Builder.java:67)
	at hudson.remoting.UserRequest.perform(UserRequest.java:118)
	at hudson.remoting.UserRequest.perform(UserRequest.java:48)
	at hudson.remoting.Request$2.run(Request.java:326)
	at hudson.remoting.InterceptingExecutorService$1.call(InterceptingExecutorService.java:72)
	at java.util.concurrent.FutureTask$Sync.innerRun(FutureTask.java:334)
	at java.util.concurrent.FutureTask.run(FutureTask.java:166)
	at java.util.concurrent.ThreadPoolExecutor.runWorker(ThreadPoolExecutor.java:1146)
	at java.util.concurrent.ThreadPoolExecutor$Worker.run(ThreadPoolExecutor.java:615)
	at java.lang.Thread.run(Thread.java:679)
Caused by: org.xmlpull.v1.XmlPullParserException: unexpected type (position:END_DOCUMENT null@3:1
in java.io.InputStreamReader@6628b2b9) 
	at org.kxml2.io.KXmlParser.exception(Unknown Source)
	at org.kxml2.io.KXmlParser.nextTag(Unknown Source)
	at org.apache.felix.bundlerepository.impl.PullParser.parseRepository(PullParser.java:43)
	at org.apache.felix.bundlerepository.impl.DataModelHelperImpl.repository(DataModelHelperImpl.java:147)
	at org.apache.felix.bundlerepository.impl.DataModelHelperImpl.repository(DataModelHelperImpl.java:118)
	at org.apache.felix.obrplugin.ObrUpdate.parseRepositoryXml(ObrUpdate.java:316)
	... 34 more
Sep 29, 2013 10:17:41 AM org.apache.maven.cli.event.ExecutionEventLogger mojoStarted
INFO: 
Sep 29, 2013 10:17:41 AM org.apache.maven.cli.event.ExecutionEventLogger mojoStarted
INFO: --- maven-deploy-plugin:2.7:deploy (default-deploy) @ james-server-protocols-smtp ---
Downloading: https://repository.apache.org/content/repositories/snapshots/org/apache/james/james-server-protocols-smtp/3.0.0-beta5-SNAPSHOT/maven-metadata.xml
Downloaded: https://repository.apache.org/content/repositories/snapshots/org/apache/james/james-server-protocols-smtp/3.0.0-beta5-SNAPSHOT/maven-metadata.xml
(2 KB at 2.5 KB/sec)
Uploading: https://repository.apache.org/content/repositories/snapshots/org/apache/james/james-server-protocols-smtp/3.0.0-beta5-SNAPSHOT/james-server-protocols-smtp-3.0.0-beta5-20130929.101742-242.jar
Uploaded: https://repository.apache.org/content/repositories/snapshots/org/apache/james/james-server-protocols-smtp/3.0.0-beta5-SNAPSHOT/james-server-protocols-smtp-3.0.0-beta5-20130929.101742-242.jar
(101 KB at 241.4 KB/sec)
Uploading: https://repository.apache.org/content/repositories/snapshots/org/apache/james/james-server-protocols-smtp/3.0.0-beta5-SNAPSHOT/james-server-protocols-smtp-3.0.0-beta5-20130929.101742-242.pom
Uploaded: https://repository.apache.org/content/repositories/snapshots/org/apache/james/james-server-protocols-smtp/3.0.0-beta5-SNAPSHOT/james-server-protocols-smtp-3.0.0-beta5-20130929.101742-242.pom
(8 KB at 22.2 KB/sec)
Downloading: https://repository.apache.org/content/repositories/snapshots/org/apache/james/james-server-protocols-smtp/maven-metadata.xml
Downloaded: https://repository.apache.org/content/repositories/snapshots/org/apache/james/james-server-protocols-smtp/maven-metadata.xml
(375 B at 1.2 KB/sec)
Uploading: https://repository.apache.org/content/repositories/snapshots/org/apache/james/james-server-protocols-smtp/3.0.0-beta5-SNAPSHOT/maven-metadata.xml
Uploaded: https://repository.apache.org/content/repositories/snapshots/org/apache/james/james-server-protocols-smtp/3.0.0-beta5-SNAPSHOT/maven-metadata.xml
(2 KB at 5.0 KB/sec)
Uploading: https://repository.apache.org/content/repositories/snapshots/org/apache/james/james-server-protocols-smtp/maven-metadata.xml
Uploaded: https://repository.apache.org/content/repositories/snapshots/org/apache/james/james-server-protocols-smtp/maven-metadata.xml
(375 B at 1.0 KB/sec)
Uploading: https://repository.apache.org/content/repositories/snapshots/org/apache/james/james-server-protocols-smtp/3.0.0-beta5-SNAPSHOT/james-server-protocols-smtp-3.0.0-beta5-20130929.101742-242-tests.jar
Uploaded: https://repository.apache.org/content/repositories/snapshots/org/apache/james/james-server-protocols-smtp/3.0.0-beta5-SNAPSHOT/james-server-protocols-smtp-3.0.0-beta5-20130929.101742-242-tests.jar
(69 KB at 174.1 KB/sec)
Uploading: https://repository.apache.org/content/repositories/snapshots/org/apache/james/james-server-protocols-smtp/3.0.0-beta5-SNAPSHOT/maven-metadata.xml
Uploaded: https://repository.apache.org/content/repositories/snapshots/org/apache/james/james-server-protocols-smtp/3.0.0-beta5-SNAPSHOT/maven-metadata.xml
(2 KB at 4.5 KB/sec)
Uploading: https://repository.apache.org/content/repositories/snapshots/org/apache/james/james-server-protocols-smtp/3.0.0-beta5-SNAPSHOT/james-server-protocols-smtp-3.0.0-beta5-20130929.101742-242-sources.jar
Uploaded: https://repository.apache.org/content/repositories/snapshots/org/apache/james/james-server-protocols-smtp/3.0.0-beta5-SNAPSHOT/james-server-protocols-smtp-3.0.0-beta5-20130929.101742-242-sources.jar
(82 KB at 189.1 KB/sec)
Uploading: https://repository.apache.org/content/repositories/snapshots/org/apache/james/james-server-protocols-smtp/3.0.0-beta5-SNAPSHOT/maven-metadata.xml
Uploaded: https://repository.apache.org/content/repositories/snapshots/org/apache/james/james-server-protocols-smtp/3.0.0-beta5-SNAPSHOT/maven-metadata.xml
(2 KB at 4.4 KB/sec)
Uploading: https://repository.apache.org/content/repositories/snapshots/org/apache/james/james-server-protocols-smtp/3.0.0-beta5-SNAPSHOT/james-server-protocols-smtp-3.0.0-beta5-20130929.101742-242-test-sources.jar
Uploaded: https://repository.apache.org/content/repositories/snapshots/org/apache/james/james-server-protocols-smtp/3.0.0-beta5-SNAPSHOT/james-server-protocols-smtp-3.0.0-beta5-20130929.101742-242-test-sources.jar
(42 KB at 109.5 KB/sec)
Uploading: https://repository.apache.org/content/repositories/snapshots/org/apache/james/james-server-protocols-smtp/3.0.0-beta5-SNAPSHOT/maven-metadata.xml
Uploaded: https://repository.apache.org/content/repositories/snapshots/org/apache/james/james-server-protocols-smtp/3.0.0-beta5-SNAPSHOT/maven-metadata.xml
(2 KB at 4.6 KB/sec)

---------------------------------------------------------------------
To unsubscribe, e-mail: server-dev-unsubscribe@james.apache.org
For additional commands, e-mail: server-dev-help@james.apache.org


Mime
View raw message