james-server-dev mailing list archives

Site index · List index
Message view « Date » · « Thread »
Top « Date » · « Thread »
From Apache Jenkins Server <jenk...@builds.apache.org>
Subject Build failed in Jenkins: james-server-trunk » Apache James :: Server :: Protocols Library #4055
Date Wed, 02 Oct 2013 04:46:00 GMT
See <https://builds.apache.org/job/james-server-trunk/org.apache.james$james-server-protocols-library/4055/>

------------------------------------------
[...truncated 57 lines...]
Oct 2, 2013 4:39:49 AM org.apache.maven.cli.event.ExecutionEventLogger mojoStarted
INFO: 
Oct 2, 2013 4:39:49 AM org.apache.maven.cli.event.ExecutionEventLogger mojoStarted
INFO: --- maven-jar-plugin:2.4:test-jar (test-jar) @ james-server-protocols-library ---
[INFO] Building jar: <https://builds.apache.org/job/james-server-trunk/org.apache.james$james-server-protocols-library/ws/target/james-server-protocols-library-3.0.0-beta5-SNAPSHOT-tests.jar>
Oct 2, 2013 4:39:49 AM org.apache.maven.cli.event.ExecutionEventLogger mojoStarted
INFO: 
Oct 2, 2013 4:39:49 AM org.apache.maven.cli.event.ExecutionEventLogger mojoStarted
INFO: --- maven-jar-plugin:2.4:test-jar (default) @ james-server-protocols-library ---
[WARNING] Artifact org.apache.james:james-server-protocols-library:test-jar:tests:3.0.0-beta5-SNAPSHOT
already attached to project, ignoring duplicate
Oct 2, 2013 4:39:50 AM hudson.maven.ExecutedMojo <init>
WARNING: Failed to getClass for org.apache.maven.plugin.source.SourceJarMojo
Oct 2, 2013 4:39:50 AM org.apache.maven.cli.event.ExecutionEventLogger mojoStarted
INFO: 
Oct 2, 2013 4:39:50 AM org.apache.maven.cli.event.ExecutionEventLogger mojoStarted
INFO: --- maven-source-plugin:2.2.1:jar (attach-sources) @ james-server-protocols-library
---
[INFO] Building jar: <https://builds.apache.org/job/james-server-trunk/org.apache.james$james-server-protocols-library/ws/target/james-server-protocols-library-3.0.0-beta5-SNAPSHOT-sources.jar>
Oct 2, 2013 4:39:52 AM hudson.maven.ExecutedMojo <init>
WARNING: Failed to getClass for org.apache.maven.plugin.source.TestSourceJarMojo
Oct 2, 2013 4:39:52 AM org.apache.maven.cli.event.ExecutionEventLogger mojoStarted
INFO: 
Oct 2, 2013 4:39:52 AM org.apache.maven.cli.event.ExecutionEventLogger mojoStarted
INFO: --- maven-source-plugin:2.2.1:test-jar (attach-sources) @ james-server-protocols-library
---
[INFO] Building jar: <https://builds.apache.org/job/james-server-trunk/org.apache.james$james-server-protocols-library/ws/target/james-server-protocols-library-3.0.0-beta5-SNAPSHOT-test-sources.jar>
Oct 2, 2013 4:39:53 AM org.apache.maven.cli.event.ExecutionEventLogger mojoStarted
INFO: 
Oct 2, 2013 4:39:53 AM org.apache.maven.cli.event.ExecutionEventLogger mojoStarted
INFO: --- maven-site-plugin:3.2:attach-descriptor (attach-descriptor) @ james-server-protocols-library
---
Oct 2, 2013 4:39:53 AM org.apache.maven.cli.event.ExecutionEventLogger mojoStarted
INFO: 
Oct 2, 2013 4:39:53 AM org.apache.maven.cli.event.ExecutionEventLogger mojoStarted
INFO: --- maven-install-plugin:2.3.1:install (default-install) @ james-server-protocols-library
---
[INFO] Installing <https://builds.apache.org/job/james-server-trunk/org.apache.james$james-server-protocols-library/ws/target/james-server-protocols-library-3.0.0-beta5-SNAPSHOT.jar>
to /home/jenkins/jenkins-slave/maven-repositories/1/org/apache/james/james-server-protocols-library/3.0.0-beta5-SNAPSHOT/james-server-protocols-library-3.0.0-beta5-SNAPSHOT.jar
[INFO] Installing <https://builds.apache.org/job/james-server-trunk/org.apache.james$james-server-protocols-library/ws/pom.xml>
to /home/jenkins/jenkins-slave/maven-repositories/1/org/apache/james/james-server-protocols-library/3.0.0-beta5-SNAPSHOT/james-server-protocols-library-3.0.0-beta5-SNAPSHOT.pom
[INFO] Installing <https://builds.apache.org/job/james-server-trunk/org.apache.james$james-server-protocols-library/ws/target/james-server-protocols-library-3.0.0-beta5-SNAPSHOT-tests.jar>
to /home/jenkins/jenkins-slave/maven-repositories/1/org/apache/james/james-server-protocols-library/3.0.0-beta5-SNAPSHOT/james-server-protocols-library-3.0.0-beta5-SNAPSHOT-tests.jar
[INFO] Installing <https://builds.apache.org/job/james-server-trunk/org.apache.james$james-server-protocols-library/ws/target/james-server-protocols-library-3.0.0-beta5-SNAPSHOT-sources.jar>
to /home/jenkins/jenkins-slave/maven-repositories/1/org/apache/james/james-server-protocols-library/3.0.0-beta5-SNAPSHOT/james-server-protocols-library-3.0.0-beta5-SNAPSHOT-sources.jar
[INFO] Installing <https://builds.apache.org/job/james-server-trunk/org.apache.james$james-server-protocols-library/ws/target/james-server-protocols-library-3.0.0-beta5-SNAPSHOT-test-sources.jar>
to /home/jenkins/jenkins-slave/maven-repositories/1/org/apache/james/james-server-protocols-library/3.0.0-beta5-SNAPSHOT/james-server-protocols-library-3.0.0-beta5-SNAPSHOT-test-sources.jar
Oct 2, 2013 4:39:53 AM org.apache.maven.cli.event.ExecutionEventLogger mojoStarted
INFO: 
Oct 2, 2013 4:39:53 AM org.apache.maven.cli.event.ExecutionEventLogger mojoStarted
INFO: --- maven-bundle-plugin:2.3.7:install (default-install) @ james-server-protocols-library
---
[WARNING] Exception while updating local OBR: Unable to read repository xml: file:/home/jenkins/jenkins-slave/maven-repositories/1/repository.xml
org.apache.maven.plugin.MojoExecutionException: Unable to read repository xml: file:/home/jenkins/jenkins-slave/maven-repositories/1/repository.xml
	at org.apache.felix.obrplugin.ObrUpdate.parseRepositoryXml(ObrUpdate.java:324)
	at org.apache.felix.obrplugin.ObrInstall.execute(ObrInstall.java:141)
	at org.apache.maven.plugin.DefaultBuildPluginManager.executeMojo(DefaultBuildPluginManager.java:101)
	at org.apache.maven.lifecycle.internal.MojoExecutor.execute(MojoExecutor.java:209)
	at org.apache.maven.lifecycle.internal.MojoExecutor.execute(MojoExecutor.java:153)
	at org.apache.maven.lifecycle.internal.MojoExecutor.execute(MojoExecutor.java:145)
	at org.apache.maven.lifecycle.internal.LifecycleModuleBuilder.buildProject(LifecycleModuleBuilder.java:84)
	at org.apache.maven.lifecycle.internal.LifecycleModuleBuilder.buildProject(LifecycleModuleBuilder.java:59)
	at org.apache.maven.lifecycle.internal.LifecycleStarter.singleThreadedBuild(LifecycleStarter.java:183)
	at org.apache.maven.lifecycle.internal.LifecycleStarter.execute(LifecycleStarter.java:161)
	at org.apache.maven.DefaultMaven.doExecute(DefaultMaven.java:320)
	at org.apache.maven.DefaultMaven.execute(DefaultMaven.java:156)
	at org.jvnet.hudson.maven3.launcher.Maven3Launcher.main(Maven3Launcher.java:117)
	at sun.reflect.NativeMethodAccessorImpl.invoke0(Native Method)
	at sun.reflect.NativeMethodAccessorImpl.invoke(NativeMethodAccessorImpl.java:57)
	at sun.reflect.DelegatingMethodAccessorImpl.invoke(DelegatingMethodAccessorImpl.java:43)
	at java.lang.reflect.Method.invoke(Method.java:616)
	at org.codehaus.plexus.classworlds.launcher.Launcher.launchStandard(Launcher.java:329)
	at org.codehaus.plexus.classworlds.launcher.Launcher.launch(Launcher.java:239)
	at org.jvnet.hudson.maven3.agent.Maven3Main.launch(Maven3Main.java:178)
	at sun.reflect.NativeMethodAccessorImpl.invoke0(Native Method)
	at sun.reflect.NativeMethodAccessorImpl.invoke(NativeMethodAccessorImpl.java:57)
	at sun.reflect.DelegatingMethodAccessorImpl.invoke(DelegatingMethodAccessorImpl.java:43)
	at java.lang.reflect.Method.invoke(Method.java:616)
	at hudson.maven.Maven3Builder.call(Maven3Builder.java:130)
	at hudson.maven.Maven3Builder.call(Maven3Builder.java:67)
	at hudson.remoting.UserRequest.perform(UserRequest.java:118)
	at hudson.remoting.UserRequest.perform(UserRequest.java:48)
	at hudson.remoting.Request$2.run(Request.java:326)
	at hudson.remoting.InterceptingExecutorService$1.call(InterceptingExecutorService.java:72)
	at java.util.concurrent.FutureTask$Sync.innerRun(FutureTask.java:334)
	at java.util.concurrent.FutureTask.run(FutureTask.java:166)
	at java.util.concurrent.ThreadPoolExecutor.runWorker(ThreadPoolExecutor.java:1146)
	at java.util.concurrent.ThreadPoolExecutor$Worker.run(ThreadPoolExecutor.java:615)
	at java.lang.Thread.run(Thread.java:679)
Caused by: org.xmlpull.v1.XmlPullParserException: unexpected type (position:END_DOCUMENT null@3:1
in java.io.InputStreamReader@3da6c232) 
	at org.kxml2.io.KXmlParser.exception(Unknown Source)
	at org.kxml2.io.KXmlParser.nextTag(Unknown Source)
	at org.apache.felix.bundlerepository.impl.PullParser.parseRepository(PullParser.java:43)
	at org.apache.felix.bundlerepository.impl.DataModelHelperImpl.repository(DataModelHelperImpl.java:147)
	at org.apache.felix.bundlerepository.impl.DataModelHelperImpl.repository(DataModelHelperImpl.java:118)
	at org.apache.felix.obrplugin.ObrUpdate.parseRepositoryXml(ObrUpdate.java:316)
	... 34 more
Oct 2, 2013 4:39:54 AM org.apache.maven.cli.event.ExecutionEventLogger mojoStarted
INFO: 
Oct 2, 2013 4:39:54 AM org.apache.maven.cli.event.ExecutionEventLogger mojoStarted
INFO: --- maven-remote-resources-plugin:1.4:process (default) @ james-server-protocols-library
---
Oct 2, 2013 4:39:54 AM org.apache.maven.cli.event.ExecutionEventLogger mojoStarted
INFO: 
Oct 2, 2013 4:39:54 AM org.apache.maven.cli.event.ExecutionEventLogger mojoStarted
INFO: --- maven-resources-plugin:2.6:resources (default-resources) @ james-server-protocols-library
---
[INFO] Using 'UTF-8' encoding to copy filtered resources.
[INFO] skip non existing resourceDirectory <https://builds.apache.org/job/james-server-trunk/org.apache.james$james-server-protocols-library/ws/src/main/resources>
[INFO] Copying 3 resources
[INFO] Copying 3 resources
Oct 2, 2013 4:39:54 AM org.apache.maven.cli.event.ExecutionEventLogger mojoStarted
INFO: 
Oct 2, 2013 4:39:54 AM org.apache.maven.cli.event.ExecutionEventLogger mojoStarted
INFO: --- maven-compiler-plugin:3.0:compile (default-compile) @ james-server-protocols-library
---
[INFO] Changes detected - recompiling the module!
[INFO] Compiling 22 source files to <https://builds.apache.org/job/james-server-trunk/org.apache.james$james-server-protocols-library/ws/target/classes>
Oct 2, 2013 4:39:54 AM org.apache.maven.cli.event.ExecutionEventLogger mojoStarted
INFO: 
Oct 2, 2013 4:39:54 AM org.apache.maven.cli.event.ExecutionEventLogger mojoStarted
INFO: --- maven-resources-plugin:2.6:testResources (default-testResources) @ james-server-protocols-library
---
[INFO] Using 'UTF-8' encoding to copy filtered resources.
[INFO] skip non existing resourceDirectory <https://builds.apache.org/job/james-server-trunk/org.apache.james$james-server-protocols-library/ws/src/test/resources>
[INFO] Copying 3 resources
[INFO] Copying 3 resources
Oct 2, 2013 4:39:54 AM org.apache.maven.cli.event.ExecutionEventLogger mojoStarted
INFO: 
Oct 2, 2013 4:39:54 AM org.apache.maven.cli.event.ExecutionEventLogger mojoStarted
INFO: --- maven-compiler-plugin:3.0:testCompile (default-testCompile) @ james-server-protocols-library
---
[INFO] Changes detected - recompiling the module!
[INFO] Compiling 2 source files to <https://builds.apache.org/job/james-server-trunk/org.apache.james$james-server-protocols-library/ws/target/test-classes>
Oct 2, 2013 4:39:55 AM org.apache.maven.cli.event.ExecutionEventLogger mojoStarted
INFO: 
Oct 2, 2013 4:39:55 AM org.apache.maven.cli.event.ExecutionEventLogger mojoStarted
INFO: --- maven-surefire-plugin:2.13:test (default-test) @ james-server-protocols-library
---
[INFO] Skipping execution of surefire because it has already been run for this configuration
Oct 2, 2013 4:39:55 AM org.apache.maven.cli.event.ExecutionEventLogger mojoStarted
INFO: 
[JENKINS] Recording test resultsOct 2, 2013 4:39:55 AM org.apache.maven.cli.event.ExecutionEventLogger
mojoStarted
INFO: --- maven-bundle-plugin:2.3.7:bundle (default-bundle) @ james-server-protocols-library
---

Oct 2, 2013 4:39:55 AM org.apache.maven.cli.event.ExecutionEventLogger mojoStarted
INFO: 
Oct 2, 2013 4:39:55 AM org.apache.maven.cli.event.ExecutionEventLogger mojoStarted
INFO: --- maven-jar-plugin:2.4:jar (jar) @ james-server-protocols-library ---
Oct 2, 2013 4:39:56 AM org.apache.maven.cli.event.ExecutionEventLogger mojoStarted
INFO: 
Oct 2, 2013 4:39:56 AM org.apache.maven.cli.event.ExecutionEventLogger mojoStarted
INFO: --- maven-jar-plugin:2.4:test-jar (test-jar) @ james-server-protocols-library ---
[INFO] Building jar: <https://builds.apache.org/job/james-server-trunk/org.apache.james$james-server-protocols-library/ws/target/james-server-protocols-library-3.0.0-beta5-SNAPSHOT-tests.jar>
[WARNING] Artifact org.apache.james:james-server-protocols-library:test-jar:tests:3.0.0-beta5-SNAPSHOT
already attached to project, ignoring duplicate
Oct 2, 2013 4:39:57 AM org.apache.maven.cli.event.ExecutionEventLogger mojoStarted
INFO: 
Oct 2, 2013 4:39:57 AM org.apache.maven.cli.event.ExecutionEventLogger mojoStarted
INFO: --- maven-jar-plugin:2.4:test-jar (default) @ james-server-protocols-library ---
[WARNING] Artifact org.apache.james:james-server-protocols-library:test-jar:tests:3.0.0-beta5-SNAPSHOT
already attached to project, ignoring duplicate
Oct 2, 2013 4:39:57 AM hudson.maven.ExecutedMojo <init>
WARNING: Failed to getClass for org.apache.maven.plugin.source.SourceJarMojo
Oct 2, 2013 4:39:57 AM org.apache.maven.cli.event.ExecutionEventLogger mojoStarted
INFO: 
Oct 2, 2013 4:39:57 AM org.apache.maven.cli.event.ExecutionEventLogger mojoStarted
INFO: --- maven-source-plugin:2.2.1:jar (attach-sources) @ james-server-protocols-library
---
[INFO] Building jar: <https://builds.apache.org/job/james-server-trunk/org.apache.james$james-server-protocols-library/ws/target/james-server-protocols-library-3.0.0-beta5-SNAPSHOT-sources.jar>
[WARNING] Artifact org.apache.james:james-server-protocols-library:java-source:sources:3.0.0-beta5-SNAPSHOT
already attached to project, ignoring duplicate
Oct 2, 2013 4:40:00 AM hudson.maven.ExecutedMojo <init>
WARNING: Failed to getClass for org.apache.maven.plugin.source.TestSourceJarMojo
Oct 2, 2013 4:40:00 AM org.apache.maven.cli.event.ExecutionEventLogger mojoStarted
INFO: 
Oct 2, 2013 4:40:00 AM org.apache.maven.cli.event.ExecutionEventLogger mojoStarted
INFO: --- maven-source-plugin:2.2.1:test-jar (attach-sources) @ james-server-protocols-library
---
[INFO] Building jar: <https://builds.apache.org/job/james-server-trunk/org.apache.james$james-server-protocols-library/ws/target/james-server-protocols-library-3.0.0-beta5-SNAPSHOT-test-sources.jar>
[WARNING] Artifact org.apache.james:james-server-protocols-library:java-source:test-sources:3.0.0-beta5-SNAPSHOT
already attached to project, ignoring duplicate
Oct 2, 2013 4:40:02 AM org.apache.maven.cli.event.ExecutionEventLogger mojoStarted
INFO: 
Oct 2, 2013 4:40:02 AM org.apache.maven.cli.event.ExecutionEventLogger mojoStarted
INFO: --- maven-site-plugin:3.2:attach-descriptor (attach-descriptor) @ james-server-protocols-library
---
Oct 2, 2013 4:40:02 AM org.apache.maven.cli.event.ExecutionEventLogger mojoStarted
INFO: 
Oct 2, 2013 4:40:02 AM org.apache.maven.cli.event.ExecutionEventLogger mojoStarted
INFO: --- maven-install-plugin:2.3.1:install (default-install) @ james-server-protocols-library
---
[INFO] Installing <https://builds.apache.org/job/james-server-trunk/org.apache.james$james-server-protocols-library/ws/target/james-server-protocols-library-3.0.0-beta5-SNAPSHOT.jar>
to /home/jenkins/jenkins-slave/maven-repositories/1/org/apache/james/james-server-protocols-library/3.0.0-beta5-SNAPSHOT/james-server-protocols-library-3.0.0-beta5-SNAPSHOT.jar
[INFO] Installing <https://builds.apache.org/job/james-server-trunk/org.apache.james$james-server-protocols-library/ws/pom.xml>
to /home/jenkins/jenkins-slave/maven-repositories/1/org/apache/james/james-server-protocols-library/3.0.0-beta5-SNAPSHOT/james-server-protocols-library-3.0.0-beta5-SNAPSHOT.pom
[INFO] Installing <https://builds.apache.org/job/james-server-trunk/org.apache.james$james-server-protocols-library/ws/target/james-server-protocols-library-3.0.0-beta5-SNAPSHOT-tests.jar>
to /home/jenkins/jenkins-slave/maven-repositories/1/org/apache/james/james-server-protocols-library/3.0.0-beta5-SNAPSHOT/james-server-protocols-library-3.0.0-beta5-SNAPSHOT-tests.jar
[INFO] Installing <https://builds.apache.org/job/james-server-trunk/org.apache.james$james-server-protocols-library/ws/target/james-server-protocols-library-3.0.0-beta5-SNAPSHOT-sources.jar>
to /home/jenkins/jenkins-slave/maven-repositories/1/org/apache/james/james-server-protocols-library/3.0.0-beta5-SNAPSHOT/james-server-protocols-library-3.0.0-beta5-SNAPSHOT-sources.jar
[INFO] Installing <https://builds.apache.org/job/james-server-trunk/org.apache.james$james-server-protocols-library/ws/target/james-server-protocols-library-3.0.0-beta5-SNAPSHOT-test-sources.jar>
to /home/jenkins/jenkins-slave/maven-repositories/1/org/apache/james/james-server-protocols-library/3.0.0-beta5-SNAPSHOT/james-server-protocols-library-3.0.0-beta5-SNAPSHOT-test-sources.jar
Oct 2, 2013 4:40:02 AM org.apache.maven.cli.event.ExecutionEventLogger mojoStarted
INFO: 
Oct 2, 2013 4:40:02 AM org.apache.maven.cli.event.ExecutionEventLogger mojoStarted
INFO: --- maven-bundle-plugin:2.3.7:install (default-install) @ james-server-protocols-library
---
[WARNING] Exception while updating local OBR: Unable to read repository xml: file:/home/jenkins/jenkins-slave/maven-repositories/1/repository.xml
org.apache.maven.plugin.MojoExecutionException: Unable to read repository xml: file:/home/jenkins/jenkins-slave/maven-repositories/1/repository.xml
	at org.apache.felix.obrplugin.ObrUpdate.parseRepositoryXml(ObrUpdate.java:324)
	at org.apache.felix.obrplugin.ObrInstall.execute(ObrInstall.java:141)
	at org.apache.maven.plugin.DefaultBuildPluginManager.executeMojo(DefaultBuildPluginManager.java:101)
	at org.apache.maven.lifecycle.internal.MojoExecutor.execute(MojoExecutor.java:209)
	at org.apache.maven.lifecycle.internal.MojoExecutor.execute(MojoExecutor.java:153)
	at org.apache.maven.lifecycle.internal.MojoExecutor.execute(MojoExecutor.java:145)
	at org.apache.maven.lifecycle.internal.LifecycleModuleBuilder.buildProject(LifecycleModuleBuilder.java:84)
	at org.apache.maven.lifecycle.internal.LifecycleModuleBuilder.buildProject(LifecycleModuleBuilder.java:59)
	at org.apache.maven.lifecycle.internal.LifecycleStarter.singleThreadedBuild(LifecycleStarter.java:183)
	at org.apache.maven.lifecycle.internal.LifecycleStarter.execute(LifecycleStarter.java:161)
	at org.apache.maven.DefaultMaven.doExecute(DefaultMaven.java:320)
	at org.apache.maven.DefaultMaven.execute(DefaultMaven.java:156)
	at org.jvnet.hudson.maven3.launcher.Maven3Launcher.main(Maven3Launcher.java:117)
	at sun.reflect.NativeMethodAccessorImpl.invoke0(Native Method)
	at sun.reflect.NativeMethodAccessorImpl.invoke(NativeMethodAccessorImpl.java:57)
	at sun.reflect.DelegatingMethodAccessorImpl.invoke(DelegatingMethodAccessorImpl.java:43)
	at java.lang.reflect.Method.invoke(Method.java:616)
	at org.codehaus.plexus.classworlds.launcher.Launcher.launchStandard(Launcher.java:329)
	at org.codehaus.plexus.classworlds.launcher.Launcher.launch(Launcher.java:239)
	at org.jvnet.hudson.maven3.agent.Maven3Main.launch(Maven3Main.java:178)
	at sun.reflect.NativeMethodAccessorImpl.invoke0(Native Method)
	at sun.reflect.NativeMethodAccessorImpl.invoke(NativeMethodAccessorImpl.java:57)
	at sun.reflect.DelegatingMethodAccessorImpl.invoke(DelegatingMethodAccessorImpl.java:43)
	at java.lang.reflect.Method.invoke(Method.java:616)
	at hudson.maven.Maven3Builder.call(Maven3Builder.java:130)
	at hudson.maven.Maven3Builder.call(Maven3Builder.java:67)
	at hudson.remoting.UserRequest.perform(UserRequest.java:118)
	at hudson.remoting.UserRequest.perform(UserRequest.java:48)
	at hudson.remoting.Request$2.run(Request.java:326)
	at hudson.remoting.InterceptingExecutorService$1.call(InterceptingExecutorService.java:72)
	at java.util.concurrent.FutureTask$Sync.innerRun(FutureTask.java:334)
	at java.util.concurrent.FutureTask.run(FutureTask.java:166)
	at java.util.concurrent.ThreadPoolExecutor.runWorker(ThreadPoolExecutor.java:1146)
	at java.util.concurrent.ThreadPoolExecutor$Worker.run(ThreadPoolExecutor.java:615)
	at java.lang.Thread.run(Thread.java:679)
Caused by: org.xmlpull.v1.XmlPullParserException: unexpected type (position:END_DOCUMENT null@3:1
in java.io.InputStreamReader@4cf96e1e) 
	at org.kxml2.io.KXmlParser.exception(Unknown Source)
	at org.kxml2.io.KXmlParser.nextTag(Unknown Source)
	at org.apache.felix.bundlerepository.impl.PullParser.parseRepository(PullParser.java:43)
	at org.apache.felix.bundlerepository.impl.DataModelHelperImpl.repository(DataModelHelperImpl.java:147)
	at org.apache.felix.bundlerepository.impl.DataModelHelperImpl.repository(DataModelHelperImpl.java:118)
	at org.apache.felix.obrplugin.ObrUpdate.parseRepositoryXml(ObrUpdate.java:316)
	... 34 more
Oct 2, 2013 4:40:02 AM org.apache.maven.cli.event.ExecutionEventLogger mojoStarted
INFO: 
Oct 2, 2013 4:40:02 AM org.apache.maven.cli.event.ExecutionEventLogger mojoStarted
INFO: --- maven-deploy-plugin:2.7:deploy (default-deploy) @ james-server-protocols-library
---
Downloading: https://repository.apache.org/content/repositories/snapshots/org/apache/james/james-server-protocols-library/3.0.0-beta5-SNAPSHOT/maven-metadata.xml
Downloaded: https://repository.apache.org/content/repositories/snapshots/org/apache/james/james-server-protocols-library/3.0.0-beta5-SNAPSHOT/maven-metadata.xml
(2 KB at 0.0 KB/sec)
Uploading: https://repository.apache.org/content/repositories/snapshots/org/apache/james/james-server-protocols-library/3.0.0-beta5-SNAPSHOT/james-server-protocols-library-3.0.0-beta5-20131002.044035-286.jar
Uploaded: https://repository.apache.org/content/repositories/snapshots/org/apache/james/james-server-protocols-library/3.0.0-beta5-SNAPSHOT/james-server-protocols-library-3.0.0-beta5-20131002.044035-286.jar
(45 KB at 6.5 KB/sec)
Uploading: https://repository.apache.org/content/repositories/snapshots/org/apache/james/james-server-protocols-library/3.0.0-beta5-SNAPSHOT/james-server-protocols-library-3.0.0-beta5-20131002.044035-286.pom
Uploaded: https://repository.apache.org/content/repositories/snapshots/org/apache/james/james-server-protocols-library/3.0.0-beta5-SNAPSHOT/james-server-protocols-library-3.0.0-beta5-20131002.044035-286.pom
(4 KB at 2.1 KB/sec)
Downloading: https://repository.apache.org/content/repositories/snapshots/org/apache/james/james-server-protocols-library/maven-metadata.xml
Downloaded: https://repository.apache.org/content/repositories/snapshots/org/apache/james/james-server-protocols-library/maven-metadata.xml
(458 B at 0.1 KB/sec)
Uploading: https://repository.apache.org/content/repositories/snapshots/org/apache/james/james-server-protocols-library/3.0.0-beta5-SNAPSHOT/maven-metadata.xml
Uploaded: https://repository.apache.org/content/repositories/snapshots/org/apache/james/james-server-protocols-library/3.0.0-beta5-SNAPSHOT/maven-metadata.xml
(2 KB at 0.2 KB/sec)
Uploading: https://repository.apache.org/content/repositories/snapshots/org/apache/james/james-server-protocols-library/maven-metadata.xml
Uploaded: https://repository.apache.org/content/repositories/snapshots/org/apache/james/james-server-protocols-library/maven-metadata.xml
(458 B at 0.1 KB/sec)
Uploading: https://repository.apache.org/content/repositories/snapshots/org/apache/james/james-server-protocols-library/3.0.0-beta5-SNAPSHOT/james-server-protocols-library-3.0.0-beta5-20131002.044035-286-tests.jar
Uploaded: https://repository.apache.org/content/repositories/snapshots/org/apache/james/james-server-protocols-library/3.0.0-beta5-SNAPSHOT/james-server-protocols-library-3.0.0-beta5-20131002.044035-286-tests.jar
(13 KB at 24.4 KB/sec)
Uploading: https://repository.apache.org/content/repositories/snapshots/org/apache/james/james-server-protocols-library/3.0.0-beta5-SNAPSHOT/maven-metadata.xml
Uploaded: https://repository.apache.org/content/repositories/snapshots/org/apache/james/james-server-protocols-library/3.0.0-beta5-SNAPSHOT/maven-metadata.xml
(2 KB at 4.4 KB/sec)
Uploading: https://repository.apache.org/content/repositories/snapshots/org/apache/james/james-server-protocols-library/3.0.0-beta5-SNAPSHOT/james-server-protocols-library-3.0.0-beta5-20131002.044035-286-sources.jar
Uploaded: https://repository.apache.org/content/repositories/snapshots/org/apache/james/james-server-protocols-library/3.0.0-beta5-SNAPSHOT/james-server-protocols-library-3.0.0-beta5-20131002.044035-286-sources.jar
(39 KB at 99.3 KB/sec)
Uploading: https://repository.apache.org/content/repositories/snapshots/org/apache/james/james-server-protocols-library/3.0.0-beta5-SNAPSHOT/maven-metadata.xml
Uploaded: https://repository.apache.org/content/repositories/snapshots/org/apache/james/james-server-protocols-library/3.0.0-beta5-SNAPSHOT/maven-metadata.xml
(2 KB at 0.8 KB/sec)
Uploading: https://repository.apache.org/content/repositories/snapshots/org/apache/james/james-server-protocols-library/3.0.0-beta5-SNAPSHOT/james-server-protocols-library-3.0.0-beta5-20131002.044035-286-test-sources.jar
Uploaded: https://repository.apache.org/content/repositories/snapshots/org/apache/james/james-server-protocols-library/3.0.0-beta5-SNAPSHOT/james-server-protocols-library-3.0.0-beta5-20131002.044035-286-test-sources.jar
(9 KB at 20.2 KB/sec)
Uploading: https://repository.apache.org/content/repositories/snapshots/org/apache/james/james-server-protocols-library/3.0.0-beta5-SNAPSHOT/maven-metadata.xml
Uploaded: https://repository.apache.org/content/repositories/snapshots/org/apache/james/james-server-protocols-library/3.0.0-beta5-SNAPSHOT/maven-metadata.xml
(2 KB at 4.2 KB/sec)

---------------------------------------------------------------------
To unsubscribe, e-mail: server-dev-unsubscribe@james.apache.org
For additional commands, e-mail: server-dev-help@james.apache.org


Mime
View raw message