james-server-dev mailing list archives

Site index · List index
Message view « Date » · « Thread »
Top « Date » · « Thread »
From Apache Jenkins Server <jenk...@builds.apache.org>
Subject Build failed in Jenkins: james-server-trunk » Apache James :: Server :: POP3 #4355
Date Thu, 17 Apr 2014 11:50:07 GMT
See <https://builds.apache.org/job/james-server-trunk/org.apache.james$james-server-protocols-pop3/4355/>

------------------------------------------
[INFO]                                                                         
[INFO] ------------------------------------------------------------------------
[INFO] Building Apache James :: Server :: POP3 3.0.0-beta5-SNAPSHOT
[INFO] ------------------------------------------------------------------------
[INFO] 
[INFO] --- maven-clean-plugin:2.5:clean (default-clean) @ james-server-protocols-pop3 ---
[INFO] Deleting <https://builds.apache.org/job/james-server-trunk/org.apache.james$james-server-protocols-pop3/ws/target>
[INFO] 
[INFO] --- maven-remote-resources-plugin:1.4:process (default) @ james-server-protocols-pop3
---
[INFO] 
[INFO] --- maven-resources-plugin:2.6:resources (default-resources) @ james-server-protocols-pop3
---
[INFO] Using 'UTF-8' encoding to copy filtered resources.
[INFO] Copying 3 resources
[INFO] Copying 3 resources
[INFO] 
[INFO] --- maven-compiler-plugin:3.0:compile (default-compile) @ james-server-protocols-pop3
---
[INFO] Changes detected - recompiling the module!
[INFO] Compiling 14 source files to <https://builds.apache.org/job/james-server-trunk/org.apache.james$james-server-protocols-pop3/ws/target/classes>
[INFO] 
[INFO] --- maven-resources-plugin:2.6:testResources (default-testResources) @ james-server-protocols-pop3
---
[INFO] Using 'UTF-8' encoding to copy filtered resources.
[INFO] skip non existing resourceDirectory <https://builds.apache.org/job/james-server-trunk/org.apache.james$james-server-protocols-pop3/ws/src/test/resources>
[INFO] Copying 3 resources
[INFO] 
[INFO] --- maven-compiler-plugin:3.0:testCompile (default-testCompile) @ james-server-protocols-pop3
---
[INFO] Changes detected - recompiling the module!
[INFO] Compiling 3 source files to <https://builds.apache.org/job/james-server-trunk/org.apache.james$james-server-protocols-pop3/ws/target/test-classes>
[INFO] 
[INFO] --- maven-surefire-plugin:2.13:test (default-test) @ james-server-protocols-pop3 ---
[INFO] Surefire report directory: <https://builds.apache.org/job/james-server-trunk/org.apache.james$james-server-protocols-pop3/ws/target/surefire-reports>

-------------------------------------------------------
 T E S T S
-------------------------------------------------------

-------------------------------------------------------
 T E S T S
-------------------------------------------------------
Running org.apache.james.pop3server.OioPOP3ServerTest
SLF4J: Failed to load class "org.slf4j.impl.StaticLoggerBinder".
SLF4J: Defaulting to no-operation (NOP) logger implementation
SLF4J: See http://www.slf4j.org/codes.html#StaticLoggerBinder for further details.
1
Tests run: 12, Failures: 0, Errors: 0, Skipped: 1, Time elapsed: 3.305 sec
Running org.apache.james.pop3server.POP3ServerTest
SLF4J: Failed to load class "org.slf4j.impl.StaticLoggerBinder".
SLF4J: Defaulting to no-operation (NOP) logger implementation
SLF4J: See http://www.slf4j.org/codes.html#StaticLoggerBinder for further details.
1
Tests run: 12, Failures: 0, Errors: 0, Skipped: 1, Time elapsed: 3.437 sec

Results :

Tests run: 24, Failures: 0, Errors: 0, Skipped: 2

[JENKINS] Recording test results
[INFO] 
[INFO] --- maven-bundle-plugin:2.3.7:bundle (default-bundle) @ james-server-protocols-pop3
---
[INFO] 
[INFO] --- maven-jar-plugin:2.4:jar (jar) @ james-server-protocols-pop3 ---
[INFO] 
[INFO] --- maven-jar-plugin:2.4:test-jar (test-jar) @ james-server-protocols-pop3 ---
[INFO] Building jar: <https://builds.apache.org/job/james-server-trunk/org.apache.james$james-server-protocols-pop3/ws/target/james-server-protocols-pop3-3.0.0-beta5-SNAPSHOT-tests.jar>
[WARNING] Failed to getClass for org.apache.maven.plugin.source.SourceJarMojo
[INFO] 
[INFO] --- maven-source-plugin:2.2.1:jar (attach-sources) @ james-server-protocols-pop3 ---
[INFO] Building jar: <https://builds.apache.org/job/james-server-trunk/org.apache.james$james-server-protocols-pop3/ws/target/james-server-protocols-pop3-3.0.0-beta5-SNAPSHOT-sources.jar>
[WARNING] Failed to getClass for org.apache.maven.plugin.source.TestSourceJarMojo
[INFO] 
[INFO] --- maven-source-plugin:2.2.1:test-jar (attach-sources) @ james-server-protocols-pop3
---
[INFO] Building jar: <https://builds.apache.org/job/james-server-trunk/org.apache.james$james-server-protocols-pop3/ws/target/james-server-protocols-pop3-3.0.0-beta5-SNAPSHOT-test-sources.jar>
[INFO] 
[INFO] --- maven-site-plugin:3.2:attach-descriptor (attach-descriptor) @ james-server-protocols-pop3
---
[INFO] 
[INFO] --- maven-install-plugin:2.3.1:install (default-install) @ james-server-protocols-pop3
---
[INFO] Installing <https://builds.apache.org/job/james-server-trunk/org.apache.james$james-server-protocols-pop3/ws/target/james-server-protocols-pop3-3.0.0-beta5-SNAPSHOT.jar>
to /home/jenkins/jenkins-slave/maven-repositories/1/org/apache/james/james-server-protocols-pop3/3.0.0-beta5-SNAPSHOT/james-server-protocols-pop3-3.0.0-beta5-SNAPSHOT.jar
[INFO] Installing <https://builds.apache.org/job/james-server-trunk/org.apache.james$james-server-protocols-pop3/ws/pom.xml>
to /home/jenkins/jenkins-slave/maven-repositories/1/org/apache/james/james-server-protocols-pop3/3.0.0-beta5-SNAPSHOT/james-server-protocols-pop3-3.0.0-beta5-SNAPSHOT.pom
[INFO] Installing <https://builds.apache.org/job/james-server-trunk/org.apache.james$james-server-protocols-pop3/ws/target/james-server-protocols-pop3-3.0.0-beta5-SNAPSHOT-tests.jar>
to /home/jenkins/jenkins-slave/maven-repositories/1/org/apache/james/james-server-protocols-pop3/3.0.0-beta5-SNAPSHOT/james-server-protocols-pop3-3.0.0-beta5-SNAPSHOT-tests.jar
[INFO] Installing <https://builds.apache.org/job/james-server-trunk/org.apache.james$james-server-protocols-pop3/ws/target/james-server-protocols-pop3-3.0.0-beta5-SNAPSHOT-sources.jar>
to /home/jenkins/jenkins-slave/maven-repositories/1/org/apache/james/james-server-protocols-pop3/3.0.0-beta5-SNAPSHOT/james-server-protocols-pop3-3.0.0-beta5-SNAPSHOT-sources.jar
[INFO] Installing <https://builds.apache.org/job/james-server-trunk/org.apache.james$james-server-protocols-pop3/ws/target/james-server-protocols-pop3-3.0.0-beta5-SNAPSHOT-test-sources.jar>
to /home/jenkins/jenkins-slave/maven-repositories/1/org/apache/james/james-server-protocols-pop3/3.0.0-beta5-SNAPSHOT/james-server-protocols-pop3-3.0.0-beta5-SNAPSHOT-test-sources.jar
[INFO] 
[INFO] --- maven-bundle-plugin:2.3.7:install (default-install) @ james-server-protocols-pop3
---
[WARNING] Exception while updating local OBR: Unable to read repository xml: file:/home/jenkins/jenkins-slave/maven-repositories/1/repository.xml
org.apache.maven.plugin.MojoExecutionException: Unable to read repository xml: file:/home/jenkins/jenkins-slave/maven-repositories/1/repository.xml
	at org.apache.felix.obrplugin.ObrUpdate.parseRepositoryXml(ObrUpdate.java:324)
	at org.apache.felix.obrplugin.ObrInstall.execute(ObrInstall.java:141)
	at org.apache.maven.plugin.DefaultBuildPluginManager.executeMojo(DefaultBuildPluginManager.java:101)
	at org.apache.maven.lifecycle.internal.MojoExecutor.execute(MojoExecutor.java:209)
	at org.apache.maven.lifecycle.internal.MojoExecutor.execute(MojoExecutor.java:153)
	at org.apache.maven.lifecycle.internal.MojoExecutor.execute(MojoExecutor.java:145)
	at org.apache.maven.lifecycle.internal.LifecycleModuleBuilder.buildProject(LifecycleModuleBuilder.java:84)
	at org.apache.maven.lifecycle.internal.LifecycleModuleBuilder.buildProject(LifecycleModuleBuilder.java:59)
	at org.apache.maven.lifecycle.internal.LifecycleStarter.singleThreadedBuild(LifecycleStarter.java:183)
	at org.apache.maven.lifecycle.internal.LifecycleStarter.execute(LifecycleStarter.java:161)
	at org.apache.maven.DefaultMaven.doExecute(DefaultMaven.java:320)
	at org.apache.maven.DefaultMaven.execute(DefaultMaven.java:156)
	at org.jvnet.hudson.maven3.launcher.Maven3Launcher.main(Maven3Launcher.java:117)
	at sun.reflect.NativeMethodAccessorImpl.invoke0(Native Method)
	at sun.reflect.NativeMethodAccessorImpl.invoke(NativeMethodAccessorImpl.java:57)
	at sun.reflect.DelegatingMethodAccessorImpl.invoke(DelegatingMethodAccessorImpl.java:43)
	at java.lang.reflect.Method.invoke(Method.java:622)
	at org.codehaus.plexus.classworlds.launcher.Launcher.launchStandard(Launcher.java:329)
	at org.codehaus.plexus.classworlds.launcher.Launcher.launch(Launcher.java:239)
	at org.jvnet.hudson.maven3.agent.Maven3Main.launch(Maven3Main.java:178)
	at sun.reflect.NativeMethodAccessorImpl.invoke0(Native Method)
	at sun.reflect.NativeMethodAccessorImpl.invoke(NativeMethodAccessorImpl.java:57)
	at sun.reflect.DelegatingMethodAccessorImpl.invoke(DelegatingMethodAccessorImpl.java:43)
	at java.lang.reflect.Method.invoke(Method.java:622)
	at hudson.maven.Maven3Builder.call(Maven3Builder.java:134)
	at hudson.maven.Maven3Builder.call(Maven3Builder.java:69)
	at hudson.remoting.UserRequest.perform(UserRequest.java:118)
	at hudson.remoting.UserRequest.perform(UserRequest.java:48)
	at hudson.remoting.Request$2.run(Request.java:328)
	at hudson.remoting.InterceptingExecutorService$1.call(InterceptingExecutorService.java:72)
	at java.util.concurrent.FutureTask$Sync.innerRun(FutureTask.java:334)
	at java.util.concurrent.FutureTask.run(FutureTask.java:166)
	at java.util.concurrent.ThreadPoolExecutor.runWorker(ThreadPoolExecutor.java:1146)
	at java.util.concurrent.ThreadPoolExecutor$Worker.run(ThreadPoolExecutor.java:615)
	at java.lang.Thread.run(Thread.java:701)
Caused by: org.xmlpull.v1.XmlPullParserException: unexpected type (position:END_DOCUMENT null@3:1
in java.io.InputStreamReader@2141ddd) 
	at org.kxml2.io.KXmlParser.exception(Unknown Source)
	at org.kxml2.io.KXmlParser.nextTag(Unknown Source)
	at org.apache.felix.bundlerepository.impl.PullParser.parseRepository(PullParser.java:43)
	at org.apache.felix.bundlerepository.impl.DataModelHelperImpl.repository(DataModelHelperImpl.java:147)
	at org.apache.felix.bundlerepository.impl.DataModelHelperImpl.repository(DataModelHelperImpl.java:118)
	at org.apache.felix.obrplugin.ObrUpdate.parseRepositoryXml(ObrUpdate.java:316)
	... 34 more
[INFO] 
[INFO] --- maven-remote-resources-plugin:1.4:process (default) @ james-server-protocols-pop3
---
[INFO] 
[INFO] --- maven-resources-plugin:2.6:resources (default-resources) @ james-server-protocols-pop3
---
[INFO] Using 'UTF-8' encoding to copy filtered resources.
[INFO] Copying 3 resources
[INFO] Copying 3 resources
[INFO] Copying 3 resources
[INFO] 
[INFO] --- maven-compiler-plugin:3.0:compile (default-compile) @ james-server-protocols-pop3
---
[INFO] Changes detected - recompiling the module!
[INFO] Compiling 14 source files to <https://builds.apache.org/job/james-server-trunk/org.apache.james$james-server-protocols-pop3/ws/target/classes>
[INFO] 
[INFO] --- maven-resources-plugin:2.6:testResources (default-testResources) @ james-server-protocols-pop3
---
[INFO] Using 'UTF-8' encoding to copy filtered resources.
[INFO] skip non existing resourceDirectory <https://builds.apache.org/job/james-server-trunk/org.apache.james$james-server-protocols-pop3/ws/src/test/resources>
[INFO] Copying 3 resources
[INFO] Copying 3 resources
[INFO] 
[INFO] --- maven-compiler-plugin:3.0:testCompile (default-testCompile) @ james-server-protocols-pop3
---
[INFO] Changes detected - recompiling the module!
[INFO] Compiling 3 source files to <https://builds.apache.org/job/james-server-trunk/org.apache.james$james-server-protocols-pop3/ws/target/test-classes>
[INFO] 
[INFO] --- maven-surefire-plugin:2.13:test (default-test) @ james-server-protocols-pop3 ---
[INFO] Skipping execution of surefire because it has already been run for this configuration
[JENKINS] Recording test results[INFO] 
[INFO] --- maven-bundle-plugin:2.3.7:bundle (default-bundle) @ james-server-protocols-pop3
---

[INFO] 
[INFO] --- maven-jar-plugin:2.4:jar (jar) @ james-server-protocols-pop3 ---
[INFO] 
[INFO] --- maven-jar-plugin:2.4:test-jar (test-jar) @ james-server-protocols-pop3 ---
[INFO] Building jar: <https://builds.apache.org/job/james-server-trunk/org.apache.james$james-server-protocols-pop3/ws/target/james-server-protocols-pop3-3.0.0-beta5-SNAPSHOT-tests.jar>
[WARNING] Artifact org.apache.james:james-server-protocols-pop3:test-jar:tests:3.0.0-beta5-SNAPSHOT
already attached to project, ignoring duplicate
[WARNING] Failed to getClass for org.apache.maven.plugin.source.SourceJarMojo
[INFO] 
[INFO] --- maven-source-plugin:2.2.1:jar (attach-sources) @ james-server-protocols-pop3 ---
[INFO] Building jar: <https://builds.apache.org/job/james-server-trunk/org.apache.james$james-server-protocols-pop3/ws/target/james-server-protocols-pop3-3.0.0-beta5-SNAPSHOT-sources.jar>
[WARNING] Artifact org.apache.james:james-server-protocols-pop3:java-source:sources:3.0.0-beta5-SNAPSHOT
already attached to project, ignoring duplicate
[WARNING] Failed to getClass for org.apache.maven.plugin.source.TestSourceJarMojo
[INFO] 
[INFO] --- maven-source-plugin:2.2.1:test-jar (attach-sources) @ james-server-protocols-pop3
---
[INFO] Building jar: <https://builds.apache.org/job/james-server-trunk/org.apache.james$james-server-protocols-pop3/ws/target/james-server-protocols-pop3-3.0.0-beta5-SNAPSHOT-test-sources.jar>
[WARNING] Artifact org.apache.james:james-server-protocols-pop3:java-source:test-sources:3.0.0-beta5-SNAPSHOT
already attached to project, ignoring duplicate
[INFO] 
[INFO] --- maven-site-plugin:3.2:attach-descriptor (attach-descriptor) @ james-server-protocols-pop3
---
[INFO] 
[INFO] --- maven-install-plugin:2.3.1:install (default-install) @ james-server-protocols-pop3
---
[INFO] Installing <https://builds.apache.org/job/james-server-trunk/org.apache.james$james-server-protocols-pop3/ws/target/james-server-protocols-pop3-3.0.0-beta5-SNAPSHOT.jar>
to /home/jenkins/jenkins-slave/maven-repositories/1/org/apache/james/james-server-protocols-pop3/3.0.0-beta5-SNAPSHOT/james-server-protocols-pop3-3.0.0-beta5-SNAPSHOT.jar
[INFO] Installing <https://builds.apache.org/job/james-server-trunk/org.apache.james$james-server-protocols-pop3/ws/pom.xml>
to /home/jenkins/jenkins-slave/maven-repositories/1/org/apache/james/james-server-protocols-pop3/3.0.0-beta5-SNAPSHOT/james-server-protocols-pop3-3.0.0-beta5-SNAPSHOT.pom
[INFO] Installing <https://builds.apache.org/job/james-server-trunk/org.apache.james$james-server-protocols-pop3/ws/target/james-server-protocols-pop3-3.0.0-beta5-SNAPSHOT-tests.jar>
to /home/jenkins/jenkins-slave/maven-repositories/1/org/apache/james/james-server-protocols-pop3/3.0.0-beta5-SNAPSHOT/james-server-protocols-pop3-3.0.0-beta5-SNAPSHOT-tests.jar
[INFO] Installing <https://builds.apache.org/job/james-server-trunk/org.apache.james$james-server-protocols-pop3/ws/target/james-server-protocols-pop3-3.0.0-beta5-SNAPSHOT-sources.jar>
to /home/jenkins/jenkins-slave/maven-repositories/1/org/apache/james/james-server-protocols-pop3/3.0.0-beta5-SNAPSHOT/james-server-protocols-pop3-3.0.0-beta5-SNAPSHOT-sources.jar
[INFO] Installing <https://builds.apache.org/job/james-server-trunk/org.apache.james$james-server-protocols-pop3/ws/target/james-server-protocols-pop3-3.0.0-beta5-SNAPSHOT-test-sources.jar>
to /home/jenkins/jenkins-slave/maven-repositories/1/org/apache/james/james-server-protocols-pop3/3.0.0-beta5-SNAPSHOT/james-server-protocols-pop3-3.0.0-beta5-SNAPSHOT-test-sources.jar
[INFO] 
[INFO] --- maven-bundle-plugin:2.3.7:install (default-install) @ james-server-protocols-pop3
---
[WARNING] Exception while updating local OBR: Unable to read repository xml: file:/home/jenkins/jenkins-slave/maven-repositories/1/repository.xml
org.apache.maven.plugin.MojoExecutionException: Unable to read repository xml: file:/home/jenkins/jenkins-slave/maven-repositories/1/repository.xml
	at org.apache.felix.obrplugin.ObrUpdate.parseRepositoryXml(ObrUpdate.java:324)
	at org.apache.felix.obrplugin.ObrInstall.execute(ObrInstall.java:141)
	at org.apache.maven.plugin.DefaultBuildPluginManager.executeMojo(DefaultBuildPluginManager.java:101)
	at org.apache.maven.lifecycle.internal.MojoExecutor.execute(MojoExecutor.java:209)
	at org.apache.maven.lifecycle.internal.MojoExecutor.execute(MojoExecutor.java:153)
	at org.apache.maven.lifecycle.internal.MojoExecutor.execute(MojoExecutor.java:145)
	at org.apache.maven.lifecycle.internal.LifecycleModuleBuilder.buildProject(LifecycleModuleBuilder.java:84)
	at org.apache.maven.lifecycle.internal.LifecycleModuleBuilder.buildProject(LifecycleModuleBuilder.java:59)
	at org.apache.maven.lifecycle.internal.LifecycleStarter.singleThreadedBuild(LifecycleStarter.java:183)
	at org.apache.maven.lifecycle.internal.LifecycleStarter.execute(LifecycleStarter.java:161)
	at org.apache.maven.DefaultMaven.doExecute(DefaultMaven.java:320)
	at org.apache.maven.DefaultMaven.execute(DefaultMaven.java:156)
	at org.jvnet.hudson.maven3.launcher.Maven3Launcher.main(Maven3Launcher.java:117)
	at sun.reflect.NativeMethodAccessorImpl.invoke0(Native Method)
	at sun.reflect.NativeMethodAccessorImpl.invoke(NativeMethodAccessorImpl.java:57)
	at sun.reflect.DelegatingMethodAccessorImpl.invoke(DelegatingMethodAccessorImpl.java:43)
	at java.lang.reflect.Method.invoke(Method.java:622)
	at org.codehaus.plexus.classworlds.launcher.Launcher.launchStandard(Launcher.java:329)
	at org.codehaus.plexus.classworlds.launcher.Launcher.launch(Launcher.java:239)
	at org.jvnet.hudson.maven3.agent.Maven3Main.launch(Maven3Main.java:178)
	at sun.reflect.NativeMethodAccessorImpl.invoke0(Native Method)
	at sun.reflect.NativeMethodAccessorImpl.invoke(NativeMethodAccessorImpl.java:57)
	at sun.reflect.DelegatingMethodAccessorImpl.invoke(DelegatingMethodAccessorImpl.java:43)
	at java.lang.reflect.Method.invoke(Method.java:622)
	at hudson.maven.Maven3Builder.call(Maven3Builder.java:134)
	at hudson.maven.Maven3Builder.call(Maven3Builder.java:69)
	at hudson.remoting.UserRequest.perform(UserRequest.java:118)
	at hudson.remoting.UserRequest.perform(UserRequest.java:48)
	at hudson.remoting.Request$2.run(Request.java:328)
	at hudson.remoting.InterceptingExecutorService$1.call(InterceptingExecutorService.java:72)
	at java.util.concurrent.FutureTask$Sync.innerRun(FutureTask.java:334)
	at java.util.concurrent.FutureTask.run(FutureTask.java:166)
	at java.util.concurrent.ThreadPoolExecutor.runWorker(ThreadPoolExecutor.java:1146)
	at java.util.concurrent.ThreadPoolExecutor$Worker.run(ThreadPoolExecutor.java:615)
	at java.lang.Thread.run(Thread.java:701)
Caused by: org.xmlpull.v1.XmlPullParserException: unexpected type (position:END_DOCUMENT null@3:1
in java.io.InputStreamReader@15f21032) 
	at org.kxml2.io.KXmlParser.exception(Unknown Source)
	at org.kxml2.io.KXmlParser.nextTag(Unknown Source)
	at org.apache.felix.bundlerepository.impl.PullParser.parseRepository(PullParser.java:43)
	at org.apache.felix.bundlerepository.impl.DataModelHelperImpl.repository(DataModelHelperImpl.java:147)
	at org.apache.felix.bundlerepository.impl.DataModelHelperImpl.repository(DataModelHelperImpl.java:118)
	at org.apache.felix.obrplugin.ObrUpdate.parseRepositoryXml(ObrUpdate.java:316)
	... 34 more
[INFO] 
[INFO] --- maven-deploy-plugin:2.7:deploy (default-deploy) @ james-server-protocols-pop3 ---
Downloading: https://repository.apache.org/content/repositories/snapshots/org/apache/james/james-server-protocols-pop3/3.0.0-beta5-SNAPSHOT/maven-metadata.xml
[WARNING] Could not transfer metadata org.apache.james:james-server-protocols-pop3:3.0.0-beta5-SNAPSHOT/maven-metadata.xml
from/to apache.snapshots.https (https://repository.apache.org/content/repositories/snapshots):
Failed to transfer file: https://repository.apache.org/content/repositories/snapshots/org/apache/james/james-server-protocols-pop3/3.0.0-beta5-SNAPSHOT/maven-metadata.xml.
Return code is: 503, ReasonPhrase:Service Temporarily Unavailable.

---------------------------------------------------------------------
To unsubscribe, e-mail: server-dev-unsubscribe@james.apache.org
For additional commands, e-mail: server-dev-help@james.apache.org


Mime
View raw message