james-server-dev mailing list archives

Site index · List index
Message view « Date » · « Thread »
Top « Date » · « Thread »
From Apache Jenkins Server <jenk...@builds.apache.org>
Subject Build failed in Jenkins: jdkim-trunk #1998
Date Tue, 15 Apr 2014 12:03:05 GMT
See <https://builds.apache.org/job/jdkim-trunk/1998/>

------------------------------------------
[...truncated 303 lines...]
[INFO] 
[INFO] --- maven-compiler-plugin:2.3.2:compile (default-compile) @ apache-jdkim-library ---
[INFO] Compiling 25 source files to <https://builds.apache.org/job/jdkim-trunk/ws/trunk/main/target/classes>
[INFO] 
[INFO] --- maven-resources-plugin:2.5:testResources (default-testResources) @ apache-jdkim-library
---
[debug] execute contextualize
[INFO] Using 'UTF-8' encoding to copy filtered resources.
[INFO] Copying 78 resources
[INFO] Copying 3 resources
[INFO] 
[INFO] --- maven-compiler-plugin:2.3.2:testCompile (default-testCompile) @ apache-jdkim-library
---
[INFO] Compiling 16 source files to <https://builds.apache.org/job/jdkim-trunk/ws/trunk/main/target/test-classes>
[INFO] 
[INFO] --- maven-surefire-plugin:2.10:test (default-test) @ apache-jdkim-library ---
[INFO] Surefire report directory: <https://builds.apache.org/job/jdkim-trunk/ws/trunk/main/target/surefire-reports>

-------------------------------------------------------
 T E S T S
-------------------------------------------------------

-------------------------------------------------------
 T E S T S
-------------------------------------------------------
Running org.apache.james.jdkim.DNSPublicKeyRetrieverTest
Tests run: 5, Failures: 0, Errors: 0, Skipped: 0, Time elapsed: 11.191 sec
Running org.apache.james.jdkim.PerlDKIMTest
Tests run: 69, Failures: 0, Errors: 0, Skipped: 0, Time elapsed: 21.701 sec
Running org.apache.james.jdkim.SignatureRecordTest
Tests run: 5, Failures: 0, Errors: 0, Skipped: 0, Time elapsed: 10.955 sec
Running org.apache.james.jdkim.PublicKeyRecordTest
Tests run: 10, Failures: 0, Errors: 0, Skipped: 0, Time elapsed: 4.08 sec
Running org.apache.james.jdkim.canon.RelaxedBodyCanonicalizerTest
Tests run: 2, Failures: 0, Errors: 0, Skipped: 0, Time elapsed: 1.83 sec
Running org.apache.james.jdkim.canon.LimitedOutputStreamTest
Tests run: 3, Failures: 0, Errors: 0, Skipped: 0, Time elapsed: 3.056 sec
Running org.apache.james.jdkim.canon.DigestOutputStreamTest
Tests run: 3, Failures: 0, Errors: 0, Skipped: 0, Time elapsed: 5.044 sec
Running org.apache.james.jdkim.canon.SimpleBodyCanonicalizerTest
Tests run: 10, Failures: 0, Errors: 0, Skipped: 0, Time elapsed: 0.159 sec
Running org.apache.james.jdkim.canon.CompoundOutputStreamTest
Tests run: 2, Failures: 0, Errors: 0, Skipped: 0, Time elapsed: 0.436 sec
Running org.apache.james.jdkim.FileBasedTest
Tests run: 6, Failures: 0, Errors: 0, Skipped: 0, Time elapsed: 12.632 sec
Running org.apache.james.jdkim.DKIMVerifierTest
Tests run: 1, Failures: 0, Errors: 0, Skipped: 0, Time elapsed: 6.408 sec
Running org.apache.james.jdkim.SignatureRecordImplTest
Tests run: 5, Failures: 0, Errors: 0, Skipped: 0, Time elapsed: 0.456 sec
Running org.apache.james.jdkim.MultiplexingPublicKeyRecordRetrieverTest
Tests run: 4, Failures: 0, Errors: 0, Skipped: 0, Time elapsed: 0.457 sec
Running org.apache.james.jdkim.tagvalue.TagValueTest
Tests run: 16, Failures: 0, Errors: 0, Skipped: 0, Time elapsed: 0.082 sec

Results :

Tests run: 141, Failures: 0, Errors: 0, Skipped: 0

[JENKINS] Recording test results
[INFO] 
[INFO] --- maven-bundle-plugin:2.3.7:bundle (default-bundle) @ apache-jdkim-library ---
[INFO] 
[INFO] --- maven-jar-plugin:2.3.2:test-jar (default) @ apache-jdkim-library ---
[INFO] Building jar: <https://builds.apache.org/job/jdkim-trunk/ws/trunk/main/target/apache-jdkim-library-0.3-SNAPSHOT-tests.jar>
[INFO] 
[INFO] --- maven-site-plugin:3.0:attach-descriptor (attach-descriptor) @ apache-jdkim-library
---
[INFO] 
[INFO] --- maven-shade-plugin:1.5:shade (default) @ apache-jdkim-library ---
[INFO] Excluding org.apache.geronimo.specs:geronimo-activation_1.1_spec:jar:1.1 from the shaded
jar.
[INFO] Excluding org.apache.geronimo.javamail:geronimo-javamail_1.4_mail:jar:1.8.3 from the
shaded jar.
[INFO] Including commons-codec:commons-codec:jar:1.7 in the shaded jar.
[INFO] Excluding org.apache.james:apache-mailet-base:jar:2.5.0 from the shaded jar.
[INFO] Excluding org.apache.james:apache-mailet-api:jar:2.5.0 from the shaded jar.
[INFO] Excluding org.apache.james:apache-mime4j-core:jar:0.7.2 from the shaded jar.
[INFO] Excluding org.apache.james:apache-mime4j-dom:jar:0.7.2 from the shaded jar.
[INFO] Excluding log4j:log4j:jar:1.2.16 from the shaded jar.
[INFO] Excluding dnsjava:dnsjava:jar:2.1.1 from the shaded jar.
[INFO] Replacing original artifact with shaded artifact.
[INFO] Replacing <https://builds.apache.org/job/jdkim-trunk/ws/trunk/main/target/apache-jdkim-library-0.3-SNAPSHOT.jar>
with <https://builds.apache.org/job/jdkim-trunk/ws/trunk/main/target/apache-jdkim-library-0.3-SNAPSHOT-shaded.jar>
[INFO] 
[INFO] --- apache-rat-plugin:0.8:check (default) @ apache-jdkim-library ---
[INFO] Exclude: src/test/resources/org/apache/james/jdkim/corpus/*
[INFO] Exclude: src/test/resources/org/apache/james/jdkim/Mail-DKIM/FAKE_DNS.dat
[INFO] Exclude: src/test/resources/org/apache/james/jdkim/Mail-DKIM/corpus/*
[INFO] Exclude: release.properties
[INFO] Exclude: dependency-reduced-pom.xml
[INFO] Exclude: nbactions.xml
[INFO] Exclude: **/.*/**/*
[INFO] 
[INFO] --- maven-install-plugin:2.3.1:install (default-install) @ apache-jdkim-library ---
[INFO] Installing <https://builds.apache.org/job/jdkim-trunk/ws/trunk/main/target/apache-jdkim-library-0.3-SNAPSHOT.jar>
to /export/home/hudson/hudson-slave/maven-repositories/1/org/apache/james/jdkim/apache-jdkim-library/0.3-SNAPSHOT/apache-jdkim-library-0.3-SNAPSHOT.jar
[INFO] Installing <https://builds.apache.org/job/jdkim-trunk/ws/trunk/main/dependency-reduced-pom.xml>
to /export/home/hudson/hudson-slave/maven-repositories/1/org/apache/james/jdkim/apache-jdkim-library/0.3-SNAPSHOT/apache-jdkim-library-0.3-SNAPSHOT.pom
[INFO] Installing <https://builds.apache.org/job/jdkim-trunk/ws/trunk/main/target/apache-jdkim-library-0.3-SNAPSHOT-tests.jar>
to /export/home/hudson/hudson-slave/maven-repositories/1/org/apache/james/jdkim/apache-jdkim-library/0.3-SNAPSHOT/apache-jdkim-library-0.3-SNAPSHOT-tests.jar
[INFO] 
[INFO] --- maven-bundle-plugin:2.3.7:install (default-install) @ apache-jdkim-library ---
[INFO] Installing org/apache/james/jdkim/apache-jdkim-library/0.3-SNAPSHOT/apache-jdkim-library-0.3-SNAPSHOT.jar
[INFO] Writing OBR metadata
[INFO] 
[INFO] --- maven-deploy-plugin:2.7:deploy (default-deploy) @ apache-jdkim-library ---
Downloading: https://repository.apache.org/content/repositories/snapshots/org/apache/james/jdkim/apache-jdkim-library/0.3-SNAPSHOT/maven-metadata.xml
Downloaded: https://repository.apache.org/content/repositories/snapshots/org/apache/james/jdkim/apache-jdkim-library/0.3-SNAPSHOT/maven-metadata.xml
(1004 B at 0.0 KB/sec)
Uploading: https://repository.apache.org/content/repositories/snapshots/org/apache/james/jdkim/apache-jdkim-library/0.3-SNAPSHOT/apache-jdkim-library-0.3-20140415.114445-764.jar
Uploaded: https://repository.apache.org/content/repositories/snapshots/org/apache/james/jdkim/apache-jdkim-library/0.3-SNAPSHOT/apache-jdkim-library-0.3-20140415.114445-764.jar
(241 KB at 92.1 KB/sec)
Uploading: https://repository.apache.org/content/repositories/snapshots/org/apache/james/jdkim/apache-jdkim-library/0.3-SNAPSHOT/apache-jdkim-library-0.3-20140415.114445-764.pom
Uploaded: https://repository.apache.org/content/repositories/snapshots/org/apache/james/jdkim/apache-jdkim-library/0.3-SNAPSHOT/apache-jdkim-library-0.3-20140415.114445-764.pom
(8 KB at 3.3 KB/sec)
Downloading: https://repository.apache.org/content/repositories/snapshots/org/apache/james/jdkim/apache-jdkim-library/maven-metadata.xml
Downloaded: https://repository.apache.org/content/repositories/snapshots/org/apache/james/jdkim/apache-jdkim-library/maven-metadata.xml
(300 B at 0.1 KB/sec)
Uploading: https://repository.apache.org/content/repositories/snapshots/org/apache/james/jdkim/apache-jdkim-library/0.3-SNAPSHOT/maven-metadata.xml
Uploaded: https://repository.apache.org/content/repositories/snapshots/org/apache/james/jdkim/apache-jdkim-library/0.3-SNAPSHOT/maven-metadata.xml
(1004 B at 0.4 KB/sec)
Uploading: https://repository.apache.org/content/repositories/snapshots/org/apache/james/jdkim/apache-jdkim-library/maven-metadata.xml
Uploaded: https://repository.apache.org/content/repositories/snapshots/org/apache/james/jdkim/apache-jdkim-library/maven-metadata.xml
(300 B at 0.1 KB/sec)
Uploading: https://repository.apache.org/content/repositories/snapshots/org/apache/james/jdkim/apache-jdkim-library/0.3-SNAPSHOT/apache-jdkim-library-0.3-20140415.114445-764-tests.jar
Uploaded: https://repository.apache.org/content/repositories/snapshots/org/apache/james/jdkim/apache-jdkim-library/0.3-SNAPSHOT/apache-jdkim-library-0.3-20140415.114445-764-tests.jar
(112 KB at 33.9 KB/sec)
Uploading: https://repository.apache.org/content/repositories/snapshots/org/apache/james/jdkim/apache-jdkim-library/0.3-SNAPSHOT/maven-metadata.xml
Uploaded: https://repository.apache.org/content/repositories/snapshots/org/apache/james/jdkim/apache-jdkim-library/0.3-SNAPSHOT/maven-metadata.xml
(1004 B at 0.5 KB/sec)
[INFO] 
[INFO] --- maven-bundle-plugin:2.3.7:deploy (default-deploy) @ apache-jdkim-library ---
[INFO] Remote OBR update disabled (enable with -DremoteOBR)
[INFO]                                                                         
[INFO] ------------------------------------------------------------------------
[INFO] Building Apache James :: jDKIM :: Mailets 0.3-SNAPSHOT
[INFO] ------------------------------------------------------------------------
[INFO] 
[INFO] --- maven-clean-plugin:2.4.1:clean (default-clean) @ apache-jdkim-mailets ---
[TASKS] Scanning folder '<https://builds.apache.org/job/jdkim-trunk/ws/trunk/mailets'>
for files matching the pattern '**/*.java' - excludes: 
[TASKS] Found 8 files to scan for tasks
Found 0 open tasks.
[TASKS] Computing warning deltas based on reference build #1997
[INFO] 
[INFO] --- maven-remote-resources-plugin:1.2.1:process (default) @ apache-jdkim-mailets ---
[INFO] 
[INFO] --- maven-resources-plugin:2.5:resources (default-resources) @ apache-jdkim-mailets
---
[debug] execute contextualize
[INFO] Using 'UTF-8' encoding to copy filtered resources.
[INFO] Copying 0 resource
[INFO] Copying 3 resources
[INFO] 
[INFO] --- maven-compiler-plugin:2.3.2:compile (default-compile) @ apache-jdkim-mailets ---
[INFO] Compiling 6 source files to <https://builds.apache.org/job/jdkim-trunk/ws/trunk/mailets/target/classes>
[INFO] 
[INFO] --- maven-resources-plugin:2.5:testResources (default-testResources) @ apache-jdkim-mailets
---
[debug] execute contextualize
[INFO] Using 'UTF-8' encoding to copy filtered resources.
[INFO] Copying 0 resource
[INFO] Copying 3 resources
[INFO] 
[INFO] --- maven-compiler-plugin:2.3.2:testCompile (default-testCompile) @ apache-jdkim-mailets
---
[INFO] Compiling 2 source files to <https://builds.apache.org/job/jdkim-trunk/ws/trunk/mailets/target/test-classes>
[INFO] 
[INFO] --- maven-surefire-plugin:2.10:test (default-test) @ apache-jdkim-mailets ---
[INFO] Surefire report directory: <https://builds.apache.org/job/jdkim-trunk/ws/trunk/mailets/target/surefire-reports>

-------------------------------------------------------
 T E S T S
-------------------------------------------------------

-------------------------------------------------------
 T E S T S
-------------------------------------------------------
Running org.apache.james.jdkim.mailets.DKIMVerifyTest
Tests run: 4, Failures: 0, Errors: 0, Skipped: 0, Time elapsed: 1.635 sec
Running org.apache.james.jdkim.mailets.DKIMSignTest
Tests run: 6, Failures: 0, Errors: 0, Skipped: 0, Time elapsed: 1.9 sec

Results :

Tests run: 10, Failures: 0, Errors: 0, Skipped: 0

[JENKINS] Recording test results
[INFO] 
[INFO] --- maven-bundle-plugin:2.3.7:bundle (default-bundle) @ apache-jdkim-mailets ---
[INFO] 
[INFO] --- maven-site-plugin:3.0:attach-descriptor (attach-descriptor) @ apache-jdkim-mailets
---
[INFO] 
[INFO] --- maven-install-plugin:2.3.1:install (default-install) @ apache-jdkim-mailets ---
[INFO] Installing <https://builds.apache.org/job/jdkim-trunk/ws/trunk/mailets/target/apache-jdkim-mailets-0.3-SNAPSHOT.jar>
to /export/home/hudson/hudson-slave/maven-repositories/1/org/apache/james/jdkim/apache-jdkim-mailets/0.3-SNAPSHOT/apache-jdkim-mailets-0.3-SNAPSHOT.jar
[INFO] Installing <https://builds.apache.org/job/jdkim-trunk/ws/trunk/mailets/pom.xml>
to /export/home/hudson/hudson-slave/maven-repositories/1/org/apache/james/jdkim/apache-jdkim-mailets/0.3-SNAPSHOT/apache-jdkim-mailets-0.3-SNAPSHOT.pom
[INFO] 
[INFO] --- maven-bundle-plugin:2.3.7:install (default-install) @ apache-jdkim-mailets ---
[INFO] Installing org/apache/james/jdkim/apache-jdkim-mailets/0.3-SNAPSHOT/apache-jdkim-mailets-0.3-SNAPSHOT.jar
[INFO] Writing OBR metadata
[INFO] 
[INFO] --- maven-deploy-plugin:2.7:deploy (default-deploy) @ apache-jdkim-mailets ---
Downloading: https://repository.apache.org/content/repositories/snapshots/org/apache/james/jdkim/apache-jdkim-mailets/0.3-SNAPSHOT/maven-metadata.xml
Downloaded: https://repository.apache.org/content/repositories/snapshots/org/apache/james/jdkim/apache-jdkim-mailets/0.3-SNAPSHOT/maven-metadata.xml
(792 B at 0.4 KB/sec)
Uploading: https://repository.apache.org/content/repositories/snapshots/org/apache/james/jdkim/apache-jdkim-mailets/0.3-SNAPSHOT/apache-jdkim-mailets-0.3-20140415.115119-755.jar
Uploaded: https://repository.apache.org/content/repositories/snapshots/org/apache/james/jdkim/apache-jdkim-mailets/0.3-SNAPSHOT/apache-jdkim-mailets-0.3-20140415.115119-755.jar
(19 KB at 9.8 KB/sec)
Uploading: https://repository.apache.org/content/repositories/snapshots/org/apache/james/jdkim/apache-jdkim-mailets/0.3-SNAPSHOT/apache-jdkim-mailets-0.3-20140415.115119-755.pom
Uploaded: https://repository.apache.org/content/repositories/snapshots/org/apache/james/jdkim/apache-jdkim-mailets/0.3-SNAPSHOT/apache-jdkim-mailets-0.3-20140415.115119-755.pom
(5 KB at 2.3 KB/sec)
Downloading: https://repository.apache.org/content/repositories/snapshots/org/apache/james/jdkim/apache-jdkim-mailets/maven-metadata.xml
Downloaded: https://repository.apache.org/content/repositories/snapshots/org/apache/james/jdkim/apache-jdkim-mailets/maven-metadata.xml
(300 B at 0.3 KB/sec)
Uploading: https://repository.apache.org/content/repositories/snapshots/org/apache/james/jdkim/apache-jdkim-mailets/0.3-SNAPSHOT/maven-metadata.xml
Uploaded: https://repository.apache.org/content/repositories/snapshots/org/apache/james/jdkim/apache-jdkim-mailets/0.3-SNAPSHOT/maven-metadata.xml
(792 B at 0.5 KB/sec)
Uploading: https://repository.apache.org/content/repositories/snapshots/org/apache/james/jdkim/apache-jdkim-mailets/maven-metadata.xml
Uploaded: https://repository.apache.org/content/repositories/snapshots/org/apache/james/jdkim/apache-jdkim-mailets/maven-metadata.xml
(300 B at 0.1 KB/sec)
[INFO] 
[INFO] --- maven-bundle-plugin:2.3.7:deploy (default-deploy) @ apache-jdkim-mailets ---
[INFO] Remote OBR update disabled (enable with -DremoteOBR)
[INFO]                                                                         
[INFO] ------------------------------------------------------------------------
[INFO] Building Apache James :: jDKIM :: Assembly 0.3-SNAPSHOT
[INFO] ------------------------------------------------------------------------
[INFO] 
[INFO] --- maven-clean-plugin:2.4.1:clean (default-clean) @ apache-jdkim ---
[TASKS] Scanning folder '<https://builds.apache.org/job/jdkim-trunk/ws/trunk/assemble'>
for files matching the pattern '**/*.java' - excludes: 
[TASKS] Found 0 files to scan for tasks
Found 0 open tasks.
[TASKS] Computing warning deltas based on reference build #1997
[INFO] 
[INFO] --- maven-remote-resources-plugin:1.2.1:process (default) @ apache-jdkim ---
[INFO] 
[INFO] --- maven-site-plugin:3.0:attach-descriptor (attach-descriptor) @ apache-jdkim ---
[INFO] 
[INFO] --- maven-assembly-plugin:2.2.1:attached (make-assembly) @ apache-jdkim ---
[INFO] ------------------------------------------------------------------------
[INFO] Reactor Summary:
[INFO] 
[INFO] Apache James :: jDKIM :: DomainKey Project ........ SUCCESS [3:00.585s]
[INFO] Apache James :: jDKIM ............................. SUCCESS [10:38.000s]
[INFO] Apache James :: jDKIM :: Mailets .................. SUCCESS [1:14.119s]
[INFO] Apache James :: jDKIM :: Assembly ................. FAILURE [1:13.123s]
[INFO] ------------------------------------------------------------------------
[INFO] BUILD FAILURE
[INFO] ------------------------------------------------------------------------
[INFO] Total time: 36:44.036s
[INFO] Finished at: Tue Apr 15 12:02:56 GMT+00:00 2014
[INFO] Final Memory: 33M/268M
[INFO] ------------------------------------------------------------------------
Waiting for Jenkins to finish collecting data
[ERROR] Failed to execute goal org.apache.maven.plugins:maven-assembly-plugin:2.2.1:attached
(make-assembly) on project apache-jdkim: Failed to create assembly: Failed to retrieve OS
environment variables. Reason: Cannot run program "env": error=12, Not enough space ->
[Help 1]
[ERROR] 
[ERROR] To see the full stack trace of the errors, re-run Maven with the -e switch.
[ERROR] Re-run Maven using the -X switch to enable full debug logging.
[ERROR] 
[ERROR] For more information about the errors and possible solutions, please read the following
articles:
[ERROR] [Help 1] http://cwiki.apache.org/confluence/display/MAVEN/MojoExecutionException
[ERROR] 
[ERROR] After correcting the problems, you can resume the build with the command
[ERROR]   mvn <goals> -rf :apache-jdkim
[JENKINS] Archiving <https://builds.apache.org/job/jdkim-trunk/ws/trunk/assemble/pom.xml>
to org.apache.james.jdkim/apache-jdkim/0.3-SNAPSHOT/apache-jdkim-0.3-SNAPSHOT.pom
[JENKINS] Archiving <https://builds.apache.org/job/jdkim-trunk/ws/trunk/main/dependency-reduced-pom.xml>
to org.apache.james.jdkim/apache-jdkim-library/0.3-SNAPSHOT/apache-jdkim-library-0.3-SNAPSHOT.pom
[JENKINS] Archiving <https://builds.apache.org/job/jdkim-trunk/ws/trunk/main/target/apache-jdkim-library-0.3-SNAPSHOT.jar>
to org.apache.james.jdkim/apache-jdkim-library/0.3-20140415.114445-764/apache-jdkim-library-0.3-20140415.114445-764.jar
[JENKINS] Archiving <https://builds.apache.org/job/jdkim-trunk/ws/trunk/main/target/apache-jdkim-library-0.3-SNAPSHOT-tests.jar>
to org.apache.james.jdkim/apache-jdkim-library/0.3-20140415.114445-764/apache-jdkim-library-0.3-20140415.114445-764-tests.jar
[JENKINS] Archiving <https://builds.apache.org/job/jdkim-trunk/ws/trunk/mailets/pom.xml>
to org.apache.james.jdkim/apache-jdkim-mailets/0.3-SNAPSHOT/apache-jdkim-mailets-0.3-SNAPSHOT.pom
[JENKINS] Archiving <https://builds.apache.org/job/jdkim-trunk/ws/trunk/mailets/target/apache-jdkim-mailets-0.3-SNAPSHOT.jar>
to org.apache.james.jdkim/apache-jdkim-mailets/0.3-20140415.115119-755/apache-jdkim-mailets-0.3-20140415.115119-755.jar
[JENKINS] Archiving <https://builds.apache.org/job/jdkim-trunk/ws/trunk/pom.xml> to
org.apache.james.jdkim/apache-jdkim-project/0.3-SNAPSHOT/apache-jdkim-project-0.3-SNAPSHOT.pom
[JENKINS] Archiving <https://builds.apache.org/job/jdkim-trunk/ws/trunk/target/apache-jdkim-project-0.3-SNAPSHOT-site.xml>
to org.apache.james.jdkim/apache-jdkim-project/0.3-20140415.112909-781/apache-jdkim-project-0.3-20140415.112909-781-site.xml
Sending e-mails to: server-dev@james.apache.org
channel stopped
[locks-and-latches] Releasing all the locks
[locks-and-latches] All the locks released

---------------------------------------------------------------------
To unsubscribe, e-mail: server-dev-unsubscribe@james.apache.org
For additional commands, e-mail: server-dev-help@james.apache.org


Mime
View raw message