james-server-dev mailing list archives

Site index · List index
Message view « Date » · « Thread »
Top « Date » · « Thread »
From Apache Jenkins Server <jenk...@builds.apache.org>
Subject Build failed in Jenkins: james-server-trunk » Apache James :: Server :: LMTP #4343
Date Thu, 10 Apr 2014 05:16:35 GMT
See <https://builds.apache.org/job/james-server-trunk/org.apache.james$james-server-protocols-lmtp/4343/>

------------------------------------------
[INFO]                                                                         
[INFO] ------------------------------------------------------------------------
[INFO] Building Apache James :: Server :: LMTP 3.0.0-beta5-SNAPSHOT
[INFO] ------------------------------------------------------------------------
[INFO] 
[INFO] --- maven-clean-plugin:2.5:clean (default-clean) @ james-server-protocols-lmtp ---
[INFO] Deleting <https://builds.apache.org/job/james-server-trunk/org.apache.james$james-server-protocols-lmtp/ws/target>
[INFO] 
[INFO] --- maven-remote-resources-plugin:1.4:process (default) @ james-server-protocols-lmtp
---
[INFO] 
[INFO] --- maven-resources-plugin:2.6:resources (default-resources) @ james-server-protocols-lmtp
---
[INFO] Using 'UTF-8' encoding to copy filtered resources.
[INFO] Copying 3 resources
[INFO] Copying 3 resources
[INFO] 
[INFO] --- maven-compiler-plugin:3.0:compile (default-compile) @ james-server-protocols-lmtp
---
[INFO] Changes detected - recompiling the module!
[INFO] Compiling 12 source files to <https://builds.apache.org/job/james-server-trunk/org.apache.james$james-server-protocols-lmtp/ws/target/classes>
[INFO] 
[INFO] --- maven-resources-plugin:2.6:testResources (default-testResources) @ james-server-protocols-lmtp
---
[INFO] Using 'UTF-8' encoding to copy filtered resources.
[INFO] skip non existing resourceDirectory <https://builds.apache.org/job/james-server-trunk/org.apache.james$james-server-protocols-lmtp/ws/src/test/resources>
[INFO] Copying 3 resources
[INFO] 
[INFO] --- maven-compiler-plugin:3.0:testCompile (default-testCompile) @ james-server-protocols-lmtp
---
[INFO] No sources to compile
[INFO] 
[INFO] --- maven-surefire-plugin:2.13:test (default-test) @ james-server-protocols-lmtp ---
[JENKINS] Recording test results[INFO] 
[INFO] --- maven-bundle-plugin:2.3.7:bundle (default-bundle) @ james-server-protocols-lmtp
---

[INFO] 
[INFO] --- maven-jar-plugin:2.4:jar (jar) @ james-server-protocols-lmtp ---
[INFO] 
[INFO] --- maven-jar-plugin:2.4:test-jar (test-jar) @ james-server-protocols-lmtp ---
[INFO] Building jar: <https://builds.apache.org/job/james-server-trunk/org.apache.james$james-server-protocols-lmtp/ws/target/james-server-protocols-lmtp-3.0.0-beta5-SNAPSHOT-tests.jar>
[WARNING] Failed to getClass for org.apache.maven.plugin.source.SourceJarMojo
[INFO] 
[INFO] --- maven-source-plugin:2.2.1:jar (attach-sources) @ james-server-protocols-lmtp ---
[INFO] Building jar: <https://builds.apache.org/job/james-server-trunk/org.apache.james$james-server-protocols-lmtp/ws/target/james-server-protocols-lmtp-3.0.0-beta5-SNAPSHOT-sources.jar>
[WARNING] Failed to getClass for org.apache.maven.plugin.source.TestSourceJarMojo
[INFO] 
[INFO] --- maven-source-plugin:2.2.1:test-jar (attach-sources) @ james-server-protocols-lmtp
---
[INFO] Building jar: <https://builds.apache.org/job/james-server-trunk/org.apache.james$james-server-protocols-lmtp/ws/target/james-server-protocols-lmtp-3.0.0-beta5-SNAPSHOT-test-sources.jar>
[INFO] 
[INFO] --- maven-site-plugin:3.2:attach-descriptor (attach-descriptor) @ james-server-protocols-lmtp
---
[INFO] 
[INFO] --- maven-install-plugin:2.3.1:install (default-install) @ james-server-protocols-lmtp
---
[INFO] Installing <https://builds.apache.org/job/james-server-trunk/org.apache.james$james-server-protocols-lmtp/ws/target/james-server-protocols-lmtp-3.0.0-beta5-SNAPSHOT.jar>
to /home/jenkins/jenkins-slave/maven-repositories/0/org/apache/james/james-server-protocols-lmtp/3.0.0-beta5-SNAPSHOT/james-server-protocols-lmtp-3.0.0-beta5-SNAPSHOT.jar
[INFO] Installing <https://builds.apache.org/job/james-server-trunk/org.apache.james$james-server-protocols-lmtp/ws/pom.xml>
to /home/jenkins/jenkins-slave/maven-repositories/0/org/apache/james/james-server-protocols-lmtp/3.0.0-beta5-SNAPSHOT/james-server-protocols-lmtp-3.0.0-beta5-SNAPSHOT.pom
[INFO] Installing <https://builds.apache.org/job/james-server-trunk/org.apache.james$james-server-protocols-lmtp/ws/target/james-server-protocols-lmtp-3.0.0-beta5-SNAPSHOT-tests.jar>
to /home/jenkins/jenkins-slave/maven-repositories/0/org/apache/james/james-server-protocols-lmtp/3.0.0-beta5-SNAPSHOT/james-server-protocols-lmtp-3.0.0-beta5-SNAPSHOT-tests.jar
[INFO] Installing <https://builds.apache.org/job/james-server-trunk/org.apache.james$james-server-protocols-lmtp/ws/target/james-server-protocols-lmtp-3.0.0-beta5-SNAPSHOT-sources.jar>
to /home/jenkins/jenkins-slave/maven-repositories/0/org/apache/james/james-server-protocols-lmtp/3.0.0-beta5-SNAPSHOT/james-server-protocols-lmtp-3.0.0-beta5-SNAPSHOT-sources.jar
[INFO] Installing <https://builds.apache.org/job/james-server-trunk/org.apache.james$james-server-protocols-lmtp/ws/target/james-server-protocols-lmtp-3.0.0-beta5-SNAPSHOT-test-sources.jar>
to /home/jenkins/jenkins-slave/maven-repositories/0/org/apache/james/james-server-protocols-lmtp/3.0.0-beta5-SNAPSHOT/james-server-protocols-lmtp-3.0.0-beta5-SNAPSHOT-test-sources.jar
[INFO] 
[INFO] --- maven-bundle-plugin:2.3.7:install (default-install) @ james-server-protocols-lmtp
---
[INFO] Installing org/apache/james/james-server-protocols-lmtp/3.0.0-beta5-SNAPSHOT/james-server-protocols-lmtp-3.0.0-beta5-SNAPSHOT.jar
[INFO] Writing OBR metadata
[WARNING] Exception while updating local OBR: Unable to write repository xml
org.apache.maven.plugin.MojoExecutionException: Unable to write repository xml
	at org.apache.felix.obrplugin.ObrUpdate.writeRepositoryXml(ObrUpdate.java:278)
	at org.apache.felix.obrplugin.ObrInstall.execute(ObrInstall.java:149)
	at org.apache.maven.plugin.DefaultBuildPluginManager.executeMojo(DefaultBuildPluginManager.java:101)
	at org.apache.maven.lifecycle.internal.MojoExecutor.execute(MojoExecutor.java:209)
	at org.apache.maven.lifecycle.internal.MojoExecutor.execute(MojoExecutor.java:153)
	at org.apache.maven.lifecycle.internal.MojoExecutor.execute(MojoExecutor.java:145)
	at org.apache.maven.lifecycle.internal.LifecycleModuleBuilder.buildProject(LifecycleModuleBuilder.java:84)
	at org.apache.maven.lifecycle.internal.LifecycleModuleBuilder.buildProject(LifecycleModuleBuilder.java:59)
	at org.apache.maven.lifecycle.internal.LifecycleStarter.singleThreadedBuild(LifecycleStarter.java:183)
	at org.apache.maven.lifecycle.internal.LifecycleStarter.execute(LifecycleStarter.java:161)
	at org.apache.maven.DefaultMaven.doExecute(DefaultMaven.java:320)
	at org.apache.maven.DefaultMaven.execute(DefaultMaven.java:156)
	at org.jvnet.hudson.maven3.launcher.Maven3Launcher.main(Maven3Launcher.java:117)
	at sun.reflect.NativeMethodAccessorImpl.invoke0(Native Method)
	at sun.reflect.NativeMethodAccessorImpl.invoke(NativeMethodAccessorImpl.java:57)
	at sun.reflect.DelegatingMethodAccessorImpl.invoke(DelegatingMethodAccessorImpl.java:43)
	at java.lang.reflect.Method.invoke(Method.java:622)
	at org.codehaus.plexus.classworlds.launcher.Launcher.launchStandard(Launcher.java:329)
	at org.codehaus.plexus.classworlds.launcher.Launcher.launch(Launcher.java:239)
	at org.jvnet.hudson.maven3.agent.Maven3Main.launch(Maven3Main.java:178)
	at sun.reflect.NativeMethodAccessorImpl.invoke0(Native Method)
	at sun.reflect.NativeMethodAccessorImpl.invoke(NativeMethodAccessorImpl.java:57)
	at sun.reflect.DelegatingMethodAccessorImpl.invoke(DelegatingMethodAccessorImpl.java:43)
	at java.lang.reflect.Method.invoke(Method.java:622)
	at hudson.maven.Maven3Builder.call(Maven3Builder.java:134)
	at hudson.maven.Maven3Builder.call(Maven3Builder.java:69)
	at hudson.remoting.UserRequest.perform(UserRequest.java:118)
	at hudson.remoting.UserRequest.perform(UserRequest.java:48)
	at hudson.remoting.Request$2.run(Request.java:328)
	at hudson.remoting.InterceptingExecutorService$1.call(InterceptingExecutorService.java:72)
	at java.util.concurrent.FutureTask$Sync.innerRun(FutureTask.java:334)
	at java.util.concurrent.FutureTask.run(FutureTask.java:166)
	at java.util.concurrent.ThreadPoolExecutor.runWorker(ThreadPoolExecutor.java:1146)
	at java.util.concurrent.ThreadPoolExecutor$Worker.run(ThreadPoolExecutor.java:615)
	at java.lang.Thread.run(Thread.java:701)
Caused by: java.io.IOException: No space left on device
	at java.io.FileOutputStream.writeBytes(Native Method)
	at java.io.FileOutputStream.write(FileOutputStream.java:300)
	at sun.nio.cs.StreamEncoder.writeBytes(StreamEncoder.java:220)
	at sun.nio.cs.StreamEncoder.implWrite(StreamEncoder.java:281)
	at sun.nio.cs.StreamEncoder.write(StreamEncoder.java:124)
	at sun.nio.cs.StreamEncoder.write(StreamEncoder.java:134)
	at java.io.OutputStreamWriter.write(OutputStreamWriter.java:220)
	at java.io.Writer.write(Writer.java:157)
	at java.io.Writer.append(Writer.java:227)
	at org.apache.felix.bundlerepository.impl.XmlWriter.attribute(XmlWriter.java:89)
	at org.apache.felix.bundlerepository.impl.DataModelHelperImpl.toXml(DataModelHelperImpl.java:380)
	at org.apache.felix.bundlerepository.impl.DataModelHelperImpl.toXml(DataModelHelperImpl.java:336)
	at org.apache.felix.bundlerepository.impl.DataModelHelperImpl.toXml(DataModelHelperImpl.java:299)
	at org.apache.felix.bundlerepository.impl.DataModelHelperImpl.writeRepository(DataModelHelperImpl.java:186)
	at org.apache.felix.obrplugin.ObrUpdate.writeRepositoryXml(ObrUpdate.java:274)
	... 34 more
[INFO] 
[INFO] --- maven-remote-resources-plugin:1.4:process (default) @ james-server-protocols-lmtp
---
[INFO] 
[INFO] --- maven-resources-plugin:2.6:resources (default-resources) @ james-server-protocols-lmtp
---
[INFO] Using 'UTF-8' encoding to copy filtered resources.
[INFO] Copying 3 resources
[INFO] Copying 3 resources
[INFO] Copying 3 resources
[INFO] 
[INFO] --- maven-compiler-plugin:3.0:compile (default-compile) @ james-server-protocols-lmtp
---
[INFO] Changes detected - recompiling the module!
[INFO] Compiling 12 source files to <https://builds.apache.org/job/james-server-trunk/org.apache.james$james-server-protocols-lmtp/ws/target/classes>
[INFO] 
[INFO] --- maven-resources-plugin:2.6:testResources (default-testResources) @ james-server-protocols-lmtp
---
[INFO] Using 'UTF-8' encoding to copy filtered resources.
[INFO] skip non existing resourceDirectory <https://builds.apache.org/job/james-server-trunk/org.apache.james$james-server-protocols-lmtp/ws/src/test/resources>
[INFO] Copying 3 resources
[INFO] Copying 3 resources
[INFO] 
[INFO] --- maven-compiler-plugin:3.0:testCompile (default-testCompile) @ james-server-protocols-lmtp
---
[INFO] No sources to compile
[INFO] 
[INFO] --- maven-surefire-plugin:2.13:test (default-test) @ james-server-protocols-lmtp ---
[INFO] Skipping execution of surefire because it has already been run for this configuration
[INFO] 
[JENKINS] Recording test results[INFO] --- maven-bundle-plugin:2.3.7:bundle (default-bundle)
@ james-server-protocols-lmtp ---

[INFO] 
[INFO] --- maven-jar-plugin:2.4:jar (jar) @ james-server-protocols-lmtp ---
[INFO] 
[INFO] --- maven-jar-plugin:2.4:test-jar (test-jar) @ james-server-protocols-lmtp ---
[INFO] Building jar: <https://builds.apache.org/job/james-server-trunk/org.apache.james$james-server-protocols-lmtp/ws/target/james-server-protocols-lmtp-3.0.0-beta5-SNAPSHOT-tests.jar>
[WARNING] Artifact org.apache.james:james-server-protocols-lmtp:test-jar:tests:3.0.0-beta5-SNAPSHOT
already attached to project, ignoring duplicate
[WARNING] Failed to getClass for org.apache.maven.plugin.source.SourceJarMojo
[INFO] 
[INFO] --- maven-source-plugin:2.2.1:jar (attach-sources) @ james-server-protocols-lmtp ---
[INFO] Building jar: <https://builds.apache.org/job/james-server-trunk/org.apache.james$james-server-protocols-lmtp/ws/target/james-server-protocols-lmtp-3.0.0-beta5-SNAPSHOT-sources.jar>
[WARNING] Artifact org.apache.james:james-server-protocols-lmtp:java-source:sources:3.0.0-beta5-SNAPSHOT
already attached to project, ignoring duplicate
[WARNING] Failed to getClass for org.apache.maven.plugin.source.TestSourceJarMojo
[INFO] 
[INFO] --- maven-source-plugin:2.2.1:test-jar (attach-sources) @ james-server-protocols-lmtp
---
[INFO] Building jar: <https://builds.apache.org/job/james-server-trunk/org.apache.james$james-server-protocols-lmtp/ws/target/james-server-protocols-lmtp-3.0.0-beta5-SNAPSHOT-test-sources.jar>
[WARNING] Artifact org.apache.james:james-server-protocols-lmtp:java-source:test-sources:3.0.0-beta5-SNAPSHOT
already attached to project, ignoring duplicate
[INFO] 
[INFO] --- maven-site-plugin:3.2:attach-descriptor (attach-descriptor) @ james-server-protocols-lmtp
---
[INFO] 
[INFO] --- maven-install-plugin:2.3.1:install (default-install) @ james-server-protocols-lmtp
---
[INFO] Installing <https://builds.apache.org/job/james-server-trunk/org.apache.james$james-server-protocols-lmtp/ws/target/james-server-protocols-lmtp-3.0.0-beta5-SNAPSHOT.jar>
to /home/jenkins/jenkins-slave/maven-repositories/0/org/apache/james/james-server-protocols-lmtp/3.0.0-beta5-SNAPSHOT/james-server-protocols-lmtp-3.0.0-beta5-SNAPSHOT.jar
[INFO] Installing <https://builds.apache.org/job/james-server-trunk/org.apache.james$james-server-protocols-lmtp/ws/pom.xml>
to /home/jenkins/jenkins-slave/maven-repositories/0/org/apache/james/james-server-protocols-lmtp/3.0.0-beta5-SNAPSHOT/james-server-protocols-lmtp-3.0.0-beta5-SNAPSHOT.pom
[INFO] Installing <https://builds.apache.org/job/james-server-trunk/org.apache.james$james-server-protocols-lmtp/ws/target/james-server-protocols-lmtp-3.0.0-beta5-SNAPSHOT-tests.jar>
to /home/jenkins/jenkins-slave/maven-repositories/0/org/apache/james/james-server-protocols-lmtp/3.0.0-beta5-SNAPSHOT/james-server-protocols-lmtp-3.0.0-beta5-SNAPSHOT-tests.jar
[INFO] Installing <https://builds.apache.org/job/james-server-trunk/org.apache.james$james-server-protocols-lmtp/ws/target/james-server-protocols-lmtp-3.0.0-beta5-SNAPSHOT-sources.jar>
to /home/jenkins/jenkins-slave/maven-repositories/0/org/apache/james/james-server-protocols-lmtp/3.0.0-beta5-SNAPSHOT/james-server-protocols-lmtp-3.0.0-beta5-SNAPSHOT-sources.jar
[INFO] Installing <https://builds.apache.org/job/james-server-trunk/org.apache.james$james-server-protocols-lmtp/ws/target/james-server-protocols-lmtp-3.0.0-beta5-SNAPSHOT-test-sources.jar>
to /home/jenkins/jenkins-slave/maven-repositories/0/org/apache/james/james-server-protocols-lmtp/3.0.0-beta5-SNAPSHOT/james-server-protocols-lmtp-3.0.0-beta5-SNAPSHOT-test-sources.jar
[INFO] 
[INFO] --- maven-bundle-plugin:2.3.7:install (default-install) @ james-server-protocols-lmtp
---
[INFO] Installing org/apache/james/james-server-protocols-lmtp/3.0.0-beta5-SNAPSHOT/james-server-protocols-lmtp-3.0.0-beta5-SNAPSHOT.jar
[INFO] Writing OBR metadata
[WARNING] Exception while updating local OBR: Unable to write repository xml
org.apache.maven.plugin.MojoExecutionException: Unable to write repository xml
	at org.apache.felix.obrplugin.ObrUpdate.writeRepositoryXml(ObrUpdate.java:278)
	at org.apache.felix.obrplugin.ObrInstall.execute(ObrInstall.java:149)
	at org.apache.maven.plugin.DefaultBuildPluginManager.executeMojo(DefaultBuildPluginManager.java:101)
	at org.apache.maven.lifecycle.internal.MojoExecutor.execute(MojoExecutor.java:209)
	at org.apache.maven.lifecycle.internal.MojoExecutor.execute(MojoExecutor.java:153)
	at org.apache.maven.lifecycle.internal.MojoExecutor.execute(MojoExecutor.java:145)
	at org.apache.maven.lifecycle.internal.LifecycleModuleBuilder.buildProject(LifecycleModuleBuilder.java:84)
	at org.apache.maven.lifecycle.internal.LifecycleModuleBuilder.buildProject(LifecycleModuleBuilder.java:59)
	at org.apache.maven.lifecycle.internal.LifecycleStarter.singleThreadedBuild(LifecycleStarter.java:183)
	at org.apache.maven.lifecycle.internal.LifecycleStarter.execute(LifecycleStarter.java:161)
	at org.apache.maven.DefaultMaven.doExecute(DefaultMaven.java:320)
	at org.apache.maven.DefaultMaven.execute(DefaultMaven.java:156)
	at org.jvnet.hudson.maven3.launcher.Maven3Launcher.main(Maven3Launcher.java:117)
	at sun.reflect.NativeMethodAccessorImpl.invoke0(Native Method)
	at sun.reflect.NativeMethodAccessorImpl.invoke(NativeMethodAccessorImpl.java:57)
	at sun.reflect.DelegatingMethodAccessorImpl.invoke(DelegatingMethodAccessorImpl.java:43)
	at java.lang.reflect.Method.invoke(Method.java:622)
	at org.codehaus.plexus.classworlds.launcher.Launcher.launchStandard(Launcher.java:329)
	at org.codehaus.plexus.classworlds.launcher.Launcher.launch(Launcher.java:239)
	at org.jvnet.hudson.maven3.agent.Maven3Main.launch(Maven3Main.java:178)
	at sun.reflect.NativeMethodAccessorImpl.invoke0(Native Method)
	at sun.reflect.NativeMethodAccessorImpl.invoke(NativeMethodAccessorImpl.java:57)
	at sun.reflect.DelegatingMethodAccessorImpl.invoke(DelegatingMethodAccessorImpl.java:43)
	at java.lang.reflect.Method.invoke(Method.java:622)
	at hudson.maven.Maven3Builder.call(Maven3Builder.java:134)
	at hudson.maven.Maven3Builder.call(Maven3Builder.java:69)
	at hudson.remoting.UserRequest.perform(UserRequest.java:118)
	at hudson.remoting.UserRequest.perform(UserRequest.java:48)
	at hudson.remoting.Request$2.run(Request.java:328)
	at hudson.remoting.InterceptingExecutorService$1.call(InterceptingExecutorService.java:72)
	at java.util.concurrent.FutureTask$Sync.innerRun(FutureTask.java:334)
	at java.util.concurrent.FutureTask.run(FutureTask.java:166)
	at java.util.concurrent.ThreadPoolExecutor.runWorker(ThreadPoolExecutor.java:1146)
	at java.util.concurrent.ThreadPoolExecutor$Worker.run(ThreadPoolExecutor.java:615)
	at java.lang.Thread.run(Thread.java:701)
Caused by: java.io.IOException: No space left on device
	at java.io.FileOutputStream.writeBytes(Native Method)
	at java.io.FileOutputStream.write(FileOutputStream.java:300)
	at sun.nio.cs.StreamEncoder.writeBytes(StreamEncoder.java:220)
	at sun.nio.cs.StreamEncoder.implWrite(StreamEncoder.java:281)
	at sun.nio.cs.StreamEncoder.write(StreamEncoder.java:124)
	at sun.nio.cs.StreamEncoder.write(StreamEncoder.java:134)
	at java.io.OutputStreamWriter.write(OutputStreamWriter.java:220)
	at java.io.Writer.write(Writer.java:157)
	at java.io.Writer.append(Writer.java:227)
	at org.apache.felix.bundlerepository.impl.XmlWriter.attribute(XmlWriter.java:89)
	at org.apache.felix.bundlerepository.impl.DataModelHelperImpl.toXml(DataModelHelperImpl.java:380)
	at org.apache.felix.bundlerepository.impl.DataModelHelperImpl.toXml(DataModelHelperImpl.java:336)
	at org.apache.felix.bundlerepository.impl.DataModelHelperImpl.toXml(DataModelHelperImpl.java:299)
	at org.apache.felix.bundlerepository.impl.DataModelHelperImpl.writeRepository(DataModelHelperImpl.java:186)
	at org.apache.felix.obrplugin.ObrUpdate.writeRepositoryXml(ObrUpdate.java:274)
	... 34 more
[INFO] 
[INFO] --- maven-deploy-plugin:2.7:deploy (default-deploy) @ james-server-protocols-lmtp ---
Downloading: https://repository.apache.org/content/repositories/snapshots/org/apache/james/james-server-protocols-lmtp/3.0.0-beta5-SNAPSHOT/maven-metadata.xml
[WARNING] Could not transfer metadata org.apache.james:james-server-protocols-lmtp:3.0.0-beta5-SNAPSHOT/maven-metadata.xml
from/to apache.snapshots.https (https://repository.apache.org/content/repositories/snapshots):
Failed to transfer file: https://repository.apache.org/content/repositories/snapshots/org/apache/james/james-server-protocols-lmtp/3.0.0-beta5-SNAPSHOT/maven-metadata.xml.
Return code is: 502, ReasonPhrase:Proxy Error.

---------------------------------------------------------------------
To unsubscribe, e-mail: server-dev-unsubscribe@james.apache.org
For additional commands, e-mail: server-dev-help@james.apache.org


Mime
View raw message