james-server-dev mailing list archives

Site index · List index
Message view « Date » · « Thread »
Top « Date » · « Thread »
From Apache Jenkins Server <jenk...@builds.apache.org>
Subject Build failed in Jenkins: jdkim-trunk #2058
Date Tue, 08 Jul 2014 11:24:17 GMT
See <https://builds.apache.org/job/jdkim-trunk/2058/>

------------------------------------------
Started by timer
Building remotely on windows2 (Windows) in workspace <https://builds.apache.org/job/jdkim-trunk/ws/>
Updating http://svn.apache.org/repos/asf/james/jdkim/trunk at revision '2014-07-08T04:23:21.730
-0700'
At revision 1608725
no change for http://svn.apache.org/repos/asf/james/jdkim/trunk since the previous build
[locks-and-latches] Checking to see if we really have the locks
[locks-and-latches] Have all the locks, build can start
Parsing POMs
maven31-agent.jar already up to date
maven31-interceptor.jar already up to date
maven3-interceptor-commons.jar already up to date
[trunk] $ f:\jenkins\tools\java\latest-1.6-64/bin/java -cp f:\jenkins\jenkins-slave\maven31-agent.jar;f:\jenkins\tools\maven\latest3\boot\plexus-classworlds-2.5.1.jar;f:\jenkins\tools\maven\latest3/conf/logging
jenkins.maven3.agent.Maven31Main f:\jenkins\tools\maven\latest3 F:\jenkins\jenkins-slave\slave.jar
f:\jenkins\jenkins-slave\maven31-interceptor.jar f:\jenkins\jenkins-slave\maven3-interceptor-commons.jar
65261
<===[JEchannel started
NKINS REMOTING CAPACITY]===>   log4j:WARN No appenders could be found for logger (org.apache.commons.beanutils.converters.BooleanConverter).
log4j:WARN Please initialize the log4j system properly.
Executing Maven:  -B -f <https://builds.apache.org/job/jdkim-trunk/ws/trunk\pom.xml>
-Dmaven.repo.local=f:\jenkins\jenkins-slave\maven-repositories\1 -U clean deploy
[INFO] Scanning for projects...
[INFO] ------------------------------------------------------------------------
[INFO] Reactor Build Order:
[INFO] 
[INFO] Apache James :: jDKIM :: DomainKey Project
[INFO] Apache James :: jDKIM
[INFO] Apache James :: jDKIM :: Mailets
[INFO] Apache James :: jDKIM :: Assembly
[INFO]                                                                         
[INFO] ------------------------------------------------------------------------
[INFO] Building Apache James :: jDKIM :: DomainKey Project 0.3-SNAPSHOT
[INFO] ------------------------------------------------------------------------
[INFO] 
[INFO] --- maven-clean-plugin:2.4.1:clean (default-clean) @ apache-jdkim-project ---
[INFO] Deleting <https://builds.apache.org/job/jdkim-trunk/ws/trunk\target>
[TASKS] Scanning folder '<https://builds.apache.org/job/jdkim-trunk/ws/trunk'> for files
matching the pattern '**/*.java' - excludes: main/**/*, mailets/**/*, assemble/**/*
[TASKS] Found 0 files to scan for tasks
Found 0 open tasks.
[TASKS] Computing warning deltas based on reference build #2048
[INFO] 
[INFO] --- maven-remote-resources-plugin:1.2.1:process (default) @ apache-jdkim-project ---
[INFO] 
[INFO] --- maven-site-plugin:3.0:attach-descriptor (attach-descriptor) @ apache-jdkim-project
---
[INFO] 
[INFO] --- maven-install-plugin:2.3.1:install (default-install) @ apache-jdkim-project ---
[INFO] Installing <https://builds.apache.org/job/jdkim-trunk/ws/trunk\pom.xml> to f:\jenkins\jenkins-slave\maven-repositories\1\org\apache\james\jdkim\apache-jdkim-project\0.3-SNAPSHOT\apache-jdkim-project-0.3-SNAPSHOT.pom
[INFO] Installing <https://builds.apache.org/job/jdkim-trunk/ws/trunk\target\apache-jdkim-project-0.3-SNAPSHOT-site.xml>
to f:\jenkins\jenkins-slave\maven-repositories\1\org\apache\james\jdkim\apache-jdkim-project\0.3-SNAPSHOT\apache-jdkim-project-0.3-SNAPSHOT-site.xml
[INFO] 
[INFO] --- maven-deploy-plugin:2.7:deploy (default-deploy) @ apache-jdkim-project ---
[INFO] Downloading: https://repository.apache.org/content/repositories/snapshots/org/apache/james/jdkim/apache-jdkim-project/0.3-SNAPSHOT/maven-metadata.xml
[INFO] Downloaded: https://repository.apache.org/content/repositories/snapshots/org/apache/james/jdkim/apache-jdkim-project/0.3-SNAPSHOT/maven-metadata.xml
(830 B at 0.5 KB/sec)
[INFO] Uploading: https://repository.apache.org/content/repositories/snapshots/org/apache/james/jdkim/apache-jdkim-project/0.3-SNAPSHOT/apache-jdkim-project-0.3-20140708.112402-803.pom
[INFO] ------------------------------------------------------------------------
[INFO] Reactor Summary:
[INFO] 
[INFO] Apache James :: jDKIM :: DomainKey Project ........ FAILURE [17.431s]
[INFO] Apache James :: jDKIM ............................. SKIPPED
[INFO] Apache James :: jDKIM :: Mailets .................. SKIPPED
[INFO] Apache James :: jDKIM :: Assembly ................. SKIPPED
[INFO] ------------------------------------------------------------------------
[INFO] BUILD FAILURE
[INFO] ------------------------------------------------------------------------
[INFO] Total time: 22.008s
[INFO] Finished at: Tue Jul 08 04:24:03 PDT 2014
[INFO] Final Memory: 15M/61M
[INFO] ------------------------------------------------------------------------
Waiting for Jenkins to finish collecting data
[ERROR] Failed to execute goal org.apache.maven.plugins:maven-deploy-plugin:2.7:deploy (default-deploy)
on project apache-jdkim-project: Failed to deploy artifacts: Could not transfer artifact org.apache.james.jdkim:apache-jdkim-project:pom:0.3-20140708.112402-803
from/to apache.snapshots.https (https://repository.apache.org/content/repositories/snapshots):
Failed to transfer file: https://repository.apache.org/content/repositories/snapshots/org/apache/james/jdkim/apache-jdkim-project/0.3-SNAPSHOT/apache-jdkim-project-0.3-20140708.112402-803.pom.
Return code is: 401, ReasonPhrase: Unauthorized. -> [Help 1]
[ERROR] 
[ERROR] To see the full stack trace of the errors, re-run Maven with the -e switch.
[ERROR] Re-run Maven using the -X switch to enable full debug logging.
[ERROR] 
[ERROR] For more information about the errors and possible solutions, please read the following
articles:
[ERROR] [Help 1] http://cwiki.apache.org/confluence/display/MAVEN/MojoExecutionException
[JENKINS] Archiving F:\jenkins\jenkins-slave\workspace\jdkim-trunk\trunk\mailets\pom.xml to
org.apache.james.jdkim/apache-jdkim-mailets/0.3-SNAPSHOT/apache-jdkim-mailets-0.3-SNAPSHOT.pom
Sending artifact delta relative to jdkim-trunk » Apache James :: jDKIM :: Mailets #2048
Archived 1 artifacts
Archive block size is 32768
Received 0 blocks and 4545 bytes
Compression is 0.0%
Took 84 ms
[JENKINS] Archiving <https://builds.apache.org/job/jdkim-trunk/ws/trunk\pom.xml> to
org.apache.james.jdkim/apache-jdkim-project/0.3-SNAPSHOT/apache-jdkim-project-0.3-SNAPSHOT.pom
[JENKINS] Archiving <https://builds.apache.org/job/jdkim-trunk/ws/trunk\target\apache-jdkim-project-0.3-SNAPSHOT-site.xml>
to org.apache.james.jdkim/apache-jdkim-project/0.3-SNAPSHOT/apache-jdkim-project-0.3-SNAPSHOT-site.xml
Sending artifact delta relative to jdkim-trunk » Apache James :: jDKIM :: DomainKey Project
#2048
Archived 2 artifacts
Archive block size is 32768
Received 0 blocks and 12833 bytes
Compression is 0.0%
Took 62 ms
[JENKINS] Archiving F:\jenkins\jenkins-slave\workspace\jdkim-trunk\trunk\assemble\pom.xml
to org.apache.james.jdkim/apache-jdkim/0.3-SNAPSHOT/apache-jdkim-0.3-SNAPSHOT.pom
Sending artifact delta relative to jdkim-trunk » Apache James :: jDKIM :: Assembly #2048
Archived 1 artifacts
Archive block size is 32768
Received 0 blocks and 4509 bytes
Compression is 0.0%
Took 0.19 sec
[JENKINS] Archiving F:\jenkins\jenkins-slave\workspace\jdkim-trunk\trunk\main\pom.xml to org.apache.james.jdkim/apache-jdkim-library/0.3-SNAPSHOT/apache-jdkim-library-0.3-SNAPSHOT.pom
Sending artifact delta relative to jdkim-trunk » Apache James :: jDKIM #2048
Archived 1 artifacts
Archive block size is 32768
Received 0 blocks and 8993 bytes
Compression is 0.0%
Took 0.12 sec
Sending e-mails to: server-dev@james.apache.org
channel stopped
[locks-and-latches] Releasing all the locks
[locks-and-latches] All the locks released

---------------------------------------------------------------------
To unsubscribe, e-mail: server-dev-unsubscribe@james.apache.org
For additional commands, e-mail: server-dev-help@james.apache.org


Mime
View raw message