james-server-dev mailing list archives

Site index · List index
Message view « Date » · « Thread »
Top « Date » · « Thread »
From Apache Jenkins Server <jenk...@builds.apache.org>
Subject Build failed in Jenkins: james-server-trunk » Apache James :: Server :: SMTP #4636
Date Tue, 02 Sep 2014 13:48:57 GMT
See <https://builds.apache.org/job/james-server-trunk/org.apache.james$james-server-protocols-smtp/4636/>

------------------------------------------
[...truncated 961 lines...]
2014-09-02 10:15:21,074 INFO  [main       ] [SMTP                                        
     ] 130 This SMTP server does not require authentication.
2014-09-02 10:15:21,074 INFO  [main       ] [SMTP                                        
     ] 162 No maximum message size is enforced for this server.
2014-09-02 10:15:21,089 INFO  [main       ] [SMTP                                        
     ] 277 Init SMTP Service done
2014-09-02 10:15:21,093 INFO  [executor-2 ] [SMTP                                        
     ] 69 Id='2079663200' User='' Connection established from 127.0.0.1
2014-09-02 10:15:21,098 INFO  [main       ] [SMTP                                        
     ] 286 Dispose SMTP Service
2014-09-02 10:15:21,100 INFO  [executor-8 ] [SMTP                                        
     ] 69 Id='2079663200' User='' Connection closed for 127.0.0.1
2014-09-02 10:15:21,105 INFO  [main       ] [SMTP                                        
     ] 298 Dispose SMTP Service done
2014-09-02 10:15:21,107 INFO  [main       ] [SMTP                                        
     ] 187 SMTP Service bound to: localhost:8031
2014-09-02 10:15:21,107 INFO  [main       ] [SMTP                                        
     ] 347 SMTP Service is running on: asf911.gq1.ygridcore.net
2014-09-02 10:15:21,108 INFO  [main       ] [SMTP                                        
     ] 360 SMTP Service handler hello name is: asf911.gq1.ygridcore.net
2014-09-02 10:15:21,131 INFO  [main       ] [SMTP                                        
     ] 205 SMTP Service handler connection timeout is: 360000
2014-09-02 10:15:21,131 INFO  [main       ] [SMTP                                        
     ] 210 SMTP Service connection backlog is: 200
2014-09-02 10:15:21,131 INFO  [main       ] [SMTP                                        
     ] 130 This SMTP server does not require authentication.
2014-09-02 10:15:21,132 INFO  [main       ] [SMTP                                        
     ] 162 No maximum message size is enforced for this server.
2014-09-02 10:15:21,149 INFO  [main       ] [SMTP                                        
     ] 277 Init SMTP Service done
2014-09-02 10:15:21,152 INFO  [executor-2 ] [SMTP                                        
     ] 69 Id='1485083064' User='' Connection established from 127.0.0.1
2014-09-02 10:15:21,159 INFO  [executor-9 ] [SMTP                                        
     ] 69 Id='1485083064' User='' Successfully spooled mail Mail1409652921158-cae4df5e-eeeb-4323-8c63-dd68720370b5
from mail_sender1@localhost on localhost/127.0.0.1 for [mail_recipient1@localhost]
2014-09-02 10:15:21,165 INFO  [executor-3 ] [SMTP                                        
     ] 69 Id='1485083064' User='' Successfully spooled mail Mail1409652921164-8dc6779f-bd39-43bb-912d-2eb37d082ece
from mail_sender2@localhost on localhost/127.0.0.1 for [mail_recipient2@localhost]
2014-09-02 10:15:21,167 INFO  [main       ] [SMTP                                        
     ] 286 Dispose SMTP Service
2014-09-02 10:15:21,169 INFO  [executor-6 ] [SMTP                                        
     ] 69 Id='1485083064' User='' Connection closed for 127.0.0.1
2014-09-02 10:15:21,174 INFO  [main       ] [SMTP                                        
     ] 298 Dispose SMTP Service done
2014-09-02 10:15:21,175 INFO  [main       ] [SMTP                                        
     ] 187 SMTP Service bound to: localhost:8032
2014-09-02 10:15:21,175 INFO  [main       ] [SMTP                                        
     ] 347 SMTP Service is running on: asf911.gq1.ygridcore.net
2014-09-02 10:15:21,176 INFO  [main       ] [SMTP                                        
     ] 360 SMTP Service handler hello name is: asf911.gq1.ygridcore.net
2014-09-02 10:15:21,176 INFO  [main       ] [SMTP                                        
     ] 205 SMTP Service handler connection timeout is: 360000
2014-09-02 10:15:21,176 INFO  [main       ] [SMTP                                        
     ] 210 SMTP Service connection backlog is: 200
2014-09-02 10:15:21,176 INFO  [main       ] [SMTP                                        
     ] 130 This SMTP server does not require authentication.
2014-09-02 10:15:21,177 INFO  [main       ] [SMTP                                        
     ] 162 No maximum message size is enforced for this server.
2014-09-02 10:15:21,189 INFO  [main       ] [SMTP                                        
     ] 277 Init SMTP Service done
2014-09-02 10:15:21,192 INFO  [executor-2 ] [SMTP                                        
     ] 69 Id='1207715470' User='' Connection established from 127.0.0.1
2014-09-02 10:15:21,197 INFO  [main       ] [SMTP                                        
     ] 286 Dispose SMTP Service
2014-09-02 10:15:21,199 INFO  [executor-13] [SMTP                                        
     ] 69 Id='1207715470' User='' Connection closed for 127.0.0.1
2014-09-02 10:15:21,201 INFO  [main       ] [SMTP                                        
     ] 298 Dispose SMTP Service done
2014-09-02 10:15:21,202 INFO  [main       ] [SMTP                                        
     ] 187 SMTP Service bound to: localhost:8033
2014-09-02 10:15:21,203 INFO  [main       ] [SMTP                                        
     ] 347 SMTP Service is running on: asf911.gq1.ygridcore.net
2014-09-02 10:15:21,203 INFO  [main       ] [SMTP                                        
     ] 360 SMTP Service handler hello name is: asf911.gq1.ygridcore.net
2014-09-02 10:15:21,203 INFO  [main       ] [SMTP                                        
     ] 205 SMTP Service handler connection timeout is: 360000
2014-09-02 10:15:21,203 INFO  [main       ] [SMTP                                        
     ] 210 SMTP Service connection backlog is: 200
2014-09-02 10:15:21,203 INFO  [main       ] [SMTP                                        
     ] 130 This SMTP server does not require authentication.
2014-09-02 10:15:21,204 INFO  [main       ] [SMTP                                        
     ] 162 No maximum message size is enforced for this server.
2014-09-02 10:15:21,217 INFO  [main       ] [SMTP                                        
     ] 277 Init SMTP Service done
2014-09-02 10:15:21,221 INFO  [executor-2 ] [SMTP                                        
     ] 69 Id='586559162' User='' Connection established from 127.0.0.1
Killed
Running org.apache.james.smtpserver.SPFHandlerTest
2014-09-02 13:47:27,213 WARN  [main       ] [james.smtpserver.fastfail.SPFHandler        
     ] 277 No SPF record found for host: spf6.james.apache.org
org.apache.james.jspf.core.exceptions.NoneException: No SPF record found for host: spf6.james.apache.org
	at org.apache.james.jspf.policies.NoSPFRecordFoundPolicy.getSPFRecord(NoSPFRecordFoundPolicy.java:37)
	at org.apache.james.jspf.impl.SPF$SPFPolicyPostFilterChecker.checkSPF(SPF.java:171)
	at org.apache.james.jspf.executor.SynchronousSPFExecutor.execute(SynchronousSPFExecutor.java:54)
	at org.apache.james.jspf.impl.SPF.checkSPF(SPF.java:315)
	at org.apache.james.smtpserver.fastfail.SPFHandler.doSPFCheck(SPFHandler.java:121)
	at org.apache.james.smtpserver.fastfail.SPFHandler.doMail(SPFHandler.java:166)
	at org.apache.james.smtpserver.SPFHandlerTest.testSPFNoRecord(SPFHandlerTest.java:270)
	at sun.reflect.NativeMethodAccessorImpl.invoke0(Native Method)
	at sun.reflect.NativeMethodAccessorImpl.invoke(NativeMethodAccessorImpl.java:39)
	at sun.reflect.DelegatingMethodAccessorImpl.invoke(DelegatingMethodAccessorImpl.java:25)
	at java.lang.reflect.Method.invoke(Method.java:597)
	at org.junit.runners.model.FrameworkMethod$1.runReflectiveCall(FrameworkMethod.java:47)
	at org.junit.internal.runners.model.ReflectiveCallable.run(ReflectiveCallable.java:12)
	at org.junit.runners.model.FrameworkMethod.invokeExplosively(FrameworkMethod.java:44)
	at org.junit.internal.runners.statements.InvokeMethod.evaluate(InvokeMethod.java:17)
	at org.junit.internal.runners.statements.RunBefores.evaluate(RunBefores.java:26)
	at org.junit.runners.ParentRunner.runLeaf(ParentRunner.java:271)
	at org.junit.runners.BlockJUnit4ClassRunner.runChild(BlockJUnit4ClassRunner.java:70)
	at org.junit.runners.BlockJUnit4ClassRunner.runChild(BlockJUnit4ClassRunner.java:50)
	at org.junit.runners.ParentRunner$3.run(ParentRunner.java:238)
	at org.junit.runners.ParentRunner$1.schedule(ParentRunner.java:63)
	at org.junit.runners.ParentRunner.runChildren(ParentRunner.java:236)
	at org.junit.runners.ParentRunner.access$000(ParentRunner.java:53)
	at org.junit.runners.ParentRunner$2.evaluate(ParentRunner.java:229)
	at org.junit.runners.ParentRunner.run(ParentRunner.java:309)
	at org.apache.maven.surefire.junit4.JUnit4Provider.execute(JUnit4Provider.java:264)
	at org.apache.maven.surefire.junit4.JUnit4Provider.executeTestSet(JUnit4Provider.java:153)
	at org.apache.maven.surefire.junit4.JUnit4Provider.invoke(JUnit4Provider.java:124)
	at sun.reflect.NativeMethodAccessorImpl.invoke0(Native Method)
	at sun.reflect.NativeMethodAccessorImpl.invoke(NativeMethodAccessorImpl.java:39)
	at sun.reflect.DelegatingMethodAccessorImpl.invoke(DelegatingMethodAccessorImpl.java:25)
	at java.lang.reflect.Method.invoke(Method.java:597)
	at org.apache.maven.surefire.util.ReflectionUtils.invokeMethodWithArray2(ReflectionUtils.java:208)
	at org.apache.maven.surefire.booter.ProviderFactory$ProviderProxy.invoke(ProviderFactory.java:158)
	at org.apache.maven.surefire.booter.ProviderFactory.invokeProvider(ProviderFactory.java:86)
	at org.apache.maven.surefire.booter.ForkedBooter.runSuitesInProcess(ForkedBooter.java:153)
	at org.apache.maven.surefire.booter.ForkedBooter.main(ForkedBooter.java:95)
Result for 127.0.0.1 - test@spf6.james.apache.org - spf6.james.apache.org = none args=[]
2014-09-02 13:47:27,240 INFO  [main       ] [james.smtpserver.fastfail.SPFHandler        
     ] 221 Processed directive matched: ~all returned ~
Result for 127.0.0.1 - test@spf3.james.apache.org - spf3.james.apache.org = softfail args=[]
2014-09-02 13:47:27,254 INFO  [main       ] [james.smtpserver.fastfail.SPFHandler        
     ] 221 Processed directive matched: ~all returned ~
Result for 127.0.0.1 - test@spf3.james.apache.org - spf3.james.apache.org = softfail args=[]
2014-09-02 13:47:27,267 WARN  [main       ] [james.smtpserver.fastfail.SPFHandler        
     ] 277 Term [badcontent!] is not syntactically valid: (?:((?:([eE][xX][pP]\=((?:\%(?:\{[rctlsodipvhRCTLSODIPVH]\d*[r]?[\.\-\+,/_\=]*\}|\%|\_|\-)|[\x21-\x24\x26-\x7e]{1})*(?:\.(?:[a-zA-Z0-9]*[a-zA-Z]{1}[a-zA-Z0-9]*|(?:[a-zA-Z0-9]+\-(?:[a-zA-Z0-9]|\-)*[a-zA-Z0-9]))\.?|\%(?:\{[rctlsodipvhRCTLSODIPVH]\d*[r]?[\.\-\+,/_\=]*\}|\%|\_|\-))))|([rR][eE][dD][iI][rR][eE][cC][tT]\=((?:\%(?:\{[rctlsodipvhRCTLSODIPVH]\d*[r]?[\.\-\+,/_\=]*\}|\%|\_|\-)|[\x21-\x24\x26-\x7e]{1})*(?:\.(?:[a-zA-Z0-9]*[a-zA-Z]{1}[a-zA-Z0-9]*|(?:[a-zA-Z0-9]+\-(?:[a-zA-Z0-9]|\-)*[a-zA-Z0-9]))\.?|\%(?:\{[rctlsodipvhRCTLSODIPVH]\d*[r]?[\.\-\+,/_\=]*\}|\%|\_|\-))))|(([a-zA-Z]{1}[A-Za-z0-9\-\_\.]*)\=((?:\%(?:\{[rctlsodipvhRCTLSODIPVH]\d*[r]?[\.\-\+,/_\=]*\}|\%|\_|\-)|[\x21-\x24\x26-\x7e]{1})*))))|([\+\-\?\~]?)((?:([aA][lL][lL])|([aA](?:\:((?:\%(?:\{[rctlsodipvhRCTLSODIPVH]\d*[r]?[\.\-\+,/_\=]*\}|\%|\_|\-)|[\x21-\x24\x26-\x7e]{1})*(?:\.(?:[a-zA-Z0-9]*[a-zA-Z]{1}[a-zA-Z0-9]*|(?:[a-zA-Z0-9]+\-(?:[a-zA-Z0-9]|\-)*[a-zA-Z0-9]))\.?|\%(?:\{[rctlsodipvhRCTLSODIPVH]\d*[r]?[\.\-\+,/_\=]*\}|\%|\_|\-))))?(?:(?:/(\d+))?(?://(\d+))?)?)|([eE][xX][iI][sS][tT][sS]\:((?:\%(?:\{[rctlsodipvhRCTLSODIPVH]\d*[r]?[\.\-\+,/_\=]*\}|\%|\_|\-)|[\x21-\x24\x26-\x7e]{1})*(?:\.(?:[a-zA-Z0-9]*[a-zA-Z]{1}[a-zA-Z0-9]*|(?:[a-zA-Z0-9]+\-(?:[a-zA-Z0-9]|\-)*[a-zA-Z0-9]))\.?|\%(?:\{[rctlsodipvhRCTLSODIPVH]\d*[r]?[\.\-\+,/_\=]*\}|\%|\_|\-))))|([iI][nN][cC][lL][uU][dD][eE]\:((?:\%(?:\{[rctlsodipvhRCTLSODIPVH]\d*[r]?[\.\-\+,/_\=]*\}|\%|\_|\-)|[\x21-\x24\x26-\x7e]{1})*(?:\.(?:[a-zA-Z0-9]*[a-zA-Z]{1}[a-zA-Z0-9]*|(?:[a-zA-Z0-9]+\-(?:[a-zA-Z0-9]|\-)*[a-zA-Z0-9]))\.?|\%(?:\{[rctlsodipvhRCTLSODIPVH]\d*[r]?[\.\-\+,/_\=]*\}|\%|\_|\-))))|([iI][pP][4]\:([0-9.]+)(?:/(\d+))?)|([iI][pP][6]\:([0-9A-Fa-f\:\.]+)(?:/(\d+))?)|([mM][xX](?:\:((?:\%(?:\{[rctlsodipvhRCTLSODIPVH]\d*[r]?[\.\-\+,/_\=]*\}|\%|\_|\-)|[\x21-\x24\x26-\x7e]{1})*(?:\.(?:[a-zA-Z0-9]*[a-zA-Z]{1}[a-zA-Z0-9]*|(?:[a-zA-Z0-9]+\-(?:[a-zA-Z0-9]|\-)*[a-zA-Z0-9]))\.?|\%(?:\{[rctlsodipvhRCTLSODIPVH]\d*[r]?[\.\-\+,/_\=]*\}|\%|\_|\-))))?(?:(?:/(\d+))?(?://(\d+))?)?)|([pP][tT][rR](?:\:((?:\%(?:\{[rctlsodipvhRCTLSODIPVH]\d*[r]?[\.\-\+,/_\=]*\}|\%|\_|\-)|[\x21-\x24\x26-\x7e]{1})*(?:\.(?:[a-zA-Z0-9]*[a-zA-Z]{1}[a-zA-Z0-9]*|(?:[a-zA-Z0-9]+\-(?:[a-zA-Z0-9]|\-)*[a-zA-Z0-9]))\.?|\%(?:\{[rctlsodipvhRCTLSODIPVH]\d*[r]?[\.\-\+,/_\=]*\}|\%|\_|\-))))?))))
org.apache.james.jspf.core.exceptions.PermErrorException: Term [badcontent!] is not syntactically
valid: (?:((?:([eE][xX][pP]\=((?:\%(?:\{[rctlsodipvhRCTLSODIPVH]\d*[r]?[\.\-\+,/_\=]*\}|\%|\_|\-)|[\x21-\x24\x26-\x7e]{1})*(?:\.(?:[a-zA-Z0-9]*[a-zA-Z]{1}[a-zA-Z0-9]*|(?:[a-zA-Z0-9]+\-(?:[a-zA-Z0-9]|\-)*[a-zA-Z0-9]))\.?|\%(?:\{[rctlsodipvhRCTLSODIPVH]\d*[r]?[\.\-\+,/_\=]*\}|\%|\_|\-))))|([rR][eE][dD][iI][rR][eE][cC][tT]\=((?:\%(?:\{[rctlsodipvhRCTLSODIPVH]\d*[r]?[\.\-\+,/_\=]*\}|\%|\_|\-)|[\x21-\x24\x26-\x7e]{1})*(?:\.(?:[a-zA-Z0-9]*[a-zA-Z]{1}[a-zA-Z0-9]*|(?:[a-zA-Z0-9]+\-(?:[a-zA-Z0-9]|\-)*[a-zA-Z0-9]))\.?|\%(?:\{[rctlsodipvhRCTLSODIPVH]\d*[r]?[\.\-\+,/_\=]*\}|\%|\_|\-))))|(([a-zA-Z]{1}[A-Za-z0-9\-\_\.]*)\=((?:\%(?:\{[rctlsodipvhRCTLSODIPVH]\d*[r]?[\.\-\+,/_\=]*\}|\%|\_|\-)|[\x21-\x24\x26-\x7e]{1})*))))|([\+\-\?\~]?)((?:([aA][lL][lL])|([aA](?:\:((?:\%(?:\{[rctlsodipvhRCTLSODIPVH]\d*[r]?[\.\-\+,/_\=]*\}|\%|\_|\-)|[\x21-\x24\x26-\x7e]{1})*(?:\.(?:[a-zA-Z0-9]*[a-zA-Z]{1}[a-zA-Z0-9]*|(?:[a-zA-Z0-9]+\-(?:[a-zA-Z0-9]|\-)*[a-zA-Z0-9]))\.?|\%(?:\{[rctlsodipvhRCTLSODIPVH]\d*[r]?[\.\-\+,/_\=]*\}|\%|\_|\-))))?(?:(?:/(\d+))?(?://(\d+))?)?)|([eE][xX][iI][sS][tT][sS]\:((?:\%(?:\{[rctlsodipvhRCTLSODIPVH]\d*[r]?[\.\-\+,/_\=]*\}|\%|\_|\-)|[\x21-\x24\x26-\x7e]{1})*(?:\.(?:[a-zA-Z0-9]*[a-zA-Z]{1}[a-zA-Z0-9]*|(?:[a-zA-Z0-9]+\-(?:[a-zA-Z0-9]|\-)*[a-zA-Z0-9]))\.?|\%(?:\{[rctlsodipvhRCTLSODIPVH]\d*[r]?[\.\-\+,/_\=]*\}|\%|\_|\-))))|([iI][nN][cC][lL][uU][dD][eE]\:((?:\%(?:\{[rctlsodipvhRCTLSODIPVH]\d*[r]?[\.\-\+,/_\=]*\}|\%|\_|\-)|[\x21-\x24\x26-\x7e]{1})*(?:\.(?:[a-zA-Z0-9]*[a-zA-Z]{1}[a-zA-Z0-9]*|(?:[a-zA-Z0-9]+\-(?:[a-zA-Z0-9]|\-)*[a-zA-Z0-9]))\.?|\%(?:\{[rctlsodipvhRCTLSODIPVH]\d*[r]?[\.\-\+,/_\=]*\}|\%|\_|\-))))|([iI][pP][4]\:([0-9.]+)(?:/(\d+))?)|([iI][pP][6]\:([0-9A-Fa-f\:\.]+)(?:/(\d+))?)|([mM][xX](?:\:((?:\%(?:\{[rctlsodipvhRCTLSODIPVH]\d*[r]?[\.\-\+,/_\=]*\}|\%|\_|\-)|[\x21-\x24\x26-\x7e]{1})*(?:\.(?:[a-zA-Z0-9]*[a-zA-Z]{1}[a-zA-Z0-9]*|(?:[a-zA-Z0-9]+\-(?:[a-zA-Z0-9]|\-)*[a-zA-Z0-9]))\.?|\%(?:\{[rctlsodipvhRCTLSODIPVH]\d*[r]?[\.\-\+,/_\=]*\}|\%|\_|\-))))?(?:(?:/(\d+))?(?://(\d+))?)?)|([pP][tT][rR](?:\:((?:\%(?:\{[rctlsodipvhRCTLSODIPVH]\d*[r]?[\.\-\+,/_\=]*\}|\%|\_|\-)|[\x21-\x24\x26-\x7e]{1})*(?:\.(?:[a-zA-Z0-9]*[a-zA-Z]{1}[a-zA-Z0-9]*|(?:[a-zA-Z0-9]+\-(?:[a-zA-Z0-9]|\-)*[a-zA-Z0-9]))\.?|\%(?:\{[rctlsodipvhRCTLSODIPVH]\d*[r]?[\.\-\+,/_\=]*\}|\%|\_|\-))))?))))
	at org.apache.james.jspf.parser.RFC4408SPF1Parser.parse(RFC4408SPF1Parser.java:277)
	at org.apache.james.jspf.policies.ParseRecordPolicy.getSPFRecord(ParseRecordPolicy.java:46)
	at org.apache.james.jspf.impl.SPF$SPFPolicyPostFilterChecker.checkSPF(SPF.java:171)
	at org.apache.james.jspf.executor.SynchronousSPFExecutor.execute(SynchronousSPFExecutor.java:54)
	at org.apache.james.jspf.impl.SPF.checkSPF(SPF.java:315)
	at org.apache.james.smtpserver.fastfail.SPFHandler.doSPFCheck(SPFHandler.java:121)
	at org.apache.james.smtpserver.fastfail.SPFHandler.doMail(SPFHandler.java:166)
	at org.apache.james.smtpserver.SPFHandlerTest.testSPFpermErrorRejectDisabled(SPFHandlerTest.java:285)
	at sun.reflect.NativeMethodAccessorImpl.invoke0(Native Method)
	at sun.reflect.NativeMethodAccessorImpl.invoke(NativeMethodAccessorImpl.java:39)
	at sun.reflect.DelegatingMethodAccessorImpl.invoke(DelegatingMethodAccessorImpl.java:25)
	at java.lang.reflect.Method.invoke(Method.java:597)
	at org.junit.runners.model.FrameworkMethod$1.runReflectiveCall(FrameworkMethod.java:47)
	at org.junit.internal.runners.model.ReflectiveCallable.run(ReflectiveCallable.java:12)
	at org.junit.runners.model.FrameworkMethod.invokeExplosively(FrameworkMethod.java:44)
	at org.junit.internal.runners.statements.InvokeMethod.evaluate(InvokeMethod.java:17)
	at org.junit.internal.runners.statements.RunBefores.evaluate(RunBefores.java:26)
	at org.junit.runners.ParentRunner.runLeaf(ParentRunner.java:271)
	at org.junit.runners.BlockJUnit4ClassRunner.runChild(BlockJUnit4ClassRunner.java:70)
	at org.junit.runners.BlockJUnit4ClassRunner.runChild(BlockJUnit4ClassRunner.java:50)
	at org.junit.runners.ParentRunner$3.run(ParentRunner.java:238)
	at org.junit.runners.ParentRunner$1.schedule(ParentRunner.java:63)
	at org.junit.runners.ParentRunner.runChildren(ParentRunner.java:236)
	at org.junit.runners.ParentRunner.access$000(ParentRunner.java:53)
	at org.junit.runners.ParentRunner$2.evaluate(ParentRunner.java:229)
	at org.junit.runners.ParentRunner.run(ParentRunner.java:309)
	at org.apache.maven.surefire.junit4.JUnit4Provider.execute(JUnit4Provider.java:264)
	at org.apache.maven.surefire.junit4.JUnit4Provider.executeTestSet(JUnit4Provider.java:153)
	at org.apache.maven.surefire.junit4.JUnit4Provider.invoke(JUnit4Provider.java:124)
	at sun.reflect.NativeMethodAccessorImpl.invoke0(Native Method)
	at sun.reflect.NativeMethodAccessorImpl.invoke(NativeMethodAccessorImpl.java:39)
	at sun.reflect.DelegatingMethodAccessorImpl.invoke(DelegatingMethodAccessorImpl.java:25)
	at java.lang.reflect.Method.invoke(Method.java:597)
	at org.apache.maven.surefire.util.ReflectionUtils.invokeMethodWithArray2(ReflectionUtils.java:208)
	at org.apache.maven.surefire.booter.ProviderFactory$ProviderProxy.invoke(ProviderFactory.java:158)
	at org.apache.maven.surefire.booter.ProviderFactory.invokeProvider(ProviderFactory.java:86)
	at org.apache.maven.surefire.booter.ForkedBooter.runSuitesInProcess(ForkedBooter.java:153)
	at org.apache.maven.surefire.booter.ForkedBooter.main(ForkedBooter.java:95)
Result for 127.0.0.1 - test@spf4.james.apache.org - spf4.james.apache.org = permerror args=[]
2014-09-02 13:47:27,283 WARN  [main       ] [james.smtpserver.fastfail.SPFHandler        
     ] 277 Term [badcontent!] is not syntactically valid: (?:((?:([eE][xX][pP]\=((?:\%(?:\{[rctlsodipvhRCTLSODIPVH]\d*[r]?[\.\-\+,/_\=]*\}|\%|\_|\-)|[\x21-\x24\x26-\x7e]{1})*(?:\.(?:[a-zA-Z0-9]*[a-zA-Z]{1}[a-zA-Z0-9]*|(?:[a-zA-Z0-9]+\-(?:[a-zA-Z0-9]|\-)*[a-zA-Z0-9]))\.?|\%(?:\{[rctlsodipvhRCTLSODIPVH]\d*[r]?[\.\-\+,/_\=]*\}|\%|\_|\-))))|([rR][eE][dD][iI][rR][eE][cC][tT]\=((?:\%(?:\{[rctlsodipvhRCTLSODIPVH]\d*[r]?[\.\-\+,/_\=]*\}|\%|\_|\-)|[\x21-\x24\x26-\x7e]{1})*(?:\.(?:[a-zA-Z0-9]*[a-zA-Z]{1}[a-zA-Z0-9]*|(?:[a-zA-Z0-9]+\-(?:[a-zA-Z0-9]|\-)*[a-zA-Z0-9]))\.?|\%(?:\{[rctlsodipvhRCTLSODIPVH]\d*[r]?[\.\-\+,/_\=]*\}|\%|\_|\-))))|(([a-zA-Z]{1}[A-Za-z0-9\-\_\.]*)\=((?:\%(?:\{[rctlsodipvhRCTLSODIPVH]\d*[r]?[\.\-\+,/_\=]*\}|\%|\_|\-)|[\x21-\x24\x26-\x7e]{1})*))))|([\+\-\?\~]?)((?:([aA][lL][lL])|([aA](?:\:((?:\%(?:\{[rctlsodipvhRCTLSODIPVH]\d*[r]?[\.\-\+,/_\=]*\}|\%|\_|\-)|[\x21-\x24\x26-\x7e]{1})*(?:\.(?:[a-zA-Z0-9]*[a-zA-Z]{1}[a-zA-Z0-9]*|(?:[a-zA-Z0-9]+\-(?:[a-zA-Z0-9]|\-)*[a-zA-Z0-9]))\.?|\%(?:\{[rctlsodipvhRCTLSODIPVH]\d*[r]?[\.\-\+,/_\=]*\}|\%|\_|\-))))?(?:(?:/(\d+))?(?://(\d+))?)?)|([eE][xX][iI][sS][tT][sS]\:((?:\%(?:\{[rctlsodipvhRCTLSODIPVH]\d*[r]?[\.\-\+,/_\=]*\}|\%|\_|\-)|[\x21-\x24\x26-\x7e]{1})*(?:\.(?:[a-zA-Z0-9]*[a-zA-Z]{1}[a-zA-Z0-9]*|(?:[a-zA-Z0-9]+\-(?:[a-zA-Z0-9]|\-)*[a-zA-Z0-9]))\.?|\%(?:\{[rctlsodipvhRCTLSODIPVH]\d*[r]?[\.\-\+,/_\=]*\}|\%|\_|\-))))|([iI][nN][cC][lL][uU][dD][eE]\:((?:\%(?:\{[rctlsodipvhRCTLSODIPVH]\d*[r]?[\.\-\+,/_\=]*\}|\%|\_|\-)|[\x21-\x24\x26-\x7e]{1})*(?:\.(?:[a-zA-Z0-9]*[a-zA-Z]{1}[a-zA-Z0-9]*|(?:[a-zA-Z0-9]+\-(?:[a-zA-Z0-9]|\-)*[a-zA-Z0-9]))\.?|\%(?:\{[rctlsodipvhRCTLSODIPVH]\d*[r]?[\.\-\+,/_\=]*\}|\%|\_|\-))))|([iI][pP][4]\:([0-9.]+)(?:/(\d+))?)|([iI][pP][6]\:([0-9A-Fa-f\:\.]+)(?:/(\d+))?)|([mM][xX](?:\:((?:\%(?:\{[rctlsodipvhRCTLSODIPVH]\d*[r]?[\.\-\+,/_\=]*\}|\%|\_|\-)|[\x21-\x24\x26-\x7e]{1})*(?:\.(?:[a-zA-Z0-9]*[a-zA-Z]{1}[a-zA-Z0-9]*|(?:[a-zA-Z0-9]+\-(?:[a-zA-Z0-9]|\-)*[a-zA-Z0-9]))\.?|\%(?:\{[rctlsodipvhRCTLSODIPVH]\d*[r]?[\.\-\+,/_\=]*\}|\%|\_|\-))))?(?:(?:/(\d+))?(?://(\d+))?)?)|([pP][tT][rR](?:\:((?:\%(?:\{[rctlsodipvhRCTLSODIPVH]\d*[r]?[\.\-\+,/_\=]*\}|\%|\_|\-)|[\x21-\x24\x26-\x7e]{1})*(?:\.(?:[a-zA-Z0-9]*[a-zA-Z]{1}[a-zA-Z0-9]*|(?:[a-zA-Z0-9]+\-(?:[a-zA-Z0-9]|\-)*[a-zA-Z0-9]))\.?|\%(?:\{[rctlsodipvhRCTLSODIPVH]\d*[r]?[\.\-\+,/_\=]*\}|\%|\_|\-))))?))))
org.apache.james.jspf.core.exceptions.PermErrorException: Term [badcontent!] is not syntactically
valid: (?:((?:([eE][xX][pP]\=((?:\%(?:\{[rctlsodipvhRCTLSODIPVH]\d*[r]?[\.\-\+,/_\=]*\}|\%|\_|\-)|[\x21-\x24\x26-\x7e]{1})*(?:\.(?:[a-zA-Z0-9]*[a-zA-Z]{1}[a-zA-Z0-9]*|(?:[a-zA-Z0-9]+\-(?:[a-zA-Z0-9]|\-)*[a-zA-Z0-9]))\.?|\%(?:\{[rctlsodipvhRCTLSODIPVH]\d*[r]?[\.\-\+,/_\=]*\}|\%|\_|\-))))|([rR][eE][dD][iI][rR][eE][cC][tT]\=((?:\%(?:\{[rctlsodipvhRCTLSODIPVH]\d*[r]?[\.\-\+,/_\=]*\}|\%|\_|\-)|[\x21-\x24\x26-\x7e]{1})*(?:\.(?:[a-zA-Z0-9]*[a-zA-Z]{1}[a-zA-Z0-9]*|(?:[a-zA-Z0-9]+\-(?:[a-zA-Z0-9]|\-)*[a-zA-Z0-9]))\.?|\%(?:\{[rctlsodipvhRCTLSODIPVH]\d*[r]?[\.\-\+,/_\=]*\}|\%|\_|\-))))|(([a-zA-Z]{1}[A-Za-z0-9\-\_\.]*)\=((?:\%(?:\{[rctlsodipvhRCTLSODIPVH]\d*[r]?[\.\-\+,/_\=]*\}|\%|\_|\-)|[\x21-\x24\x26-\x7e]{1})*))))|([\+\-\?\~]?)((?:([aA][lL][lL])|([aA](?:\:((?:\%(?:\{[rctlsodipvhRCTLSODIPVH]\d*[r]?[\.\-\+,/_\=]*\}|\%|\_|\-)|[\x21-\x24\x26-\x7e]{1})*(?:\.(?:[a-zA-Z0-9]*[a-zA-Z]{1}[a-zA-Z0-9]*|(?:[a-zA-Z0-9]+\-(?:[a-zA-Z0-9]|\-)*[a-zA-Z0-9]))\.?|\%(?:\{[rctlsodipvhRCTLSODIPVH]\d*[r]?[\.\-\+,/_\=]*\}|\%|\_|\-))))?(?:(?:/(\d+))?(?://(\d+))?)?)|([eE][xX][iI][sS][tT][sS]\:((?:\%(?:\{[rctlsodipvhRCTLSODIPVH]\d*[r]?[\.\-\+,/_\=]*\}|\%|\_|\-)|[\x21-\x24\x26-\x7e]{1})*(?:\.(?:[a-zA-Z0-9]*[a-zA-Z]{1}[a-zA-Z0-9]*|(?:[a-zA-Z0-9]+\-(?:[a-zA-Z0-9]|\-)*[a-zA-Z0-9]))\.?|\%(?:\{[rctlsodipvhRCTLSODIPVH]\d*[r]?[\.\-\+,/_\=]*\}|\%|\_|\-))))|([iI][nN][cC][lL][uU][dD][eE]\:((?:\%(?:\{[rctlsodipvhRCTLSODIPVH]\d*[r]?[\.\-\+,/_\=]*\}|\%|\_|\-)|[\x21-\x24\x26-\x7e]{1})*(?:\.(?:[a-zA-Z0-9]*[a-zA-Z]{1}[a-zA-Z0-9]*|(?:[a-zA-Z0-9]+\-(?:[a-zA-Z0-9]|\-)*[a-zA-Z0-9]))\.?|\%(?:\{[rctlsodipvhRCTLSODIPVH]\d*[r]?[\.\-\+,/_\=]*\}|\%|\_|\-))))|([iI][pP][4]\:([0-9.]+)(?:/(\d+))?)|([iI][pP][6]\:([0-9A-Fa-f\:\.]+)(?:/(\d+))?)|([mM][xX](?:\:((?:\%(?:\{[rctlsodipvhRCTLSODIPVH]\d*[r]?[\.\-\+,/_\=]*\}|\%|\_|\-)|[\x21-\x24\x26-\x7e]{1})*(?:\.(?:[a-zA-Z0-9]*[a-zA-Z]{1}[a-zA-Z0-9]*|(?:[a-zA-Z0-9]+\-(?:[a-zA-Z0-9]|\-)*[a-zA-Z0-9]))\.?|\%(?:\{[rctlsodipvhRCTLSODIPVH]\d*[r]?[\.\-\+,/_\=]*\}|\%|\_|\-))))?(?:(?:/(\d+))?(?://(\d+))?)?)|([pP][tT][rR](?:\:((?:\%(?:\{[rctlsodipvhRCTLSODIPVH]\d*[r]?[\.\-\+,/_\=]*\}|\%|\_|\-)|[\x21-\x24\x26-\x7e]{1})*(?:\.(?:[a-zA-Z0-9]*[a-zA-Z]{1}[a-zA-Z0-9]*|(?:[a-zA-Z0-9]+\-(?:[a-zA-Z0-9]|\-)*[a-zA-Z0-9]))\.?|\%(?:\{[rctlsodipvhRCTLSODIPVH]\d*[r]?[\.\-\+,/_\=]*\}|\%|\_|\-))))?))))
	at org.apache.james.jspf.parser.RFC4408SPF1Parser.parse(RFC4408SPF1Parser.java:277)
	at org.apache.james.jspf.policies.ParseRecordPolicy.getSPFRecord(ParseRecordPolicy.java:46)
	at org.apache.james.jspf.impl.SPF$SPFPolicyPostFilterChecker.checkSPF(SPF.java:171)
	at org.apache.james.jspf.executor.SynchronousSPFExecutor.execute(SynchronousSPFExecutor.java:54)
	at org.apache.james.jspf.impl.SPF.checkSPF(SPF.java:315)
	at org.apache.james.smtpserver.fastfail.SPFHandler.doSPFCheck(SPFHandler.java:121)
	at org.apache.james.smtpserver.fastfail.SPFHandler.doMail(SPFHandler.java:166)
	at org.apache.james.smtpserver.SPFHandlerTest.testSPFpermError(SPFHandlerTest.java:240)
	at sun.reflect.NativeMethodAccessorImpl.invoke0(Native Method)
	at sun.reflect.NativeMethodAccessorImpl.invoke(NativeMethodAccessorImpl.java:39)
	at sun.reflect.DelegatingMethodAccessorImpl.invoke(DelegatingMethodAccessorImpl.java:25)
	at java.lang.reflect.Method.invoke(Method.java:597)
	at org.junit.runners.model.FrameworkMethod$1.runReflectiveCall(FrameworkMethod.java:47)
	at org.junit.internal.runners.model.ReflectiveCallable.run(ReflectiveCallable.java:12)
	at org.junit.runners.model.FrameworkMethod.invokeExplosively(FrameworkMethod.java:44)
	at org.junit.internal.runners.statements.InvokeMethod.evaluate(InvokeMethod.java:17)
	at org.junit.internal.runners.statements.RunBefores.evaluate(RunBefores.java:26)
	at org.junit.runners.ParentRunner.runLeaf(ParentRunner.java:271)
	at org.junit.runners.BlockJUnit4ClassRunner.runChild(BlockJUnit4ClassRunner.java:70)
	at org.junit.runners.BlockJUnit4ClassRunner.runChild(BlockJUnit4ClassRunner.java:50)
	at org.junit.runners.ParentRunner$3.run(ParentRunner.java:238)
	at org.junit.runners.ParentRunner$1.schedule(ParentRunner.java:63)
	at org.junit.runners.ParentRunner.runChildren(ParentRunner.java:236)
	at org.junit.runners.ParentRunner.access$000(ParentRunner.java:53)
	at org.junit.runners.ParentRunner$2.evaluate(ParentRunner.java:229)
	at org.junit.runners.ParentRunner.run(ParentRunner.java:309)
	at org.apache.maven.surefire.junit4.JUnit4Provider.execute(JUnit4Provider.java:264)
	at org.apache.maven.surefire.junit4.JUnit4Provider.executeTestSet(JUnit4Provider.java:153)
	at org.apache.maven.surefire.junit4.JUnit4Provider.invoke(JUnit4Provider.java:124)
	at sun.reflect.NativeMethodAccessorImpl.invoke0(Native Method)
	at sun.reflect.NativeMethodAccessorImpl.invoke(NativeMethodAccessorImpl.java:39)
	at sun.reflect.DelegatingMethodAccessorImpl.invoke(DelegatingMethodAccessorImpl.java:25)
	at java.lang.reflect.Method.invoke(Method.java:597)
	at org.apache.maven.surefire.util.ReflectionUtils.invokeMethodWithArray2(ReflectionUtils.java:208)
	at org.apache.maven.surefire.booter.ProviderFactory$ProviderProxy.invoke(ProviderFactory.java:158)
	at org.apache.maven.surefire.booter.ProviderFactory.invokeProvider(ProviderFactory.java:86)
	at org.apache.maven.surefire.booter.ForkedBooter.runSuitesInProcess(ForkedBooter.java:153)
	at org.apache.maven.surefire.booter.ForkedBooter.main(ForkedBooter.java:95)
Result for 127.0.0.1 - test@spf4.james.apache.org - spf4.james.apache.org = permerror args=[]
2014-09-02 13:47:27,295 INFO  [main       ] [james.smtpserver.fastfail.SPFHandler        
     ] 221 Processed directive matched: -all returned -
Result for 127.0.0.1 - test@spf2.james.apache.org - spf2.james.apache.org = fail args=[]
2014-09-02 13:47:27,308 INFO  [main       ] [james.smtpserver.fastfail.SPFHandler        
     ] 221 Processed directive matched: +all returned +
Result for 127.0.0.1 - test@spf1.james.apache.org - spf1.james.apache.org = pass args=[]
2014-09-02 13:47:27,321 WARN  [main       ] [james.smtpserver.fastfail.SPFHandler        
     ] 277 Timeout querying dns
org.apache.james.jspf.core.exceptions.TempErrorException: Timeout querying dns
	at org.apache.james.jspf.policies.SPFRetriever$SPFRetrieverDNSResponseListener.onDNSResponse(SPFRetriever.java:101)
	at org.apache.james.jspf.executor.SynchronousSPFExecutor.execute(SynchronousSPFExecutor.java:64)
	at org.apache.james.jspf.impl.SPF.checkSPF(SPF.java:315)
	at org.apache.james.smtpserver.fastfail.SPFHandler.doSPFCheck(SPFHandler.java:121)
	at org.apache.james.smtpserver.fastfail.SPFHandler.doMail(SPFHandler.java:166)
	at org.apache.james.smtpserver.SPFHandlerTest.testSPFtempError(SPFHandlerTest.java:255)
	at sun.reflect.NativeMethodAccessorImpl.invoke0(Native Method)
	at sun.reflect.NativeMethodAccessorImpl.invoke(NativeMethodAccessorImpl.java:39)
	at sun.reflect.DelegatingMethodAccessorImpl.invoke(DelegatingMethodAccessorImpl.java:25)
	at java.lang.reflect.Method.invoke(Method.java:597)
	at org.junit.runners.model.FrameworkMethod$1.runReflectiveCall(FrameworkMethod.java:47)
	at org.junit.internal.runners.model.ReflectiveCallable.run(ReflectiveCallable.java:12)
	at org.junit.runners.model.FrameworkMethod.invokeExplosively(FrameworkMethod.java:44)
	at org.junit.internal.runners.statements.InvokeMethod.evaluate(InvokeMethod.java:17)
	at org.junit.internal.runners.statements.RunBefores.evaluate(RunBefores.java:26)
	at org.junit.runners.ParentRunner.runLeaf(ParentRunner.java:271)
	at org.junit.runners.BlockJUnit4ClassRunner.runChild(BlockJUnit4ClassRunner.java:70)
	at org.junit.runners.BlockJUnit4ClassRunner.runChild(BlockJUnit4ClassRunner.java:50)
	at org.junit.runners.ParentRunner$3.run(ParentRunner.java:238)
	at org.junit.runners.ParentRunner$1.schedule(ParentRunner.java:63)
	at org.junit.runners.ParentRunner.runChildren(ParentRunner.java:236)
	at org.junit.runners.ParentRunner.access$000(ParentRunner.java:53)
	at org.junit.runners.ParentRunner$2.evaluate(ParentRunner.java:229)
	at org.junit.runners.ParentRunner.run(ParentRunner.java:309)
	at org.apache.maven.surefire.junit4.JUnit4Provider.execute(JUnit4Provider.java:264)
	at org.apache.maven.surefire.junit4.JUnit4Provider.executeTestSet(JUnit4Provider.java:153)
	at org.apache.maven.surefire.junit4.JUnit4Provider.invoke(JUnit4Provider.java:124)
	at sun.reflect.NativeMethodAccessorImpl.invoke0(Native Method)
	at sun.reflect.NativeMethodAccessorImpl.invoke(NativeMethodAccessorImpl.java:39)
	at sun.reflect.DelegatingMethodAccessorImpl.invoke(DelegatingMethodAccessorImpl.java:25)
	at java.lang.reflect.Method.invoke(Method.java:597)
	at org.apache.maven.surefire.util.ReflectionUtils.invokeMethodWithArray2(ReflectionUtils.java:208)
	at org.apache.maven.surefire.booter.ProviderFactory$ProviderProxy.invoke(ProviderFactory.java:158)
	at org.apache.maven.surefire.booter.ProviderFactory.invokeProvider(ProviderFactory.java:86)
	at org.apache.maven.surefire.booter.ForkedBooter.runSuitesInProcess(ForkedBooter.java:153)
	at org.apache.maven.surefire.booter.ForkedBooter.main(ForkedBooter.java:95)
Result for 127.0.0.1 - test@spf5.james.apache.org - spf5.james.apache.org = temperror args=[]
Tests run: 8, Failures: 0, Errors: 0, Skipped: 0, Time elapsed: 0.507 sec
Running org.apache.james.smtpserver.ValidRcptMXTest
Tests run: 1, Failures: 0, Errors: 0, Skipped: 0, Time elapsed: 0.217 sec
Running org.apache.james.smtpserver.SpamAssassinHandlerTest
Rejected message from sender@james.apache.org from host localhost (127.0.0.1) This message
reach the spam hits treshold. Required rejection hits: 200.0 hits: 1000.0 args=[]
Tests run: 3, Failures: 0, Errors: 0, Skipped: 0, Time elapsed: 0.185 sec
Running org.apache.james.smtpserver.ValidRcptHandlerTest
Unknown user invalid check if its an alias args=[]
Rejected message. Unknown user: invalid@localhost args=[]
Unknown user user1 check if its an alias args=[]
Unknown user invalid check if its an alias args=[]
Rejected message. Unknown user: invalid@localhost args=[]
Unknown user user2 check if its an alias args=[]
Rejected message. Unknown user: user2@localhost args=[]
Tests run: 5, Failures: 0, Errors: 0, Skipped: 0, Time elapsed: 0.151 sec
Running org.apache.james.smtpserver.URIRBLHandlerTest
mime type is: "text/plain; charset=us-ascii" args=[]
scanning: "http://good.apache.org/" args=[]
Lookup apache.org.multi.surbl.org. args=[]
mime type is: "multipart/mixed; 
	boundary="----=_Part_0_135370635.1409665649039"" args=[]
multipart count is: 1 args=[]
recursing index: 0 args=[]
mime type is: "text/plain; charset=us-ascii" args=[]
scanning: "http://bad.domain.de/ http://good.apache.org/" args=[]
Lookup domain.de.multi.surbl.org. args=[]
mime type is: "text/plain; charset=us-ascii" args=[]
scanning: "http://bad.domain.de/" args=[]
Lookup domain.de.multi.surbl.org. args=[]
Tests run: 3, Failures: 0, Errors: 0, Skipped: 0, Time elapsed: 0.404 sec

Results :

Tests run: 65, Failures: 0, Errors: 0, Skipped: 1

[JENKINS] Recording test results

---------------------------------------------------------------------
To unsubscribe, e-mail: server-dev-unsubscribe@james.apache.org
For additional commands, e-mail: server-dev-help@james.apache.org


Mime
View raw message