james-server-dev mailing list archives

Site index · List index
Message view « Date » · « Thread »
Top « Date » · « Thread »
From Apache Jenkins Server <jenk...@builds.apache.org>
Subject Build failed in Jenkins: james-mailet #2527
Date Tue, 23 Sep 2014 04:06:43 GMT
See <https://builds.apache.org/job/james-mailet/2527/>

------------------------------------------
[...truncated 594 lines...]
[INFO] --- maven-site-plugin:3.2:attach-descriptor (attach-descriptor) @ apache-mailet ---
Downloading: http://repo.maven.apache.org/maven2/org/apache/maven/doxia/doxia-module-markdown/1.3/doxia-module-markdown-1.3.pom
Downloaded: http://repo.maven.apache.org/maven2/org/apache/maven/doxia/doxia-module-markdown/1.3/doxia-module-markdown-1.3.pom
(3 KB at 115.1 KB/sec)
Downloading: http://repo.maven.apache.org/maven2/org/pegdown/pegdown/1.0.2/pegdown-1.0.2.pom
Downloaded: http://repo.maven.apache.org/maven2/org/pegdown/pegdown/1.0.2/pegdown-1.0.2.pom
(2 KB at 104.7 KB/sec)
Downloading: http://repo.maven.apache.org/maven2/org/parboiled/parboiled-core/1.0.1/parboiled-core-1.0.1.pom
Downloaded: http://repo.maven.apache.org/maven2/org/parboiled/parboiled-core/1.0.1/parboiled-core-1.0.1.pom
(2 KB at 70.0 KB/sec)
Downloading: http://repo.maven.apache.org/maven2/org/parboiled/parboiled-java/1.0.1/parboiled-java-1.0.1.pom
Downloaded: http://repo.maven.apache.org/maven2/org/parboiled/parboiled-java/1.0.1/parboiled-java-1.0.1.pom
(3 KB at 126.1 KB/sec)
Downloading: http://repo.maven.apache.org/maven2/asm/asm-tree/3.3.1/asm-tree-3.3.1.pom
Downloaded: http://repo.maven.apache.org/maven2/asm/asm-tree/3.3.1/asm-tree-3.3.1.pom (406
B at 22.0 KB/sec)
Downloading: http://repo.maven.apache.org/maven2/asm/asm-parent/3.3.1/asm-parent-3.3.1.pom
Downloaded: http://repo.maven.apache.org/maven2/asm/asm-parent/3.3.1/asm-parent-3.3.1.pom
(5 KB at 235.0 KB/sec)
Downloading: http://repo.maven.apache.org/maven2/asm/asm/3.3.1/asm-3.3.1.pom
Downloaded: http://repo.maven.apache.org/maven2/asm/asm/3.3.1/asm-3.3.1.pom (266 B at 14.4
KB/sec)
Downloading: http://repo.maven.apache.org/maven2/asm/asm-util/3.3.1/asm-util-3.3.1.pom
Downloaded: http://repo.maven.apache.org/maven2/asm/asm-util/3.3.1/asm-util-3.3.1.pom (411
B at 22.3 KB/sec)
Downloading: http://repo.maven.apache.org/maven2/asm/asm-analysis/3.3.1/asm-analysis-3.3.1.pom
Downloaded: http://repo.maven.apache.org/maven2/asm/asm-analysis/3.3.1/asm-analysis-3.3.1.pom
(419 B at 22.7 KB/sec)
Downloading: http://repo.maven.apache.org/maven2/org/apache/maven/wagon/wagon-ssh/2.0/wagon-ssh-2.0.pom
Downloaded: http://repo.maven.apache.org/maven2/org/apache/maven/wagon/wagon-ssh/2.0/wagon-ssh-2.0.pom
(6 KB at 302.2 KB/sec)
Downloading: http://repo.maven.apache.org/maven2/com/jcraft/jsch/0.1.44-1/jsch-0.1.44-1.pom
Downloaded: http://repo.maven.apache.org/maven2/com/jcraft/jsch/0.1.44-1/jsch-0.1.44-1.pom
(4 KB at 184.3 KB/sec)
Downloading: http://repo.maven.apache.org/maven2/org/sonatype/oss/oss-parent/6/oss-parent-6.pom
Downloaded: http://repo.maven.apache.org/maven2/org/sonatype/oss/oss-parent/6/oss-parent-6.pom
(5 KB at 262.1 KB/sec)
Downloading: http://repo.maven.apache.org/maven2/org/codehaus/plexus/plexus-utils/1.4/plexus-utils-1.4.pom
Downloaded: http://repo.maven.apache.org/maven2/org/codehaus/plexus/plexus-utils/1.4/plexus-utils-1.4.pom
(2 KB at 62.4 KB/sec)
Downloading: http://repo.maven.apache.org/maven2/org/apache/maven/doxia/doxia-module-markdown/1.3/doxia-module-markdown-1.3.jar
Downloading: http://repo.maven.apache.org/maven2/org/pegdown/pegdown/1.0.2/pegdown-1.0.2.jar
Downloading: http://repo.maven.apache.org/maven2/org/parboiled/parboiled-core/1.0.1/parboiled-core-1.0.1.jar
Downloading: http://repo.maven.apache.org/maven2/org/parboiled/parboiled-java/1.0.1/parboiled-java-1.0.1.jar
Downloading: http://repo.maven.apache.org/maven2/asm/asm-tree/3.3.1/asm-tree-3.3.1.jar
Downloaded: http://repo.maven.apache.org/maven2/org/apache/maven/doxia/doxia-module-markdown/1.3/doxia-module-markdown-1.3.jar
(12 KB at 583.6 KB/sec)
Downloading: http://repo.maven.apache.org/maven2/asm/asm-util/3.3.1/asm-util-3.3.1.jar
Downloaded: http://repo.maven.apache.org/maven2/asm/asm-util/3.3.1/asm-util-3.3.1.jar (37
KB at 2005.4 KB/sec)
Downloading: http://repo.maven.apache.org/maven2/asm/asm-analysis/3.3.1/asm-analysis-3.3.1.jar
Downloaded: http://repo.maven.apache.org/maven2/org/pegdown/pegdown/1.0.2/pegdown-1.0.2.jar
(56 KB at 1512.9 KB/sec)
Downloading: http://repo.maven.apache.org/maven2/asm/asm/3.3.1/asm-3.3.1.jar
Downloaded: http://repo.maven.apache.org/maven2/asm/asm-tree/3.3.1/asm-tree-3.3.1.jar (22
KB at 600.1 KB/sec)
Downloading: http://repo.maven.apache.org/maven2/org/apache/maven/wagon/wagon-ssh/2.0/wagon-ssh-2.0.jar
Downloaded: http://repo.maven.apache.org/maven2/asm/asm-analysis/3.3.1/asm-analysis-3.3.1.jar
(18 KB at 996.0 KB/sec)
Downloading: http://repo.maven.apache.org/maven2/com/jcraft/jsch/0.1.44-1/jsch-0.1.44-1.jar
Downloaded: http://repo.maven.apache.org/maven2/asm/asm/3.3.1/asm-3.3.1.jar (43 KB at 1702.4
KB/sec)
Downloaded: http://repo.maven.apache.org/maven2/org/parboiled/parboiled-java/1.0.1/parboiled-java-1.0.1.jar
(81 KB at 1466.5 KB/sec)
Downloaded: http://repo.maven.apache.org/maven2/org/apache/maven/wagon/wagon-ssh/2.0/wagon-ssh-2.0.jar
(29 KB at 1171.2 KB/sec)
Downloaded: http://repo.maven.apache.org/maven2/org/parboiled/parboiled-core/1.0.1/parboiled-core-1.0.1.jar
(207 KB at 3039.4 KB/sec)
Downloaded: http://repo.maven.apache.org/maven2/com/jcraft/jsch/0.1.44-1/jsch-0.1.44-1.jar
(209 KB at 6734.5 KB/sec)
[INFO] 
[INFO] --- apache-rat-plugin:0.8:check (default) @ apache-mailet ---
Downloading: http://repo.maven.apache.org/maven2/org/apache/rat/apache-rat-core/0.8/apache-rat-core-0.8.pom
Downloaded: http://repo.maven.apache.org/maven2/org/apache/rat/apache-rat-core/0.8/apache-rat-core-0.8.pom
(3 KB at 138.7 KB/sec)
Downloading: http://repo.maven.apache.org/maven2/org/apache/commons/commons-compress/1.0/commons-compress-1.0.pom
Downloaded: http://repo.maven.apache.org/maven2/org/apache/commons/commons-compress/1.0/commons-compress-1.0.pom
(8 KB at 438.3 KB/sec)
Downloading: http://repo.maven.apache.org/maven2/org/apache/maven/maven-plugin-api/2.0.4/maven-plugin-api-2.0.4.pom
Downloaded: http://repo.maven.apache.org/maven2/org/apache/maven/maven-plugin-api/2.0.4/maven-plugin-api-2.0.4.pom
(643 B at 36.9 KB/sec)
Downloading: http://repo.maven.apache.org/maven2/org/apache/maven/doxia/doxia-site-renderer/1.0-alpha-8/doxia-site-renderer-1.0-alpha-8.pom
Downloaded: http://repo.maven.apache.org/maven2/org/apache/maven/doxia/doxia-site-renderer/1.0-alpha-8/doxia-site-renderer-1.0-alpha-8.pom
(2 KB at 77.0 KB/sec)
Downloading: http://repo.maven.apache.org/maven2/org/apache/maven/doxia/doxia/1.0-alpha-8/doxia-1.0-alpha-8.pom
Downloaded: http://repo.maven.apache.org/maven2/org/apache/maven/doxia/doxia/1.0-alpha-8/doxia-1.0-alpha-8.pom
(3 KB at 155.6 KB/sec)
Downloading: http://repo.maven.apache.org/maven2/org/apache/maven/maven-parent/1/maven-parent-1.pom
Downloaded: http://repo.maven.apache.org/maven2/org/apache/maven/maven-parent/1/maven-parent-1.pom
(7 KB at 330.4 KB/sec)
Downloading: http://repo.maven.apache.org/maven2/org/apache/apache/1/apache-1.pom
Downloaded: http://repo.maven.apache.org/maven2/org/apache/apache/1/apache-1.pom (4 KB at
185.0 KB/sec)
Downloading: http://repo.maven.apache.org/maven2/org/apache/maven/doxia/doxia-core/1.0-alpha-8/doxia-core-1.0-alpha-8.pom
Downloaded: http://repo.maven.apache.org/maven2/org/apache/maven/doxia/doxia-core/1.0-alpha-8/doxia-core-1.0-alpha-8.pom
(2 KB at 86.6 KB/sec)
Downloading: http://repo.maven.apache.org/maven2/oro/oro/2.0.7/oro-2.0.7.pom
Downloaded: http://repo.maven.apache.org/maven2/oro/oro/2.0.7/oro-2.0.7.pom (141 B at 7.6
KB/sec)
Downloading: http://repo.maven.apache.org/maven2/org/apache/maven/doxia/doxia-sink-api/1.0-alpha-8/doxia-sink-api-1.0-alpha-8.pom
Downloaded: http://repo.maven.apache.org/maven2/org/apache/maven/doxia/doxia-sink-api/1.0-alpha-8/doxia-sink-api-1.0-alpha-8.pom
(424 B at 23.0 KB/sec)
Downloading: http://repo.maven.apache.org/maven2/junit/junit/3.8.2/junit-3.8.2.pom
Downloaded: http://repo.maven.apache.org/maven2/junit/junit/3.8.2/junit-3.8.2.pom (747 B at
40.5 KB/sec)
Downloading: http://repo.maven.apache.org/maven2/org/codehaus/plexus/plexus-i18n/1.0-beta-6/plexus-i18n-1.0-beta-6.pom
Downloaded: http://repo.maven.apache.org/maven2/org/codehaus/plexus/plexus-i18n/1.0-beta-6/plexus-i18n-1.0-beta-6.pom
(771 B at 41.8 KB/sec)
Downloading: http://repo.maven.apache.org/maven2/org/codehaus/plexus/plexus-components/1.1.4/plexus-components-1.1.4.pom
Downloaded: http://repo.maven.apache.org/maven2/org/codehaus/plexus/plexus-components/1.1.4/plexus-components-1.1.4.pom
(3 KB at 112.4 KB/sec)
Downloading: http://repo.maven.apache.org/maven2/org/codehaus/plexus/plexus-velocity/1.1.3/plexus-velocity-1.1.3.pom
Downloaded: http://repo.maven.apache.org/maven2/org/codehaus/plexus/plexus-velocity/1.1.3/plexus-velocity-1.1.3.pom
(976 B at 50.2 KB/sec)
Downloading: http://repo.maven.apache.org/maven2/org/codehaus/plexus/plexus-components/1.1.5/plexus-components-1.1.5.pom
Downloaded: http://repo.maven.apache.org/maven2/org/codehaus/plexus/plexus-components/1.1.5/plexus-components-1.1.5.pom
(3 KB at 114.8 KB/sec)
Downloading: http://repo.maven.apache.org/maven2/velocity/velocity/1.4/velocity-1.4.pom
Downloaded: http://repo.maven.apache.org/maven2/velocity/velocity/1.4/velocity-1.4.pom (3
KB at 125.9 KB/sec)
Downloading: http://repo.maven.apache.org/maven2/velocity/velocity-dep/1.4/velocity-dep-1.4.pom
Downloaded: http://repo.maven.apache.org/maven2/velocity/velocity-dep/1.4/velocity-dep-1.4.pom
(2 KB at 102.9 KB/sec)
Downloading: http://repo.maven.apache.org/maven2/org/apache/maven/doxia/doxia-decoration-model/1.0-alpha-8/doxia-decoration-model-1.0-alpha-8.pom
Downloaded: http://repo.maven.apache.org/maven2/org/apache/maven/doxia/doxia-decoration-model/1.0-alpha-8/doxia-decoration-model-1.0-alpha-8.pom
(2 KB at 77.0 KB/sec)
Downloading: http://repo.maven.apache.org/maven2/org/apache/maven/reporting/maven-reporting-impl/2.0.4/maven-reporting-impl-2.0.4.pom
Downloaded: http://repo.maven.apache.org/maven2/org/apache/maven/reporting/maven-reporting-impl/2.0.4/maven-reporting-impl-2.0.4.pom
(2 KB at 94.9 KB/sec)
Downloading: http://repo.maven.apache.org/maven2/org/apache/maven/reporting/maven-reporting/2.0.4/maven-reporting-2.0.4.pom
Downloaded: http://repo.maven.apache.org/maven2/org/apache/maven/reporting/maven-reporting/2.0.4/maven-reporting-2.0.4.pom
(700 B at 38.0 KB/sec)
Downloading: http://repo.maven.apache.org/maven2/commons-validator/commons-validator/1.2.0/commons-validator-1.2.0.pom
Downloaded: http://repo.maven.apache.org/maven2/commons-validator/commons-validator/1.2.0/commons-validator-1.2.0.pom
(9 KB at 466.9 KB/sec)
Downloading: http://repo.maven.apache.org/maven2/xml-apis/xml-apis/2.0.2/xml-apis-2.0.2.pom
Downloaded: http://repo.maven.apache.org/maven2/xml-apis/xml-apis/2.0.2/xml-apis-2.0.2.pom
(346 B at 18.8 KB/sec)
Downloading: http://repo.maven.apache.org/maven2/org/apache/maven/doxia/doxia-core/1.0-alpha-7/doxia-core-1.0-alpha-7.pom
Downloaded: http://repo.maven.apache.org/maven2/org/apache/maven/doxia/doxia-core/1.0-alpha-7/doxia-core-1.0-alpha-7.pom
(2 KB at 73.1 KB/sec)
Downloading: http://repo.maven.apache.org/maven2/org/apache/maven/reporting/maven-reporting-api/2.0.4/maven-reporting-api-2.0.4.pom
Downloaded: http://repo.maven.apache.org/maven2/org/apache/maven/reporting/maven-reporting-api/2.0.4/maven-reporting-api-2.0.4.pom
(902 B at 46.4 KB/sec)
Downloading: http://repo.maven.apache.org/maven2/org/apache/maven/doxia/doxia-site-renderer/1.0-alpha-7/doxia-site-renderer-1.0-alpha-7.pom
Downloaded: http://repo.maven.apache.org/maven2/org/apache/maven/doxia/doxia-site-renderer/1.0-alpha-7/doxia-site-renderer-1.0-alpha-7.pom
(2 KB at 78.0 KB/sec)
Downloading: http://repo.maven.apache.org/maven2/org/codehaus/plexus/plexus-velocity/1.1.2/plexus-velocity-1.1.2.pom
Downloaded: http://repo.maven.apache.org/maven2/org/codehaus/plexus/plexus-velocity/1.1.2/plexus-velocity-1.1.2.pom
(8 KB at 412.1 KB/sec)
Downloading: http://repo.maven.apache.org/maven2/org/codehaus/plexus/plexus-container-default/1.0-alpha-7/plexus-container-default-1.0-alpha-7.pom
Downloaded: http://repo.maven.apache.org/maven2/org/codehaus/plexus/plexus-container-default/1.0-alpha-7/plexus-container-default-1.0-alpha-7.pom
(2 KB at 66.3 KB/sec)
Downloading: http://repo.maven.apache.org/maven2/plexus/plexus-containers/1.0.2/plexus-containers-1.0.2.pom
Downloaded: http://repo.maven.apache.org/maven2/plexus/plexus-containers/1.0.2/plexus-containers-1.0.2.pom
(471 B at 25.6 KB/sec)
Downloading: http://repo.maven.apache.org/maven2/plexus/plexus-root/1.0.3/plexus-root-1.0.3.pom
Downloaded: http://repo.maven.apache.org/maven2/plexus/plexus-root/1.0.3/plexus-root-1.0.3.pom
(6 KB at 326.6 KB/sec)
Downloading: http://repo.maven.apache.org/maven2/plexus/plexus-utils/1.0.2/plexus-utils-1.0.2.pom
Downloaded: http://repo.maven.apache.org/maven2/plexus/plexus-utils/1.0.2/plexus-utils-1.0.2.pom
(740 B at 38.0 KB/sec)
Downloading: http://repo.maven.apache.org/maven2/commons-logging/commons-logging-api/1.0.4/commons-logging-api-1.0.4.pom
Downloaded: http://repo.maven.apache.org/maven2/commons-logging/commons-logging-api/1.0.4/commons-logging-api-1.0.4.pom
(168 B at 9.1 KB/sec)
Downloading: http://repo.maven.apache.org/maven2/org/apache/maven/doxia/doxia-decoration-model/1.0-alpha-7/doxia-decoration-model-1.0-alpha-7.pom
Downloaded: http://repo.maven.apache.org/maven2/org/apache/maven/doxia/doxia-decoration-model/1.0-alpha-7/doxia-decoration-model-1.0-alpha-7.pom
(2 KB at 63.0 KB/sec)
Downloading: http://repo.maven.apache.org/maven2/org/apache/rat/apache-rat-core/0.8/apache-rat-core-0.8.jar
Downloading: http://repo.maven.apache.org/maven2/commons-collections/commons-collections/3.2/commons-collections-3.2.jar
Downloading: http://repo.maven.apache.org/maven2/org/apache/commons/commons-compress/1.0/commons-compress-1.0.jar
Downloading: http://repo.maven.apache.org/maven2/org/codehaus/plexus/plexus-utils/1.4/plexus-utils-1.4.jar
Downloading: http://repo.maven.apache.org/maven2/org/apache/maven/doxia/doxia-site-renderer/1.0-alpha-8/doxia-site-renderer-1.0-alpha-8.jar
Downloaded: http://repo.maven.apache.org/maven2/org/apache/rat/apache-rat-core/0.8/apache-rat-core-0.8.jar
(102 KB at 3917.3 KB/sec)
Downloading: http://repo.maven.apache.org/maven2/org/apache/maven/doxia/doxia-core/1.0-alpha-8/doxia-core-1.0-alpha-8.jar
Downloaded: http://repo.maven.apache.org/maven2/org/apache/maven/doxia/doxia-site-renderer/1.0-alpha-8/doxia-site-renderer-1.0-alpha-8.jar
(34 KB at 980.7 KB/sec)
Downloading: http://repo.maven.apache.org/maven2/org/apache/maven/doxia/doxia-sink-api/1.0-alpha-8/doxia-sink-api-1.0-alpha-8.jar
Downloaded: http://repo.maven.apache.org/maven2/org/apache/commons/commons-compress/1.0/commons-compress-1.0.jar
(141 KB at 2988.8 KB/sec)
Downloading: http://repo.maven.apache.org/maven2/org/codehaus/plexus/plexus-i18n/1.0-beta-6/plexus-i18n-1.0-beta-6.jar
Downloaded: http://repo.maven.apache.org/maven2/org/apache/maven/doxia/doxia-core/1.0-alpha-8/doxia-core-1.0-alpha-8.jar
(200 KB at 7670.1 KB/sec)
Downloading: http://repo.maven.apache.org/maven2/org/codehaus/plexus/plexus-velocity/1.1.3/plexus-velocity-1.1.3.jar
Downloaded: http://repo.maven.apache.org/maven2/org/apache/maven/doxia/doxia-sink-api/1.0-alpha-8/doxia-sink-api-1.0-alpha-8.jar
(7 KB at 363.7 KB/sec)
Downloading: http://repo.maven.apache.org/maven2/velocity/velocity/1.4/velocity-1.4.jar
Downloaded: http://repo.maven.apache.org/maven2/commons-collections/commons-collections/3.2/commons-collections-3.2.jar
(558 KB at 8855.1 KB/sec)
Downloading: http://repo.maven.apache.org/maven2/velocity/velocity-dep/1.4/velocity-dep-1.4.jar
Downloaded: http://repo.maven.apache.org/maven2/org/codehaus/plexus/plexus-i18n/1.0-beta-6/plexus-i18n-1.0-beta-6.jar
(12 KB at 617.2 KB/sec)
Downloading: http://repo.maven.apache.org/maven2/org/apache/maven/doxia/doxia-decoration-model/1.0-alpha-8/doxia-decoration-model-1.0-alpha-8.jar
Downloaded: http://repo.maven.apache.org/maven2/org/codehaus/plexus/plexus-utils/1.4/plexus-utils-1.4.jar
(178 KB at 2695.4 KB/sec)
Downloading: http://repo.maven.apache.org/maven2/org/apache/maven/reporting/maven-reporting-impl/2.0.4/maven-reporting-impl-2.0.4.jar
Downloaded: http://repo.maven.apache.org/maven2/org/codehaus/plexus/plexus-velocity/1.1.3/plexus-velocity-1.1.3.jar
(8 KB at 454.6 KB/sec)
Downloading: http://repo.maven.apache.org/maven2/commons-validator/commons-validator/1.2.0/commons-validator-1.2.0.jar
Downloaded: http://repo.maven.apache.org/maven2/org/apache/maven/doxia/doxia-decoration-model/1.0-alpha-8/doxia-decoration-model-1.0-alpha-8.jar
(40 KB at 2188.0 KB/sec)
Downloaded: http://repo.maven.apache.org/maven2/org/apache/maven/reporting/maven-reporting-impl/2.0.4/maven-reporting-impl-2.0.4.jar
(14 KB at 740.9 KB/sec)
Downloading: http://repo.maven.apache.org/maven2/commons-digester/commons-digester/1.6/commons-digester-1.6.jar
Downloading: http://repo.maven.apache.org/maven2/commons-logging/commons-logging/1.0.4/commons-logging-1.0.4.jar
Downloaded: http://repo.maven.apache.org/maven2/commons-validator/commons-validator/1.2.0/commons-validator-1.2.0.jar
(89 KB at 4448.9 KB/sec)
Downloading: http://repo.maven.apache.org/maven2/xml-apis/xml-apis/1.0.b2/xml-apis-1.0.b2.jar
Downloaded: http://repo.maven.apache.org/maven2/commons-logging/commons-logging/1.0.4/commons-logging-1.0.4.jar
(38 KB at 2062.4 KB/sec)
Downloading: http://repo.maven.apache.org/maven2/oro/oro/2.0.7/oro-2.0.7.jar
Downloaded: http://repo.maven.apache.org/maven2/velocity/velocity-dep/1.4/velocity-dep-1.4.jar
(506 KB at 11758.7 KB/sec)
Downloading: http://repo.maven.apache.org/maven2/org/apache/maven/reporting/maven-reporting-api/2.0.4/maven-reporting-api-2.0.4.jar
Downloaded: http://repo.maven.apache.org/maven2/xml-apis/xml-apis/1.0.b2/xml-apis-1.0.b2.jar
(107 KB at 4641.6 KB/sec)
Downloaded: http://repo.maven.apache.org/maven2/velocity/velocity/1.4/velocity-1.4.jar (353
KB at 5264.3 KB/sec)
Downloaded: http://repo.maven.apache.org/maven2/commons-digester/commons-digester/1.6/commons-digester-1.6.jar
(165 KB at 4328.9 KB/sec)
Downloaded: http://repo.maven.apache.org/maven2/org/apache/maven/reporting/maven-reporting-api/2.0.4/maven-reporting-api-2.0.4.jar
(5 KB at 304.4 KB/sec)
Downloaded: http://repo.maven.apache.org/maven2/oro/oro/2.0.7/oro-2.0.7.jar (64 KB at 2662.2
KB/sec)
[INFO] Exclude: NOTICE.*
[INFO] Exclude: LICENSE.*
[INFO] Exclude: release.properties
[INFO] Exclude: dist/**/*
[INFO] Exclude: **/.*
[INFO] Exclude: .*/**/*
[INFO] Exclude: **/.*/**/*
[INFO] Exclude: **/LICENSE*
[INFO] Exclude: **/target/**
[INFO] Exclude: **/*.iml
[INFO] Exclude: src/site/**
[INFO] 
[INFO] --- maven-install-plugin:2.3.1:install (default-install) @ apache-mailet ---
[INFO] Installing <https://builds.apache.org/job/james-mailet/ws/trunk/pom.xml> to /jenkins/maven-repositories/0/org/apache/james/apache-mailet/2.5.1-SNAPSHOT/apache-mailet-2.5.1-SNAPSHOT.pom
[INFO] Installing <https://builds.apache.org/job/james-mailet/ws/trunk/target/apache-mailet-2.5.1-SNAPSHOT-site.xml>
to /jenkins/maven-repositories/0/org/apache/james/apache-mailet/2.5.1-SNAPSHOT/apache-mailet-2.5.1-SNAPSHOT-site.xml
[INFO] 
[INFO] --- maven-deploy-plugin:2.7:deploy (default-deploy) @ apache-mailet ---
Downloading: http://repo.maven.apache.org/maven2/org/codehaus/plexus/plexus-utils/1.5.6/plexus-utils-1.5.6.jar
Downloaded: http://repo.maven.apache.org/maven2/org/codehaus/plexus/plexus-utils/1.5.6/plexus-utils-1.5.6.jar
(245 KB at 5825.6 KB/sec)
Downloading: https://repository.apache.org/content/repositories/snapshots/org/apache/james/apache-mailet/2.5.1-SNAPSHOT/maven-metadata.xml
[WARNING] Could not transfer metadata org.apache.james:apache-mailet:2.5.1-SNAPSHOT/maven-metadata.xml
from/to apache.snapshots.https (https://repository.apache.org/content/repositories/snapshots):
Not authorized, ReasonPhrase:Unauthorized.
[INFO] ------------------------------------------------------------------------
[INFO] Reactor Summary:
[INFO] 
[INFO] Apache James :: Mailets parent and aggregator ..... FAILURE [1:20.364s]
[INFO] Apache James :: Mailet API ........................ SKIPPED
[INFO] Apache James :: Basic Mailet Toolkit .............. SKIPPED
[INFO] Apache James :: Mailetdocs Maven Plugin ........... SKIPPED
[INFO] Apache James :: Crypto Mailets .................... SKIPPED
[INFO] Apache James :: Standard Mailets .................. SKIPPED
[INFO] Apache James :: AI Mailets ........................ SKIPPED
[INFO] ------------------------------------------------------------------------
[INFO] BUILD FAILURE
[INFO] ------------------------------------------------------------------------
[INFO] Total time: 1:28.566s
[INFO] Finished at: Tue Sep 23 04:06:16 UTC 2014
[INFO] Final Memory: 15M/67M
[INFO] ------------------------------------------------------------------------
Waiting for Jenkins to finish collecting data
[ERROR] Failed to execute goal org.apache.maven.plugins:maven-deploy-plugin:2.7:deploy (default-deploy)
on project apache-mailet: Failed to retrieve remote metadata org.apache.james:apache-mailet:2.5.1-SNAPSHOT/maven-metadata.xml:
Could not transfer metadata org.apache.james:apache-mailet:2.5.1-SNAPSHOT/maven-metadata.xml
from/to apache.snapshots.https (https://repository.apache.org/content/repositories/snapshots):
Not authorized, ReasonPhrase:Unauthorized. -> [Help 1]
[ERROR] 
[ERROR] To see the full stack trace of the errors, re-run Maven with the -e switch.
[ERROR] Re-run Maven using the -X switch to enable full debug logging.
[ERROR] 
[ERROR] For more information about the errors and possible solutions, please read the following
articles:
[ERROR] [Help 1] http://cwiki.apache.org/confluence/display/MAVEN/MojoExecutionException
[JENKINS] Archiving <https://builds.apache.org/job/james-mailet/ws/trunk/base/pom.xml>
to org.apache.james/apache-mailet-base/2.5.1-SNAPSHOT/apache-mailet-base-2.5.1-SNAPSHOT.pom
Sending artifact delta relative to james-mailet » Apache James :: Basic Mailet Toolkit #2526
Archived 1 artifacts
Archive block size is 32768
Received 0 blocks and 3572 bytes
Compression is 0.0%
Took 0.36 sec
[JENKINS] Archiving <https://builds.apache.org/job/james-mailet/ws/trunk/mailetdocs-maven-plugin/pom.xml>
to org.apache.james/mailetdocs-maven-plugin/2.5.1-SNAPSHOT/mailetdocs-maven-plugin-2.5.1-SNAPSHOT.pom
Sending artifact delta relative to james-mailet » Apache James :: Mailetdocs Maven Plugin
#2526
Archived 1 artifacts
Archive block size is 32768
Received 0 blocks and 3490 bytes
Compression is 0.0%
Took 2 sec
[JENKINS] Archiving <https://builds.apache.org/job/james-mailet/ws/trunk/pom.xml> to
org.apache.james/apache-mailet/2.5.1-SNAPSHOT/apache-mailet-2.5.1-SNAPSHOT.pom
[JENKINS] Archiving <https://builds.apache.org/job/james-mailet/ws/trunk/target/apache-mailet-2.5.1-SNAPSHOT-site.xml>
to org.apache.james/apache-mailet/2.5.1-SNAPSHOT/apache-mailet-2.5.1-SNAPSHOT-site.xml
Sending artifact delta relative to james-mailet » Apache James :: Mailets parent and aggregator
#2526
Archived 2 artifacts
Archive block size is 32768
Received 0 blocks and 14052 bytes
Compression is 0.0%
Took 0.29 sec
[JENKINS] Archiving <https://builds.apache.org/job/james-mailet/ws/trunk/api/pom.xml>
to org.apache.james/apache-mailet-api/2.5.1-SNAPSHOT/apache-mailet-api-2.5.1-SNAPSHOT.pom
Sending artifact delta relative to james-mailet » Apache James :: Mailet API #2526
Archived 1 artifacts
Archive block size is 32768
Received 0 blocks and 2094 bytes
Compression is 0.0%
Took 2 sec
[JENKINS] Archiving <https://builds.apache.org/job/james-mailet/ws/trunk/ai/pom.xml>
to org.apache.james/apache-mailet-ai/2.5.1-SNAPSHOT/apache-mailet-ai-2.5.1-SNAPSHOT.pom
Sending artifact delta relative to james-mailet » Apache James :: AI Mailets #2526
Archived 1 artifacts
Archive block size is 32768
Received 0 blocks and 2232 bytes
Compression is 0.0%
Took 0.28 sec
[JENKINS] Archiving <https://builds.apache.org/job/james-mailet/ws/trunk/crypto/pom.xml>
to org.apache.james/apache-mailet-crypto/2.5.1-SNAPSHOT/apache-mailet-crypto-2.5.1-SNAPSHOT.pom
Sending artifact delta relative to james-mailet » Apache James :: Crypto Mailets #2526
Archived 1 artifacts
Archive block size is 32768
Received 0 blocks and 3002 bytes
Compression is 0.0%
Took 0.29 sec
[JENKINS] Archiving <https://builds.apache.org/job/james-mailet/ws/trunk/standard/pom.xml>
to org.apache.james/apache-mailet-standard/2.5.1-SNAPSHOT/apache-mailet-standard-2.5.1-SNAPSHOT.pom
Sending artifact delta relative to james-mailet » Apache James :: Standard Mailets #2526
Archived 1 artifacts
Archive block size is 32768
Received 0 blocks and 3005 bytes
Compression is 0.0%
Took 0.36 sec
Sending e-mails to: server-dev@james.apache.org
channel stopped

---------------------------------------------------------------------
To unsubscribe, e-mail: server-dev-unsubscribe@james.apache.org
For additional commands, e-mail: server-dev-help@james.apache.org


Mime
View raw message