james-server-dev mailing list archives

Site index · List index
Message view « Date » · « Thread »
Top « Date » · « Thread »
From Apache Jenkins Server <jenk...@builds.apache.org>
Subject Build failed in Jenkins: james-server-trunk #4901
Date Sun, 11 Jan 2015 00:30:48 GMT
See <https://builds.apache.org/job/james-server-trunk/4901/>

------------------------------------------
[...truncated 2325 lines...]
Downloaded: http://repo.maven.apache.org/maven2/org/apache/maven/shared/maven-shared-incremental/1.0/maven-shared-incremental-1.0.jar
(13 KB at 188.5 KB/sec)
Downloading: http://repo.maven.apache.org/maven2/org/codehaus/plexus/plexus-compiler-javac/2.0/plexus-compiler-javac-2.0.jar
Downloaded: http://repo.maven.apache.org/maven2/com/google/code/findbugs/jsr305/2.0.1/jsr305-2.0.1.jar
(32 KB at 420.5 KB/sec)
Downloading: http://repo.maven.apache.org/maven2/org/apache/xbean/xbean-reflect/3.4/xbean-reflect-3.4.jar
Downloaded: http://repo.maven.apache.org/maven2/org/codehaus/plexus/plexus-compiler-api/2.0/plexus-compiler-api-2.0.jar
(25 KB at 325.3 KB/sec)
Downloading: http://repo.maven.apache.org/maven2/log4j/log4j/1.2.12/log4j-1.2.12.jar
Downloaded: http://repo.maven.apache.org/maven2/org/codehaus/plexus/plexus-compiler-manager/2.0/plexus-compiler-manager-2.0.jar
(5 KB at 127.3 KB/sec)
Downloading: http://repo.maven.apache.org/maven2/commons-logging/commons-logging-api/1.1/commons-logging-api-1.1.jar
Downloaded: http://repo.maven.apache.org/maven2/org/codehaus/plexus/plexus-compiler-javac/2.0/plexus-compiler-javac-2.0.jar
(19 KB at 376.3 KB/sec)
Downloading: http://repo.maven.apache.org/maven2/com/google/collections/google-collections/1.0/google-collections-1.0.jar
Downloaded: http://repo.maven.apache.org/maven2/org/apache/maven/shared/maven-shared-utils/0.1/maven-shared-utils-0.1.jar
(151 KB at 1197.6 KB/sec)
Downloaded: http://repo.maven.apache.org/maven2/commons-logging/commons-logging-api/1.1/commons-logging-api-1.1.jar
(44 KB at 1177.1 KB/sec)
Downloaded: http://repo.maven.apache.org/maven2/org/apache/xbean/xbean-reflect/3.4/xbean-reflect-3.4.jar
(131 KB at 1452.1 KB/sec)
Downloaded: http://repo.maven.apache.org/maven2/log4j/log4j/1.2.12/log4j-1.2.12.jar (350 KB
at 1870.0 KB/sec)
Downloaded: http://repo.maven.apache.org/maven2/com/google/collections/google-collections/1.0/google-collections-1.0.jar
(625 KB at 2528.8 KB/sec)
[INFO] Changes detected - recompiling the module!
[INFO] Compiling 14 source files to <https://builds.apache.org/job/james-server-trunk/ws/trunk/data/data-api/target/classes>
[INFO] -------------------------------------------------------------
[ERROR] COMPILATION ERROR : 
[INFO] -------------------------------------------------------------
[ERROR] No compiler is provided in this environment. Perhaps you are running on a JRE rather
than a JDK?
[INFO] 1 error
[INFO] -------------------------------------------------------------
[INFO] ------------------------------------------------------------------------
[INFO] Reactor Summary:
[INFO] 
[INFO] Apache James :: Server ............................ SUCCESS [51.658s]
[INFO] Apache James :: Server :: Data  :: API ............ FAILURE [13.468s]
[INFO] Apache James :: Server :: Lifecycle API ........... SKIPPED
[INFO] Apache James :: Server :: Filesystem API .......... SKIPPED
[INFO] Apache James :: Server :: Mailetcontainer API ..... SKIPPED
[INFO] Apache James :: Server :: Common Utilities ........ SKIPPED
[INFO] Apache James :: Server :: Protocols Library ....... SKIPPED
[INFO] Apache James :: Server :: Core .................... SKIPPED
[INFO] Apache James :: Server :: Container Spring ........ SKIPPED
[INFO] Apache James :: Server :: Client .................. SKIPPED
[INFO] Apache James :: Server :: DNS Service :: API ...... SKIPPED
[INFO] Apache James :: Server :: DNS Service :: Library .. SKIPPED
[INFO] Apache James :: Server :: Mail Queue :: API ....... SKIPPED
[INFO] Apache James :: Server :: Mailetcontainer Camel ... SKIPPED
[INFO] Apache James :: Server :: Mailbox Adapter ......... SKIPPED
[INFO] Apache James :: Server :: DNS Service :: Implementation  SKIPPED
[INFO] Apache James :: Server :: Data :: Library ......... SKIPPED
[INFO] Apache James :: Server :: Data :: LDAP Implementation  SKIPPED
[INFO] Apache James :: Server :: SMTP .................... SKIPPED
[INFO] Apache James :: Server :: IMAP .................... SKIPPED
[INFO] Apache James :: Server :: LMTP .................... SKIPPED
[INFO] Apache James :: Server :: POP3 .................... SKIPPED
[INFO] Apache James :: Server :: FetchMail ............... SKIPPED
[INFO] Apache James :: Server :: Mail Queue :: File ...... SKIPPED
[INFO] Apache James :: Server :: Mail Queue :: JMS ....... SKIPPED
[INFO] Apache James :: Server :: Mail Queue :: ActiveMQ .. SKIPPED
[INFO] Apache James :: Server :: Mailets ................. SKIPPED
[INFO] Apache James :: Server :: Data :: File Persistence  SKIPPED
[INFO] Apache James :: Server :: Data :: JPA Persistence . SKIPPED
[INFO] Apache James :: Server :: Data :: JDBC Persistence  SKIPPED
[INFO] Apache James :: Server :: Data :: HBase Persistence  SKIPPED
[INFO] Apache James :: Server :: Data :: JCR Persistence . SKIPPED
[INFO] Apache James :: Server :: App ..................... SKIPPED
[INFO] Apache James :: Karaf :: Features ................. SKIPPED
[INFO] Apache James :: Karaf :: James Server ............. SKIPPED
[INFO] Apache James :: Karaf :: Integration tests ........ SKIPPED
[INFO] ------------------------------------------------------------------------
[INFO] BUILD FAILURE
[INFO] ------------------------------------------------------------------------
[INFO] Total time: 1:18.066s
[INFO] Finished at: Sun Jan 11 00:29:20 UTC 2015
[INFO] Final Memory: 31M/195M
[INFO] ------------------------------------------------------------------------
Waiting for Jenkins to finish collecting data
[ERROR] Failed to execute goal org.apache.maven.plugins:maven-compiler-plugin:3.0:compile
(default-compile) on project james-server-data-api: Compilation failure
[ERROR] No compiler is provided in this environment. Perhaps you are running on a JRE rather
than a JDK?
[ERROR] -> [Help 1]
[ERROR] 
[ERROR] To see the full stack trace of the errors, re-run Maven with the -e switch.
[ERROR] Re-run Maven using the -X switch to enable full debug logging.
[ERROR] 
[ERROR] For more information about the errors and possible solutions, please read the following
articles:
[ERROR] [Help 1] http://cwiki.apache.org/confluence/display/MAVEN/MojoFailureException
[ERROR] 
[ERROR] After correcting the problems, you can resume the build with the command
[ERROR]   mvn <goals> -rf :james-server-data-api
[JENKINS] Archiving <https://builds.apache.org/job/james-server-trunk/ws/trunk/container/spring/pom.xml>
to org.apache.james/james-server-spring/3.0.0-beta5-SNAPSHOT/james-server-spring-3.0.0-beta5-SNAPSHOT.pom
No artifacts from james-server-trunk » Apache James :: Server :: Container Spring #4900 to
compare, so performing full copy of artifacts
[JENKINS] Archiving <https://builds.apache.org/job/james-server-trunk/ws/trunk/container/lifecycle-api/pom.xml>
to org.apache.james/james-server-lifecycle-api/3.0.0-beta5-SNAPSHOT/james-server-lifecycle-api-3.0.0-beta5-SNAPSHOT.pom
No artifacts from james-server-trunk » Apache James :: Server :: Lifecycle API #4900 to compare,
so performing full copy of artifacts
[JENKINS] Archiving <https://builds.apache.org/job/james-server-trunk/ws/trunk/container/cli/pom.xml>
to org.apache.james/james-server-cli/3.0.0-beta5-SNAPSHOT/james-server-cli-3.0.0-beta5-SNAPSHOT.pom
No artifacts from james-server-trunk » Apache James :: Server :: Client #4900 to compare,
so performing full copy of artifacts
[JENKINS] Archiving <https://builds.apache.org/job/james-server-trunk/ws/trunk/protocols/protocols-pop3/pom.xml>
to org.apache.james/james-server-protocols-pop3/3.0.0-beta5-SNAPSHOT/james-server-protocols-pop3-3.0.0-beta5-SNAPSHOT.pom
Sending artifact delta relative to james-server-trunk » Apache James :: Server :: POP3 #4898
Archived 1 artifacts
Archive block size is 32768
Received 0 blocks and 5434 bytes
Compression is 0.0%
Took 0.24 sec
[JENKINS] Archiving <https://builds.apache.org/job/james-server-trunk/ws/trunk/protocols/protocols-imap4/pom.xml>
to org.apache.james/james-server-protocols-imap4/3.0.0-beta5-SNAPSHOT/james-server-protocols-imap4-3.0.0-beta5-SNAPSHOT.pom
Sending artifact delta relative to james-server-trunk » Apache James :: Server :: IMAP #4899
Archived 1 artifacts
Archive block size is 32768
Received 0 blocks and 3426 bytes
Compression is 0.0%
Took 0.25 sec
[JENKINS] Archiving <https://builds.apache.org/job/james-server-trunk/ws/trunk/karaf/integration/pom.xml>
to org.apache.james.karaf/james-karaf-integration/3.0.0-beta5-SNAPSHOT/james-karaf-integration-3.0.0-beta5-SNAPSHOT.pom
Sending artifact delta relative to james-server-trunk » Apache James :: Karaf :: Integration
tests #4898
Archived 1 artifacts
Archive block size is 32768
Received 0 blocks and 4586 bytes
Compression is 0.0%
Took 0.24 sec
[JENKINS] Archiving <https://builds.apache.org/job/james-server-trunk/ws/trunk/data/data-api/pom.xml>
to org.apache.james/james-server-data-api/3.0.0-beta5-SNAPSHOT/james-server-data-api-3.0.0-beta5-SNAPSHOT.pom
No artifacts from james-server-trunk » Apache James :: Server :: Data  :: API #4900 to compare,
so performing full copy of artifacts
[JENKINS] Archiving <https://builds.apache.org/job/james-server-trunk/ws/trunk/container/util/pom.xml>
to org.apache.james/james-server-util/3.0.0-beta5-SNAPSHOT/james-server-util-3.0.0-beta5-SNAPSHOT.pom
No artifacts from james-server-trunk » Apache James :: Server :: Common Utilities #4900 to
compare, so performing full copy of artifacts
[JENKINS] Archiving <https://builds.apache.org/job/james-server-trunk/ws/trunk/data/data-jcr/pom.xml>
to org.apache.james/james-server-data-jcr/3.0.0-beta5-SNAPSHOT/james-server-data-jcr-3.0.0-beta5-SNAPSHOT.pom
Sending artifact delta relative to james-server-trunk » Apache James :: Server :: Data ::
JCR Persistence #4898
Archived 1 artifacts
Archive block size is 32768
Received 0 blocks and 4328 bytes
Compression is 0.0%
Took 0.24 sec
[JENKINS] Archiving <https://builds.apache.org/job/james-server-trunk/ws/trunk/karaf/distribution/pom.xml>
to org.apache.james.karaf/james-karaf-distribution/3.0.0-beta5-SNAPSHOT/james-karaf-distribution-3.0.0-beta5-SNAPSHOT.pom
Sending artifact delta relative to james-server-trunk » Apache James :: Karaf :: James Server
#4898
Archived 1 artifacts
Archive block size is 32768
Received 0 blocks and 6663 bytes
Compression is 0.0%
Took 0.87 sec
[JENKINS] Archiving <https://builds.apache.org/job/james-server-trunk/ws/trunk/queue/queue-jms/pom.xml>
to org.apache.james/james-server-queue-jms/3.0.0-beta5-SNAPSHOT/james-server-queue-jms-3.0.0-beta5-SNAPSHOT.pom
Sending artifact delta relative to james-server-trunk » Apache James :: Server :: Mail Queue
:: JMS #4898
Archived 1 artifacts
Archive block size is 32768
Received 0 blocks and 4524 bytes
Compression is 0.0%
Took 0.24 sec
[JENKINS] Archiving <https://builds.apache.org/job/james-server-trunk/ws/trunk/container/filesystem-api/pom.xml>
to org.apache.james/james-server-filesystem-api/3.0.0-beta5-SNAPSHOT/james-server-filesystem-api-3.0.0-beta5-SNAPSHOT.pom
No artifacts from james-server-trunk » Apache James :: Server :: Filesystem API #4900 to
compare, so performing full copy of artifacts
[JENKINS] Archiving <https://builds.apache.org/job/james-server-trunk/ws/trunk/mailet/mailetcontainer-api/pom.xml>
to org.apache.james/james-server-mailetcontainer-api/3.0.0-beta5-SNAPSHOT/james-server-mailetcontainer-api-3.0.0-beta5-SNAPSHOT.pom
No artifacts from james-server-trunk » Apache James :: Server :: Mailetcontainer API #4900
to compare, so performing full copy of artifacts
[JENKINS] Archiving <https://builds.apache.org/job/james-server-trunk/ws/trunk/mailet/mailets/pom.xml>
to org.apache.james/james-server-mailets/3.0.0-beta5-SNAPSHOT/james-server-mailets-3.0.0-beta5-SNAPSHOT.pom
Sending artifact delta relative to james-server-trunk » Apache James :: Server :: Mailets
#4898
Archived 1 artifacts
Archive block size is 32768
Received 0 blocks and 6589 bytes
Compression is 0.0%
Took 0.24 sec
[JENKINS] Archiving <https://builds.apache.org/job/james-server-trunk/ws/trunk/protocols/protocols-lmtp/pom.xml>
to org.apache.james/james-server-protocols-lmtp/3.0.0-beta5-SNAPSHOT/james-server-protocols-lmtp-3.0.0-beta5-SNAPSHOT.pom
Sending artifact delta relative to james-server-trunk » Apache James :: Server :: LMTP #4899
Archived 1 artifacts
Archive block size is 32768
Received 0 blocks and 5241 bytes
Compression is 0.0%
Took 0.23 sec
[JENKINS] Archiving <https://builds.apache.org/job/james-server-trunk/ws/trunk/queue/queue-activemq/pom.xml>
to org.apache.james/james-server-queue-activemq/3.0.0-beta5-SNAPSHOT/james-server-queue-activemq-3.0.0-beta5-SNAPSHOT.pom
Sending artifact delta relative to james-server-trunk » Apache James :: Server :: Mail Queue
:: ActiveMQ #4898
Archived 1 artifacts
Archive block size is 32768
Received 0 blocks and 5095 bytes
Compression is 0.0%
Took 0.23 sec
[JENKINS] Archiving <https://builds.apache.org/job/james-server-trunk/ws/trunk/data/data-library/pom.xml>
to org.apache.james/james-server-data-library/3.0.0-beta5-SNAPSHOT/james-server-data-library-3.0.0-beta5-SNAPSHOT.pom
No artifacts from james-server-trunk » Apache James :: Server :: Data :: Library #4900 to
compare, so performing full copy of artifacts
[JENKINS] Archiving <https://builds.apache.org/job/james-server-trunk/ws/trunk/mailet/mailetcontainer-camel/pom.xml>
to org.apache.james/james-server-mailetcontainer-camel/3.0.0-beta5-SNAPSHOT/james-server-mailetcontainer-camel-3.0.0-beta5-SNAPSHOT.pom
No artifacts from james-server-trunk » Apache James :: Server :: Mailetcontainer Camel #4900
to compare, so performing full copy of artifacts
[JENKINS] Archiving <https://builds.apache.org/job/james-server-trunk/ws/trunk/pom.xml>
to org.apache.james/james-server/3.0.0-beta5-SNAPSHOT/james-server-3.0.0-beta5-SNAPSHOT.pom
[JENKINS] Archiving <https://builds.apache.org/job/james-server-trunk/ws/trunk/target/james-server-3.0.0-beta5-SNAPSHOT.jar>
to org.apache.james/james-server/3.0.0-beta5-20150111.002843-1134/james-server-3.0.0-beta5-20150111.002843-1134.pom
[JENKINS] Archiving <https://builds.apache.org/job/james-server-trunk/ws/trunk/target/james-server-3.0.0-beta5-SNAPSHOT-tests.jar>
to org.apache.james/james-server/3.0.0-beta5-20150111.002843-1134/james-server-3.0.0-beta5-20150111.002843-1134-tests.jar
[JENKINS] Archiving <https://builds.apache.org/job/james-server-trunk/ws/trunk/target/james-server-3.0.0-beta5-SNAPSHOT-site.xml>
to org.apache.james/james-server/3.0.0-beta5-20150111.002843-1134/james-server-3.0.0-beta5-20150111.002843-1134-site.xml
No artifacts from james-server-trunk » Apache James :: Server #4900 to compare, so performing
full copy of artifacts
[JENKINS] Archiving <https://builds.apache.org/job/james-server-trunk/ws/trunk/dns-service/dnsservice-dnsjava/pom.xml>
to org.apache.james/james-server-dnsservice-dnsjava/3.0.0-beta5-SNAPSHOT/james-server-dnsservice-dnsjava-3.0.0-beta5-SNAPSHOT.pom
No artifacts from james-server-trunk » Apache James :: Server :: DNS Service :: Implementation
#4900 to compare, so performing full copy of artifacts
[JENKINS] Archiving <https://builds.apache.org/job/james-server-trunk/ws/trunk/data/data-ldap/pom.xml>
to org.apache.james/james-server-data-ldap/3.0.0-beta5-SNAPSHOT/james-server-data-ldap-3.0.0-beta5-SNAPSHOT.pom
No artifacts from james-server-trunk » Apache James :: Server :: Data :: LDAP Implementation
#4900 to compare, so performing full copy of artifacts
[JENKINS] Archiving <https://builds.apache.org/job/james-server-trunk/ws/trunk/protocols/fetchmail/pom.xml>
to org.apache.james/james-server-fetchmail/3.0.0-beta5-SNAPSHOT/james-server-fetchmail-3.0.0-beta5-SNAPSHOT.pom
Sending artifact delta relative to james-server-trunk » Apache James :: Server :: FetchMail
#4898
Archived 1 artifacts
Archive block size is 32768
Received 0 blocks and 3732 bytes
Compression is 0.0%
Took 0.24 sec
[JENKINS] Archiving <https://builds.apache.org/job/james-server-trunk/ws/trunk/dns-service/dnsservice-library/pom.xml>
to org.apache.james/james-server-dnsservice-library/3.0.0-beta5-SNAPSHOT/james-server-dnsservice-library-3.0.0-beta5-SNAPSHOT.pom
No artifacts from james-server-trunk » Apache James :: Server :: DNS Service :: Library #4900
to compare, so performing full copy of artifacts
[JENKINS] Archiving <https://builds.apache.org/job/james-server-trunk/ws/trunk/protocols/protocols-smtp/pom.xml>
to org.apache.james/james-server-protocols-smtp/3.0.0-beta5-SNAPSHOT/james-server-protocols-smtp-3.0.0-beta5-SNAPSHOT.pom
Sending artifact delta relative to james-server-trunk » Apache James :: Server :: SMTP #4899
Archived 1 artifacts
Archive block size is 32768
Received 0 blocks and 8295 bytes
Compression is 0.0%
Took 0.24 sec
[JENKINS] Archiving <https://builds.apache.org/job/james-server-trunk/ws/trunk/data/data-jpa/pom.xml>
to org.apache.james/james-server-data-jpa/3.0.0-beta5-SNAPSHOT/james-server-data-jpa-3.0.0-beta5-SNAPSHOT.pom
Sending artifact delta relative to james-server-trunk » Apache James :: Server :: Data ::
JPA Persistence #4898
Archived 1 artifacts
Archive block size is 32768
Received 0 blocks and 6541 bytes
Compression is 0.0%
Took 0.24 sec
[JENKINS] Archiving <https://builds.apache.org/job/james-server-trunk/ws/trunk/queue/queue-api/pom.xml>
to org.apache.james/james-server-queue-api/3.0.0-beta5-SNAPSHOT/james-server-queue-api-3.0.0-beta5-SNAPSHOT.pom
No artifacts from james-server-trunk » Apache James :: Server :: Mail Queue :: API #4900
to compare, so performing full copy of artifacts
[JENKINS] Archiving <https://builds.apache.org/job/james-server-trunk/ws/trunk/karaf/features/pom.xml>
to org.apache.james.karaf/james-karaf-features/3.0.0-beta5-SNAPSHOT/james-karaf-features-3.0.0-beta5-SNAPSHOT.pom
Sending artifact delta relative to james-server-trunk » Apache James :: Karaf :: Features
#4898
Archived 1 artifacts
Archive block size is 32768
Received 0 blocks and 3893 bytes
Compression is 0.0%
Took 0.24 sec
[JENKINS] Archiving <https://builds.apache.org/job/james-server-trunk/ws/trunk/app/pom.xml>
to org.apache.james/james-server-app/3.0.0-beta5-SNAPSHOT/james-server-app-3.0.0-beta5-SNAPSHOT.pom
Sending artifact delta relative to james-server-trunk » Apache James :: Server :: App #4898
Archived 1 artifacts
Archive block size is 32768
Received 1 blocks and 18444 bytes
Compression is 64.0%
Took 3.3 sec
[JENKINS] Archiving <https://builds.apache.org/job/james-server-trunk/ws/trunk/protocols/protocols-library/pom.xml>
to org.apache.james/james-server-protocols-library/3.0.0-beta5-SNAPSHOT/james-server-protocols-library-3.0.0-beta5-SNAPSHOT.pom
No artifacts from james-server-trunk » Apache James :: Server :: Protocols Library #4900
to compare, so performing full copy of artifacts
[JENKINS] Archiving <https://builds.apache.org/job/james-server-trunk/ws/trunk/container/mailbox-adapter/pom.xml>
to org.apache.james/james-server-mailbox-adapter/3.0.0-beta5-SNAPSHOT/james-server-mailbox-adapter-3.0.0-beta5-SNAPSHOT.pom
No artifacts from james-server-trunk » Apache James :: Server :: Mailbox Adapter #4900 to
compare, so performing full copy of artifacts
[JENKINS] Archiving <https://builds.apache.org/job/james-server-trunk/ws/trunk/queue/queue-file/pom.xml>
to org.apache.james/james-server-queue-file/3.0.0-beta5-SNAPSHOT/james-server-queue-file-3.0.0-beta5-SNAPSHOT.pom
Sending artifact delta relative to james-server-trunk » Apache James :: Server :: Mail Queue
:: File #4898
Archived 1 artifacts
Archive block size is 32768
Received 0 blocks and 2643 bytes
Compression is 0.0%
Took 0.24 sec
[JENKINS] Archiving <https://builds.apache.org/job/james-server-trunk/ws/trunk/container/core/pom.xml>
to org.apache.james/james-server-core/3.0.0-beta5-SNAPSHOT/james-server-core-3.0.0-beta5-SNAPSHOT.pom
No artifacts from james-server-trunk » Apache James :: Server :: Core #4900 to compare, so
performing full copy of artifacts
[JENKINS] Archiving <https://builds.apache.org/job/james-server-trunk/ws/trunk/data/data-file/pom.xml>
to org.apache.james/james-server-data-file/3.0.0-beta5-SNAPSHOT/james-server-data-file-3.0.0-beta5-SNAPSHOT.pom
Sending artifact delta relative to james-server-trunk » Apache James :: Server :: Data ::
File Persistence #4898
Archived 1 artifacts
Archive block size is 32768
Received 0 blocks and 4615 bytes
Compression is 0.0%
Took 0.25 sec
[JENKINS] Archiving <https://builds.apache.org/job/james-server-trunk/ws/trunk/data/data-jdbc/pom.xml>
to org.apache.james/james-server-data-jdbc/3.0.0-beta5-SNAPSHOT/james-server-data-jdbc-3.0.0-beta5-SNAPSHOT.pom
Sending artifact delta relative to james-server-trunk » Apache James :: Server :: Data ::
JDBC Persistence #4898
Archived 1 artifacts
Archive block size is 32768
Received 0 blocks and 4893 bytes
Compression is 0.0%
Took 0.24 sec
[JENKINS] Archiving <https://builds.apache.org/job/james-server-trunk/ws/trunk/data/data-hbase/pom.xml>
to org.apache.james/james-server-data-hbase/3.0.0-beta5-SNAPSHOT/james-server-data-hbase-3.0.0-beta5-SNAPSHOT.pom
Sending artifact delta relative to james-server-trunk » Apache James :: Server :: Data ::
HBase Persistence #4898
Archived 1 artifacts
Archive block size is 32768
Received 0 blocks and 7184 bytes
Compression is 0.0%
Took 0.23 sec
[JENKINS] Archiving <https://builds.apache.org/job/james-server-trunk/ws/trunk/dns-service/dnsservice-api/pom.xml>
to org.apache.james/james-server-dnsservice-api/3.0.0-beta5-SNAPSHOT/james-server-dnsservice-api-3.0.0-beta5-SNAPSHOT.pom
No artifacts from james-server-trunk » Apache James :: Server :: DNS Service :: API #4900
to compare, so performing full copy of artifacts
Sending e-mails to: server-dev@james.apache.org
channel stopped

---------------------------------------------------------------------
To unsubscribe, e-mail: server-dev-unsubscribe@james.apache.org
For additional commands, e-mail: server-dev-help@james.apache.org


Mime
View raw message