james-server-dev mailing list archives

Site index · List index
Message view « Date » · « Thread »
Top « Date » · « Thread »
From Apache Jenkins Server <jenk...@builds.apache.org>
Subject Build failed in Jenkins: james-server-trunk » Apache James :: Server :: SMTP #5021
Date Wed, 04 Mar 2015 01:25:43 GMT
See <https://builds.apache.org/job/james-server-trunk/org.apache.james$james-server-protocols-smtp/5021/>

------------------------------------------
[...truncated 647 lines...]
2015-03-04 01:04:02,654 INFO  [main       ] [SMTP                                        
     ] 187 SMTP Service bound to: localhost:8008
2015-03-04 01:04:02,654 INFO  [main       ] [SMTP                                        
     ] 347 SMTP Service is running on: priapus.apache.org
2015-03-04 01:04:02,655 INFO  [main       ] [SMTP                                        
     ] 360 SMTP Service handler hello name is: priapus.apache.org
2015-03-04 01:04:02,655 INFO  [main       ] [SMTP                                        
     ] 205 SMTP Service handler connection timeout is: 360000
2015-03-04 01:04:02,655 INFO  [main       ] [SMTP                                        
     ] 210 SMTP Service connection backlog is: 200
2015-03-04 01:04:02,656 INFO  [main       ] [SMTP                                        
     ] 130 This SMTP server does not require authentication.
2015-03-04 01:04:02,656 INFO  [main       ] [SMTP                                        
     ] 162 No maximum message size is enforced for this server.
2015-03-04 01:04:02,685 INFO  [main       ] [SMTP                                        
     ] 277 Init SMTP Service done
2015-03-04 01:04:02,687 INFO  [executor-2 ] [SMTP                                        
     ] 69 Id='957258365' User='' Connection established from 127.0.0.1
2015-03-04 01:04:02,691 INFO  [executor-9 ] [SMTP                                        
     ] 69 Id='957258365' User='' org.apache.james.smtpserver.AuthRequiredToRelayRcptHook:
result=2 (DENY)
2015-03-04 01:04:02,692 INFO  [main       ] [SMTP                                        
     ] 286 Dispose SMTP Service
2015-03-04 01:04:02,694 INFO  [executor-12] [SMTP                                        
     ] 69 Id='957258365' User='' Connection closed for 127.0.0.1
2015-03-04 01:04:02,698 INFO  [main       ] [SMTP                                        
     ] 298 Dispose SMTP Service done
2015-03-04 01:04:02,700 INFO  [main       ] [SMTP                                        
     ] 187 SMTP Service bound to: localhost:8009
2015-03-04 01:04:02,700 INFO  [main       ] [SMTP                                        
     ] 347 SMTP Service is running on: priapus.apache.org
2015-03-04 01:04:02,701 INFO  [main       ] [SMTP                                        
     ] 360 SMTP Service handler hello name is: priapus.apache.org
2015-03-04 01:04:02,701 INFO  [main       ] [SMTP                                        
     ] 205 SMTP Service handler connection timeout is: 360000
2015-03-04 01:04:02,701 INFO  [main       ] [SMTP                                        
     ] 210 SMTP Service connection backlog is: 200
2015-03-04 01:04:02,702 INFO  [main       ] [SMTP                                        
     ] 128 This SMTP server requires authentication.
2015-03-04 01:04:02,702 INFO  [main       ] [SMTP                                        
     ] 162 No maximum message size is enforced for this server.
2015-03-04 01:04:02,725 INFO  [main       ] [SMTP                                        
     ] 277 Init SMTP Service done
2015-03-04 01:04:02,728 INFO  [executor-2 ] [SMTP                                        
     ] 69 Id='108904930' User='' Connection established from 127.0.0.1
2015-03-04 01:04:02,731 INFO  [executor-7 ] [SMTP                                        
     ] 69 Id='108904930' User='' AUTH method FOO is an unrecognized authentication type
2015-03-04 01:04:02,733 INFO  [executor-11] [SMTP                                        
     ] 69 Id='108904930' User='' org.apache.james.smtpserver.AuthRequiredToRelayRcptHook:
result=2 (DENY)
2015-03-04 01:04:02,735 ERROR [executor-15] [SMTP                                        
     ] 85 Id='108904930' User='' AUTH method PLAIN failed from noexist_test_user_smtp@127.0.0.1
2015-03-04 01:04:02,737 ERROR [executor-3 ] [SMTP                                        
     ] 85 Id='108904930' User='' AUTH method PLAIN failed from test_user_smtp@127.0.0.1
2015-03-04 01:04:02,744 INFO  [executor-14] [SMTP                                        
     ] 69 Id='108904930' User='test_user_smtp' Successfully spooled mail Mail1425431042743-65c8c441-dec5-4ea2-aa89-f1bdd926f129
from test_user_smtp@localhost on localhost/127.0.0.1 for [mail@sample.com]
2015-03-04 01:04:02,745 INFO  [main       ] [SMTP                                        
     ] 286 Dispose SMTP Service
2015-03-04 01:04:02,746 INFO  [executor-1 ] [SMTP                                        
     ] 69 Id='108904930' User='test_user_smtp' Connection closed for 127.0.0.1
2015-03-04 01:04:02,750 INFO  [main       ] [SMTP                                        
     ] 298 Dispose SMTP Service done
2015-03-04 01:04:02,753 INFO  [main       ] [SMTP                                        
     ] 187 SMTP Service bound to: localhost:8010
2015-03-04 01:04:02,753 INFO  [main       ] [SMTP                                        
     ] 347 SMTP Service is running on: priapus.apache.org
2015-03-04 01:04:02,754 INFO  [main       ] [SMTP                                        
     ] 360 SMTP Service handler hello name is: priapus.apache.org
2015-03-04 01:04:02,754 INFO  [main       ] [SMTP                                        
     ] 205 SMTP Service handler connection timeout is: 360000
2015-03-04 01:04:02,754 INFO  [main       ] [SMTP                                        
     ] 210 SMTP Service connection backlog is: 200
2015-03-04 01:04:02,754 INFO  [main       ] [SMTP                                        
     ] 130 This SMTP server does not require authentication.
2015-03-04 01:04:02,755 INFO  [main       ] [SMTP                                        
     ] 162 No maximum message size is enforced for this server.
2015-03-04 01:04:02,777 INFO  [main       ] [SMTP                                        
     ] 277 Init SMTP Service done
2015-03-04 01:04:02,780 INFO  [executor-2 ] [SMTP                                        
     ] 69 Id='643584378' User='' Connection established from 127.0.0.1
2015-03-04 01:04:02,785 INFO  [executor-9 ] [SMTP                                        
     ] 69 Id='643584378' User='' org.apache.james.smtpserver.fastfail.ResolvableEhloHeloHandler:
result=2 (DENY)
Killed
Running org.apache.james.smtpserver.SpamAssassinHandlerTest
Rejected message from sender@james.apache.org from host localhost (127.0.0.1) This message
reach the spam hits treshold. Required rejection hits: 200.0 hits: 1000.0 args=[]
Tests run: 3, Failures: 0, Errors: 0, Skipped: 0, Time elapsed: 0.213 sec
Running org.apache.james.smtpserver.ValidRcptHandlerTest
Unknown user invalid check if its an alias args=[]
Rejected message. Unknown user: invalid@localhost args=[]
Unknown user user1 check if its an alias args=[]
Unknown user invalid check if its an alias args=[]
Rejected message. Unknown user: invalid@localhost args=[]
Unknown user user2 check if its an alias args=[]
Rejected message. Unknown user: user2@localhost args=[]
Tests run: 5, Failures: 0, Errors: 0, Skipped: 0, Time elapsed: 0.148 sec
Running org.apache.james.smtpserver.ValidRcptMXTest
Tests run: 1, Failures: 0, Errors: 0, Skipped: 0, Time elapsed: 0.268 sec
Running org.apache.james.smtpserver.URIRBLHandlerTest
mime type is: "text/plain; charset=us-ascii" args=[]
scanning: "http://good.apache.org/" args=[]
Lookup apache.org.multi.surbl.org. args=[]
mime type is: "multipart/mixed; 
	boundary="----=_Part_0_1221070182.1425432310158"" args=[]
multipart count is: 1 args=[]
recursing index: 0 args=[]
mime type is: "text/plain; charset=us-ascii" args=[]
scanning: "http://bad.domain.de/ http://good.apache.org/" args=[]
Lookup domain.de.multi.surbl.org. args=[]
mime type is: "text/plain; charset=us-ascii" args=[]
scanning: "http://bad.domain.de/" args=[]
Lookup domain.de.multi.surbl.org. args=[]
Tests run: 3, Failures: 0, Errors: 0, Skipped: 0, Time elapsed: 0.442 sec
Running org.apache.james.smtpserver.SPFHandlerTest
2015-03-04 01:25:10,761 WARN  [main       ] [james.smtpserver.fastfail.SPFHandler        
     ] 277 No SPF record found for host: spf6.james.apache.org
org.apache.james.jspf.core.exceptions.NoneException: No SPF record found for host: spf6.james.apache.org
	at org.apache.james.jspf.policies.NoSPFRecordFoundPolicy.getSPFRecord(NoSPFRecordFoundPolicy.java:37)
	at org.apache.james.jspf.impl.SPF$SPFPolicyPostFilterChecker.checkSPF(SPF.java:171)
	at org.apache.james.jspf.executor.SynchronousSPFExecutor.execute(SynchronousSPFExecutor.java:54)
	at org.apache.james.jspf.impl.SPF.checkSPF(SPF.java:315)
	at org.apache.james.smtpserver.fastfail.SPFHandler.doSPFCheck(SPFHandler.java:121)
	at org.apache.james.smtpserver.fastfail.SPFHandler.doMail(SPFHandler.java:166)
	at org.apache.james.smtpserver.SPFHandlerTest.testSPFNoRecord(SPFHandlerTest.java:270)
	at sun.reflect.NativeMethodAccessorImpl.invoke0(Native Method)
	at sun.reflect.NativeMethodAccessorImpl.invoke(NativeMethodAccessorImpl.java:57)
	at sun.reflect.DelegatingMethodAccessorImpl.invoke(DelegatingMethodAccessorImpl.java:43)
	at java.lang.reflect.Method.invoke(Method.java:606)
	at org.junit.runners.model.FrameworkMethod$1.runReflectiveCall(FrameworkMethod.java:47)
	at org.junit.internal.runners.model.ReflectiveCallable.run(ReflectiveCallable.java:12)
	at org.junit.runners.model.FrameworkMethod.invokeExplosively(FrameworkMethod.java:44)
	at org.junit.internal.runners.statements.InvokeMethod.evaluate(InvokeMethod.java:17)
	at org.junit.internal.runners.statements.RunBefores.evaluate(RunBefores.java:26)
	at org.junit.runners.ParentRunner.runLeaf(ParentRunner.java:271)
	at org.junit.runners.BlockJUnit4ClassRunner.runChild(BlockJUnit4ClassRunner.java:70)
	at org.junit.runners.BlockJUnit4ClassRunner.runChild(BlockJUnit4ClassRunner.java:50)
	at org.junit.runners.ParentRunner$3.run(ParentRunner.java:238)
	at org.junit.runners.ParentRunner$1.schedule(ParentRunner.java:63)
	at org.junit.runners.ParentRunner.runChildren(ParentRunner.java:236)
	at org.junit.runners.ParentRunner.access$000(ParentRunner.java:53)
	at org.junit.runners.ParentRunner$2.evaluate(ParentRunner.java:229)
	at org.junit.runners.ParentRunner.run(ParentRunner.java:309)
	at org.apache.maven.surefire.junit4.JUnit4Provider.execute(JUnit4Provider.java:264)
	at org.apache.maven.surefire.junit4.JUnit4Provider.executeTestSet(JUnit4Provider.java:153)
	at org.apache.maven.surefire.junit4.JUnit4Provider.invoke(JUnit4Provider.java:124)
	at sun.reflect.NativeMethodAccessorImpl.invoke0(Native Method)
	at sun.reflect.NativeMethodAccessorImpl.invoke(NativeMethodAccessorImpl.java:57)
	at sun.reflect.DelegatingMethodAccessorImpl.invoke(DelegatingMethodAccessorImpl.java:43)
	at java.lang.reflect.Method.invoke(Method.java:606)
	at org.apache.maven.surefire.util.ReflectionUtils.invokeMethodWithArray2(ReflectionUtils.java:208)
	at org.apache.maven.surefire.booter.ProviderFactory$ProviderProxy.invoke(ProviderFactory.java:158)
	at org.apache.maven.surefire.booter.ProviderFactory.invokeProvider(ProviderFactory.java:86)
	at org.apache.maven.surefire.booter.ForkedBooter.runSuitesInProcess(ForkedBooter.java:153)
	at org.apache.maven.surefire.booter.ForkedBooter.main(ForkedBooter.java:95)
Result for 127.0.0.1 - test@spf6.james.apache.org - spf6.james.apache.org = none args=[]
2015-03-04 01:25:10,791 INFO  [main       ] [james.smtpserver.fastfail.SPFHandler        
     ] 221 Processed directive matched: ~all returned ~
Result for 127.0.0.1 - test@spf3.james.apache.org - spf3.james.apache.org = softfail args=[]
2015-03-04 01:25:10,804 INFO  [main       ] [james.smtpserver.fastfail.SPFHandler        
     ] 221 Processed directive matched: ~all returned ~
Result for 127.0.0.1 - test@spf3.james.apache.org - spf3.james.apache.org = softfail args=[]
2015-03-04 01:25:10,816 WARN  [main       ] [james.smtpserver.fastfail.SPFHandler        
     ] 277 Term [badcontent!] is not syntactically valid: (?:((?:([eE][xX][pP]\=((?:\%(?:\{[rctlsodipvhRCTLSODIPVH]\d*[r]?[\.\-\+,/_\=]*\}|\%|\_|\-)|[\x21-\x24\x26-\x7e]{1})*(?:\.(?:[a-zA-Z0-9]*[a-zA-Z]{1}[a-zA-Z0-9]*|(?:[a-zA-Z0-9]+\-(?:[a-zA-Z0-9]|\-)*[a-zA-Z0-9]))\.?|\%(?:\{[rctlsodipvhRCTLSODIPVH]\d*[r]?[\.\-\+,/_\=]*\}|\%|\_|\-))))|([rR][eE][dD][iI][rR][eE][cC][tT]\=((?:\%(?:\{[rctlsodipvhRCTLSODIPVH]\d*[r]?[\.\-\+,/_\=]*\}|\%|\_|\-)|[\x21-\x24\x26-\x7e]{1})*(?:\.(?:[a-zA-Z0-9]*[a-zA-Z]{1}[a-zA-Z0-9]*|(?:[a-zA-Z0-9]+\-(?:[a-zA-Z0-9]|\-)*[a-zA-Z0-9]))\.?|\%(?:\{[rctlsodipvhRCTLSODIPVH]\d*[r]?[\.\-\+,/_\=]*\}|\%|\_|\-))))|(([a-zA-Z]{1}[A-Za-z0-9\-\_\.]*)\=((?:\%(?:\{[rctlsodipvhRCTLSODIPVH]\d*[r]?[\.\-\+,/_\=]*\}|\%|\_|\-)|[\x21-\x24\x26-\x7e]{1})*))))|([\+\-\?\~]?)((?:([aA][lL][lL])|([aA](?:\:((?:\%(?:\{[rctlsodipvhRCTLSODIPVH]\d*[r]?[\.\-\+,/_\=]*\}|\%|\_|\-)|[\x21-\x24\x26-\x7e]{1})*(?:\.(?:[a-zA-Z0-9]*[a-zA-Z]{1}[a-zA-Z0-9]*|(?:[a-zA-Z0-9]+\-(?:[a-zA-Z0-9]|\-)*[a-zA-Z0-9]))\.?|\%(?:\{[rctlsodipvhRCTLSODIPVH]\d*[r]?[\.\-\+,/_\=]*\}|\%|\_|\-))))?(?:(?:/(\d+))?(?://(\d+))?)?)|([eE][xX][iI][sS][tT][sS]\:((?:\%(?:\{[rctlsodipvhRCTLSODIPVH]\d*[r]?[\.\-\+,/_\=]*\}|\%|\_|\-)|[\x21-\x24\x26-\x7e]{1})*(?:\.(?:[a-zA-Z0-9]*[a-zA-Z]{1}[a-zA-Z0-9]*|(?:[a-zA-Z0-9]+\-(?:[a-zA-Z0-9]|\-)*[a-zA-Z0-9]))\.?|\%(?:\{[rctlsodipvhRCTLSODIPVH]\d*[r]?[\.\-\+,/_\=]*\}|\%|\_|\-))))|([iI][nN][cC][lL][uU][dD][eE]\:((?:\%(?:\{[rctlsodipvhRCTLSODIPVH]\d*[r]?[\.\-\+,/_\=]*\}|\%|\_|\-)|[\x21-\x24\x26-\x7e]{1})*(?:\.(?:[a-zA-Z0-9]*[a-zA-Z]{1}[a-zA-Z0-9]*|(?:[a-zA-Z0-9]+\-(?:[a-zA-Z0-9]|\-)*[a-zA-Z0-9]))\.?|\%(?:\{[rctlsodipvhRCTLSODIPVH]\d*[r]?[\.\-\+,/_\=]*\}|\%|\_|\-))))|([iI][pP][4]\:([0-9.]+)(?:/(\d+))?)|([iI][pP][6]\:([0-9A-Fa-f\:\.]+)(?:/(\d+))?)|([mM][xX](?:\:((?:\%(?:\{[rctlsodipvhRCTLSODIPVH]\d*[r]?[\.\-\+,/_\=]*\}|\%|\_|\-)|[\x21-\x24\x26-\x7e]{1})*(?:\.(?:[a-zA-Z0-9]*[a-zA-Z]{1}[a-zA-Z0-9]*|(?:[a-zA-Z0-9]+\-(?:[a-zA-Z0-9]|\-)*[a-zA-Z0-9]))\.?|\%(?:\{[rctlsodipvhRCTLSODIPVH]\d*[r]?[\.\-\+,/_\=]*\}|\%|\_|\-))))?(?:(?:/(\d+))?(?://(\d+))?)?)|([pP][tT][rR](?:\:((?:\%(?:\{[rctlsodipvhRCTLSODIPVH]\d*[r]?[\.\-\+,/_\=]*\}|\%|\_|\-)|[\x21-\x24\x26-\x7e]{1})*(?:\.(?:[a-zA-Z0-9]*[a-zA-Z]{1}[a-zA-Z0-9]*|(?:[a-zA-Z0-9]+\-(?:[a-zA-Z0-9]|\-)*[a-zA-Z0-9]))\.?|\%(?:\{[rctlsodipvhRCTLSODIPVH]\d*[r]?[\.\-\+,/_\=]*\}|\%|\_|\-))))?))))
org.apache.james.jspf.core.exceptions.PermErrorException: Term [badcontent!] is not syntactically
valid: (?:((?:([eE][xX][pP]\=((?:\%(?:\{[rctlsodipvhRCTLSODIPVH]\d*[r]?[\.\-\+,/_\=]*\}|\%|\_|\-)|[\x21-\x24\x26-\x7e]{1})*(?:\.(?:[a-zA-Z0-9]*[a-zA-Z]{1}[a-zA-Z0-9]*|(?:[a-zA-Z0-9]+\-(?:[a-zA-Z0-9]|\-)*[a-zA-Z0-9]))\.?|\%(?:\{[rctlsodipvhRCTLSODIPVH]\d*[r]?[\.\-\+,/_\=]*\}|\%|\_|\-))))|([rR][eE][dD][iI][rR][eE][cC][tT]\=((?:\%(?:\{[rctlsodipvhRCTLSODIPVH]\d*[r]?[\.\-\+,/_\=]*\}|\%|\_|\-)|[\x21-\x24\x26-\x7e]{1})*(?:\.(?:[a-zA-Z0-9]*[a-zA-Z]{1}[a-zA-Z0-9]*|(?:[a-zA-Z0-9]+\-(?:[a-zA-Z0-9]|\-)*[a-zA-Z0-9]))\.?|\%(?:\{[rctlsodipvhRCTLSODIPVH]\d*[r]?[\.\-\+,/_\=]*\}|\%|\_|\-))))|(([a-zA-Z]{1}[A-Za-z0-9\-\_\.]*)\=((?:\%(?:\{[rctlsodipvhRCTLSODIPVH]\d*[r]?[\.\-\+,/_\=]*\}|\%|\_|\-)|[\x21-\x24\x26-\x7e]{1})*))))|([\+\-\?\~]?)((?:([aA][lL][lL])|([aA](?:\:((?:\%(?:\{[rctlsodipvhRCTLSODIPVH]\d*[r]?[\.\-\+,/_\=]*\}|\%|\_|\-)|[\x21-\x24\x26-\x7e]{1})*(?:\.(?:[a-zA-Z0-9]*[a-zA-Z]{1}[a-zA-Z0-9]*|(?:[a-zA-Z0-9]+\-(?:[a-zA-Z0-9]|\-)*[a-zA-Z0-9]))\.?|\%(?:\{[rctlsodipvhRCTLSODIPVH]\d*[r]?[\.\-\+,/_\=]*\}|\%|\_|\-))))?(?:(?:/(\d+))?(?://(\d+))?)?)|([eE][xX][iI][sS][tT][sS]\:((?:\%(?:\{[rctlsodipvhRCTLSODIPVH]\d*[r]?[\.\-\+,/_\=]*\}|\%|\_|\-)|[\x21-\x24\x26-\x7e]{1})*(?:\.(?:[a-zA-Z0-9]*[a-zA-Z]{1}[a-zA-Z0-9]*|(?:[a-zA-Z0-9]+\-(?:[a-zA-Z0-9]|\-)*[a-zA-Z0-9]))\.?|\%(?:\{[rctlsodipvhRCTLSODIPVH]\d*[r]?[\.\-\+,/_\=]*\}|\%|\_|\-))))|([iI][nN][cC][lL][uU][dD][eE]\:((?:\%(?:\{[rctlsodipvhRCTLSODIPVH]\d*[r]?[\.\-\+,/_\=]*\}|\%|\_|\-)|[\x21-\x24\x26-\x7e]{1})*(?:\.(?:[a-zA-Z0-9]*[a-zA-Z]{1}[a-zA-Z0-9]*|(?:[a-zA-Z0-9]+\-(?:[a-zA-Z0-9]|\-)*[a-zA-Z0-9]))\.?|\%(?:\{[rctlsodipvhRCTLSODIPVH]\d*[r]?[\.\-\+,/_\=]*\}|\%|\_|\-))))|([iI][pP][4]\:([0-9.]+)(?:/(\d+))?)|([iI][pP][6]\:([0-9A-Fa-f\:\.]+)(?:/(\d+))?)|([mM][xX](?:\:((?:\%(?:\{[rctlsodipvhRCTLSODIPVH]\d*[r]?[\.\-\+,/_\=]*\}|\%|\_|\-)|[\x21-\x24\x26-\x7e]{1})*(?:\.(?:[a-zA-Z0-9]*[a-zA-Z]{1}[a-zA-Z0-9]*|(?:[a-zA-Z0-9]+\-(?:[a-zA-Z0-9]|\-)*[a-zA-Z0-9]))\.?|\%(?:\{[rctlsodipvhRCTLSODIPVH]\d*[r]?[\.\-\+,/_\=]*\}|\%|\_|\-))))?(?:(?:/(\d+))?(?://(\d+))?)?)|([pP][tT][rR](?:\:((?:\%(?:\{[rctlsodipvhRCTLSODIPVH]\d*[r]?[\.\-\+,/_\=]*\}|\%|\_|\-)|[\x21-\x24\x26-\x7e]{1})*(?:\.(?:[a-zA-Z0-9]*[a-zA-Z]{1}[a-zA-Z0-9]*|(?:[a-zA-Z0-9]+\-(?:[a-zA-Z0-9]|\-)*[a-zA-Z0-9]))\.?|\%(?:\{[rctlsodipvhRCTLSODIPVH]\d*[r]?[\.\-\+,/_\=]*\}|\%|\_|\-))))?))))
	at org.apache.james.jspf.parser.RFC4408SPF1Parser.parse(RFC4408SPF1Parser.java:277)
	at org.apache.james.jspf.policies.ParseRecordPolicy.getSPFRecord(ParseRecordPolicy.java:46)
	at org.apache.james.jspf.impl.SPF$SPFPolicyPostFilterChecker.checkSPF(SPF.java:171)
	at org.apache.james.jspf.executor.SynchronousSPFExecutor.execute(SynchronousSPFExecutor.java:54)
	at org.apache.james.jspf.impl.SPF.checkSPF(SPF.java:315)
	at org.apache.james.smtpserver.fastfail.SPFHandler.doSPFCheck(SPFHandler.java:121)
	at org.apache.james.smtpserver.fastfail.SPFHandler.doMail(SPFHandler.java:166)
	at org.apache.james.smtpserver.SPFHandlerTest.testSPFpermErrorRejectDisabled(SPFHandlerTest.java:285)
	at sun.reflect.NativeMethodAccessorImpl.invoke0(Native Method)
	at sun.reflect.NativeMethodAccessorImpl.invoke(NativeMethodAccessorImpl.java:57)
	at sun.reflect.DelegatingMethodAccessorImpl.invoke(DelegatingMethodAccessorImpl.java:43)
	at java.lang.reflect.Method.invoke(Method.java:606)
	at org.junit.runners.model.FrameworkMethod$1.runReflectiveCall(FrameworkMethod.java:47)
	at org.junit.internal.runners.model.ReflectiveCallable.run(ReflectiveCallable.java:12)
	at org.junit.runners.model.FrameworkMethod.invokeExplosively(FrameworkMethod.java:44)
	at org.junit.internal.runners.statements.InvokeMethod.evaluate(InvokeMethod.java:17)
	at org.junit.internal.runners.statements.RunBefores.evaluate(RunBefores.java:26)
	at org.junit.runners.ParentRunner.runLeaf(ParentRunner.java:271)
	at org.junit.runners.BlockJUnit4ClassRunner.runChild(BlockJUnit4ClassRunner.java:70)
	at org.junit.runners.BlockJUnit4ClassRunner.runChild(BlockJUnit4ClassRunner.java:50)
	at org.junit.runners.ParentRunner$3.run(ParentRunner.java:238)
	at org.junit.runners.ParentRunner$1.schedule(ParentRunner.java:63)
	at org.junit.runners.ParentRunner.runChildren(ParentRunner.java:236)
	at org.junit.runners.ParentRunner.access$000(ParentRunner.java:53)
	at org.junit.runners.ParentRunner$2.evaluate(ParentRunner.java:229)
	at org.junit.runners.ParentRunner.run(ParentRunner.java:309)
	at org.apache.maven.surefire.junit4.JUnit4Provider.execute(JUnit4Provider.java:264)
	at org.apache.maven.surefire.junit4.JUnit4Provider.executeTestSet(JUnit4Provider.java:153)
	at org.apache.maven.surefire.junit4.JUnit4Provider.invoke(JUnit4Provider.java:124)
	at sun.reflect.NativeMethodAccessorImpl.invoke0(Native Method)
	at sun.reflect.NativeMethodAccessorImpl.invoke(NativeMethodAccessorImpl.java:57)
	at sun.reflect.DelegatingMethodAccessorImpl.invoke(DelegatingMethodAccessorImpl.java:43)
	at java.lang.reflect.Method.invoke(Method.java:606)
	at org.apache.maven.surefire.util.ReflectionUtils.invokeMethodWithArray2(ReflectionUtils.java:208)
	at org.apache.maven.surefire.booter.ProviderFactory$ProviderProxy.invoke(ProviderFactory.java:158)
	at org.apache.maven.surefire.booter.ProviderFactory.invokeProvider(ProviderFactory.java:86)
	at org.apache.maven.surefire.booter.ForkedBooter.runSuitesInProcess(ForkedBooter.java:153)
	at org.apache.maven.surefire.booter.ForkedBooter.main(ForkedBooter.java:95)
Result for 127.0.0.1 - test@spf4.james.apache.org - spf4.james.apache.org = permerror args=[]
2015-03-04 01:25:10,831 WARN  [main       ] [james.smtpserver.fastfail.SPFHandler        
     ] 277 Term [badcontent!] is not syntactically valid: (?:((?:([eE][xX][pP]\=((?:\%(?:\{[rctlsodipvhRCTLSODIPVH]\d*[r]?[\.\-\+,/_\=]*\}|\%|\_|\-)|[\x21-\x24\x26-\x7e]{1})*(?:\.(?:[a-zA-Z0-9]*[a-zA-Z]{1}[a-zA-Z0-9]*|(?:[a-zA-Z0-9]+\-(?:[a-zA-Z0-9]|\-)*[a-zA-Z0-9]))\.?|\%(?:\{[rctlsodipvhRCTLSODIPVH]\d*[r]?[\.\-\+,/_\=]*\}|\%|\_|\-))))|([rR][eE][dD][iI][rR][eE][cC][tT]\=((?:\%(?:\{[rctlsodipvhRCTLSODIPVH]\d*[r]?[\.\-\+,/_\=]*\}|\%|\_|\-)|[\x21-\x24\x26-\x7e]{1})*(?:\.(?:[a-zA-Z0-9]*[a-zA-Z]{1}[a-zA-Z0-9]*|(?:[a-zA-Z0-9]+\-(?:[a-zA-Z0-9]|\-)*[a-zA-Z0-9]))\.?|\%(?:\{[rctlsodipvhRCTLSODIPVH]\d*[r]?[\.\-\+,/_\=]*\}|\%|\_|\-))))|(([a-zA-Z]{1}[A-Za-z0-9\-\_\.]*)\=((?:\%(?:\{[rctlsodipvhRCTLSODIPVH]\d*[r]?[\.\-\+,/_\=]*\}|\%|\_|\-)|[\x21-\x24\x26-\x7e]{1})*))))|([\+\-\?\~]?)((?:([aA][lL][lL])|([aA](?:\:((?:\%(?:\{[rctlsodipvhRCTLSODIPVH]\d*[r]?[\.\-\+,/_\=]*\}|\%|\_|\-)|[\x21-\x24\x26-\x7e]{1})*(?:\.(?:[a-zA-Z0-9]*[a-zA-Z]{1}[a-zA-Z0-9]*|(?:[a-zA-Z0-9]+\-(?:[a-zA-Z0-9]|\-)*[a-zA-Z0-9]))\.?|\%(?:\{[rctlsodipvhRCTLSODIPVH]\d*[r]?[\.\-\+,/_\=]*\}|\%|\_|\-))))?(?:(?:/(\d+))?(?://(\d+))?)?)|([eE][xX][iI][sS][tT][sS]\:((?:\%(?:\{[rctlsodipvhRCTLSODIPVH]\d*[r]?[\.\-\+,/_\=]*\}|\%|\_|\-)|[\x21-\x24\x26-\x7e]{1})*(?:\.(?:[a-zA-Z0-9]*[a-zA-Z]{1}[a-zA-Z0-9]*|(?:[a-zA-Z0-9]+\-(?:[a-zA-Z0-9]|\-)*[a-zA-Z0-9]))\.?|\%(?:\{[rctlsodipvhRCTLSODIPVH]\d*[r]?[\.\-\+,/_\=]*\}|\%|\_|\-))))|([iI][nN][cC][lL][uU][dD][eE]\:((?:\%(?:\{[rctlsodipvhRCTLSODIPVH]\d*[r]?[\.\-\+,/_\=]*\}|\%|\_|\-)|[\x21-\x24\x26-\x7e]{1})*(?:\.(?:[a-zA-Z0-9]*[a-zA-Z]{1}[a-zA-Z0-9]*|(?:[a-zA-Z0-9]+\-(?:[a-zA-Z0-9]|\-)*[a-zA-Z0-9]))\.?|\%(?:\{[rctlsodipvhRCTLSODIPVH]\d*[r]?[\.\-\+,/_\=]*\}|\%|\_|\-))))|([iI][pP][4]\:([0-9.]+)(?:/(\d+))?)|([iI][pP][6]\:([0-9A-Fa-f\:\.]+)(?:/(\d+))?)|([mM][xX](?:\:((?:\%(?:\{[rctlsodipvhRCTLSODIPVH]\d*[r]?[\.\-\+,/_\=]*\}|\%|\_|\-)|[\x21-\x24\x26-\x7e]{1})*(?:\.(?:[a-zA-Z0-9]*[a-zA-Z]{1}[a-zA-Z0-9]*|(?:[a-zA-Z0-9]+\-(?:[a-zA-Z0-9]|\-)*[a-zA-Z0-9]))\.?|\%(?:\{[rctlsodipvhRCTLSODIPVH]\d*[r]?[\.\-\+,/_\=]*\}|\%|\_|\-))))?(?:(?:/(\d+))?(?://(\d+))?)?)|([pP][tT][rR](?:\:((?:\%(?:\{[rctlsodipvhRCTLSODIPVH]\d*[r]?[\.\-\+,/_\=]*\}|\%|\_|\-)|[\x21-\x24\x26-\x7e]{1})*(?:\.(?:[a-zA-Z0-9]*[a-zA-Z]{1}[a-zA-Z0-9]*|(?:[a-zA-Z0-9]+\-(?:[a-zA-Z0-9]|\-)*[a-zA-Z0-9]))\.?|\%(?:\{[rctlsodipvhRCTLSODIPVH]\d*[r]?[\.\-\+,/_\=]*\}|\%|\_|\-))))?))))
org.apache.james.jspf.core.exceptions.PermErrorException: Term [badcontent!] is not syntactically
valid: (?:((?:([eE][xX][pP]\=((?:\%(?:\{[rctlsodipvhRCTLSODIPVH]\d*[r]?[\.\-\+,/_\=]*\}|\%|\_|\-)|[\x21-\x24\x26-\x7e]{1})*(?:\.(?:[a-zA-Z0-9]*[a-zA-Z]{1}[a-zA-Z0-9]*|(?:[a-zA-Z0-9]+\-(?:[a-zA-Z0-9]|\-)*[a-zA-Z0-9]))\.?|\%(?:\{[rctlsodipvhRCTLSODIPVH]\d*[r]?[\.\-\+,/_\=]*\}|\%|\_|\-))))|([rR][eE][dD][iI][rR][eE][cC][tT]\=((?:\%(?:\{[rctlsodipvhRCTLSODIPVH]\d*[r]?[\.\-\+,/_\=]*\}|\%|\_|\-)|[\x21-\x24\x26-\x7e]{1})*(?:\.(?:[a-zA-Z0-9]*[a-zA-Z]{1}[a-zA-Z0-9]*|(?:[a-zA-Z0-9]+\-(?:[a-zA-Z0-9]|\-)*[a-zA-Z0-9]))\.?|\%(?:\{[rctlsodipvhRCTLSODIPVH]\d*[r]?[\.\-\+,/_\=]*\}|\%|\_|\-))))|(([a-zA-Z]{1}[A-Za-z0-9\-\_\.]*)\=((?:\%(?:\{[rctlsodipvhRCTLSODIPVH]\d*[r]?[\.\-\+,/_\=]*\}|\%|\_|\-)|[\x21-\x24\x26-\x7e]{1})*))))|([\+\-\?\~]?)((?:([aA][lL][lL])|([aA](?:\:((?:\%(?:\{[rctlsodipvhRCTLSODIPVH]\d*[r]?[\.\-\+,/_\=]*\}|\%|\_|\-)|[\x21-\x24\x26-\x7e]{1})*(?:\.(?:[a-zA-Z0-9]*[a-zA-Z]{1}[a-zA-Z0-9]*|(?:[a-zA-Z0-9]+\-(?:[a-zA-Z0-9]|\-)*[a-zA-Z0-9]))\.?|\%(?:\{[rctlsodipvhRCTLSODIPVH]\d*[r]?[\.\-\+,/_\=]*\}|\%|\_|\-))))?(?:(?:/(\d+))?(?://(\d+))?)?)|([eE][xX][iI][sS][tT][sS]\:((?:\%(?:\{[rctlsodipvhRCTLSODIPVH]\d*[r]?[\.\-\+,/_\=]*\}|\%|\_|\-)|[\x21-\x24\x26-\x7e]{1})*(?:\.(?:[a-zA-Z0-9]*[a-zA-Z]{1}[a-zA-Z0-9]*|(?:[a-zA-Z0-9]+\-(?:[a-zA-Z0-9]|\-)*[a-zA-Z0-9]))\.?|\%(?:\{[rctlsodipvhRCTLSODIPVH]\d*[r]?[\.\-\+,/_\=]*\}|\%|\_|\-))))|([iI][nN][cC][lL][uU][dD][eE]\:((?:\%(?:\{[rctlsodipvhRCTLSODIPVH]\d*[r]?[\.\-\+,/_\=]*\}|\%|\_|\-)|[\x21-\x24\x26-\x7e]{1})*(?:\.(?:[a-zA-Z0-9]*[a-zA-Z]{1}[a-zA-Z0-9]*|(?:[a-zA-Z0-9]+\-(?:[a-zA-Z0-9]|\-)*[a-zA-Z0-9]))\.?|\%(?:\{[rctlsodipvhRCTLSODIPVH]\d*[r]?[\.\-\+,/_\=]*\}|\%|\_|\-))))|([iI][pP][4]\:([0-9.]+)(?:/(\d+))?)|([iI][pP][6]\:([0-9A-Fa-f\:\.]+)(?:/(\d+))?)|([mM][xX](?:\:((?:\%(?:\{[rctlsodipvhRCTLSODIPVH]\d*[r]?[\.\-\+,/_\=]*\}|\%|\_|\-)|[\x21-\x24\x26-\x7e]{1})*(?:\.(?:[a-zA-Z0-9]*[a-zA-Z]{1}[a-zA-Z0-9]*|(?:[a-zA-Z0-9]+\-(?:[a-zA-Z0-9]|\-)*[a-zA-Z0-9]))\.?|\%(?:\{[rctlsodipvhRCTLSODIPVH]\d*[r]?[\.\-\+,/_\=]*\}|\%|\_|\-))))?(?:(?:/(\d+))?(?://(\d+))?)?)|([pP][tT][rR](?:\:((?:\%(?:\{[rctlsodipvhRCTLSODIPVH]\d*[r]?[\.\-\+,/_\=]*\}|\%|\_|\-)|[\x21-\x24\x26-\x7e]{1})*(?:\.(?:[a-zA-Z0-9]*[a-zA-Z]{1}[a-zA-Z0-9]*|(?:[a-zA-Z0-9]+\-(?:[a-zA-Z0-9]|\-)*[a-zA-Z0-9]))\.?|\%(?:\{[rctlsodipvhRCTLSODIPVH]\d*[r]?[\.\-\+,/_\=]*\}|\%|\_|\-))))?))))
	at org.apache.james.jspf.parser.RFC4408SPF1Parser.parse(RFC4408SPF1Parser.java:277)
	at org.apache.james.jspf.policies.ParseRecordPolicy.getSPFRecord(ParseRecordPolicy.java:46)
	at org.apache.james.jspf.impl.SPF$SPFPolicyPostFilterChecker.checkSPF(SPF.java:171)
	at org.apache.james.jspf.executor.SynchronousSPFExecutor.execute(SynchronousSPFExecutor.java:54)
	at org.apache.james.jspf.impl.SPF.checkSPF(SPF.java:315)
	at org.apache.james.smtpserver.fastfail.SPFHandler.doSPFCheck(SPFHandler.java:121)
	at org.apache.james.smtpserver.fastfail.SPFHandler.doMail(SPFHandler.java:166)
	at org.apache.james.smtpserver.SPFHandlerTest.testSPFpermError(SPFHandlerTest.java:240)
	at sun.reflect.NativeMethodAccessorImpl.invoke0(Native Method)
	at sun.reflect.NativeMethodAccessorImpl.invoke(NativeMethodAccessorImpl.java:57)
	at sun.reflect.DelegatingMethodAccessorImpl.invoke(DelegatingMethodAccessorImpl.java:43)
	at java.lang.reflect.Method.invoke(Method.java:606)
	at org.junit.runners.model.FrameworkMethod$1.runReflectiveCall(FrameworkMethod.java:47)
	at org.junit.internal.runners.model.ReflectiveCallable.run(ReflectiveCallable.java:12)
	at org.junit.runners.model.FrameworkMethod.invokeExplosively(FrameworkMethod.java:44)
	at org.junit.internal.runners.statements.InvokeMethod.evaluate(InvokeMethod.java:17)
	at org.junit.internal.runners.statements.RunBefores.evaluate(RunBefores.java:26)
	at org.junit.runners.ParentRunner.runLeaf(ParentRunner.java:271)
	at org.junit.runners.BlockJUnit4ClassRunner.runChild(BlockJUnit4ClassRunner.java:70)
	at org.junit.runners.BlockJUnit4ClassRunner.runChild(BlockJUnit4ClassRunner.java:50)
	at org.junit.runners.ParentRunner$3.run(ParentRunner.java:238)
	at org.junit.runners.ParentRunner$1.schedule(ParentRunner.java:63)
	at org.junit.runners.ParentRunner.runChildren(ParentRunner.java:236)
	at org.junit.runners.ParentRunner.access$000(ParentRunner.java:53)
	at org.junit.runners.ParentRunner$2.evaluate(ParentRunner.java:229)
	at org.junit.runners.ParentRunner.run(ParentRunner.java:309)
	at org.apache.maven.surefire.junit4.JUnit4Provider.execute(JUnit4Provider.java:264)
	at org.apache.maven.surefire.junit4.JUnit4Provider.executeTestSet(JUnit4Provider.java:153)
	at org.apache.maven.surefire.junit4.JUnit4Provider.invoke(JUnit4Provider.java:124)
	at sun.reflect.NativeMethodAccessorImpl.invoke0(Native Method)
	at sun.reflect.NativeMethodAccessorImpl.invoke(NativeMethodAccessorImpl.java:57)
	at sun.reflect.DelegatingMethodAccessorImpl.invoke(DelegatingMethodAccessorImpl.java:43)
	at java.lang.reflect.Method.invoke(Method.java:606)
	at org.apache.maven.surefire.util.ReflectionUtils.invokeMethodWithArray2(ReflectionUtils.java:208)
	at org.apache.maven.surefire.booter.ProviderFactory$ProviderProxy.invoke(ProviderFactory.java:158)
	at org.apache.maven.surefire.booter.ProviderFactory.invokeProvider(ProviderFactory.java:86)
	at org.apache.maven.surefire.booter.ForkedBooter.runSuitesInProcess(ForkedBooter.java:153)
	at org.apache.maven.surefire.booter.ForkedBooter.main(ForkedBooter.java:95)
Result for 127.0.0.1 - test@spf4.james.apache.org - spf4.james.apache.org = permerror args=[]
2015-03-04 01:25:10,843 INFO  [main       ] [james.smtpserver.fastfail.SPFHandler        
     ] 221 Processed directive matched: -all returned -
Result for 127.0.0.1 - test@spf2.james.apache.org - spf2.james.apache.org = fail args=[]
2015-03-04 01:25:10,854 INFO  [main       ] [james.smtpserver.fastfail.SPFHandler        
     ] 221 Processed directive matched: +all returned +
Result for 127.0.0.1 - test@spf1.james.apache.org - spf1.james.apache.org = pass args=[]
2015-03-04 01:25:10,866 WARN  [main       ] [james.smtpserver.fastfail.SPFHandler        
     ] 277 Timeout querying dns
org.apache.james.jspf.core.exceptions.TempErrorException: Timeout querying dns
	at org.apache.james.jspf.policies.SPFRetriever$SPFRetrieverDNSResponseListener.onDNSResponse(SPFRetriever.java:101)
	at org.apache.james.jspf.executor.SynchronousSPFExecutor.execute(SynchronousSPFExecutor.java:64)
	at org.apache.james.jspf.impl.SPF.checkSPF(SPF.java:315)
	at org.apache.james.smtpserver.fastfail.SPFHandler.doSPFCheck(SPFHandler.java:121)
	at org.apache.james.smtpserver.fastfail.SPFHandler.doMail(SPFHandler.java:166)
	at org.apache.james.smtpserver.SPFHandlerTest.testSPFtempError(SPFHandlerTest.java:255)
	at sun.reflect.NativeMethodAccessorImpl.invoke0(Native Method)
	at sun.reflect.NativeMethodAccessorImpl.invoke(NativeMethodAccessorImpl.java:57)
	at sun.reflect.DelegatingMethodAccessorImpl.invoke(DelegatingMethodAccessorImpl.java:43)
	at java.lang.reflect.Method.invoke(Method.java:606)
	at org.junit.runners.model.FrameworkMethod$1.runReflectiveCall(FrameworkMethod.java:47)
	at org.junit.internal.runners.model.ReflectiveCallable.run(ReflectiveCallable.java:12)
	at org.junit.runners.model.FrameworkMethod.invokeExplosively(FrameworkMethod.java:44)
	at org.junit.internal.runners.statements.InvokeMethod.evaluate(InvokeMethod.java:17)
	at org.junit.internal.runners.statements.RunBefores.evaluate(RunBefores.java:26)
	at org.junit.runners.ParentRunner.runLeaf(ParentRunner.java:271)
	at org.junit.runners.BlockJUnit4ClassRunner.runChild(BlockJUnit4ClassRunner.java:70)
	at org.junit.runners.BlockJUnit4ClassRunner.runChild(BlockJUnit4ClassRunner.java:50)
	at org.junit.runners.ParentRunner$3.run(ParentRunner.java:238)
	at org.junit.runners.ParentRunner$1.schedule(ParentRunner.java:63)
	at org.junit.runners.ParentRunner.runChildren(ParentRunner.java:236)
	at org.junit.runners.ParentRunner.access$000(ParentRunner.java:53)
	at org.junit.runners.ParentRunner$2.evaluate(ParentRunner.java:229)
	at org.junit.runners.ParentRunner.run(ParentRunner.java:309)
	at org.apache.maven.surefire.junit4.JUnit4Provider.execute(JUnit4Provider.java:264)
	at org.apache.maven.surefire.junit4.JUnit4Provider.executeTestSet(JUnit4Provider.java:153)
	at org.apache.maven.surefire.junit4.JUnit4Provider.invoke(JUnit4Provider.java:124)
	at sun.reflect.NativeMethodAccessorImpl.invoke0(Native Method)
	at sun.reflect.NativeMethodAccessorImpl.invoke(NativeMethodAccessorImpl.java:57)
	at sun.reflect.DelegatingMethodAccessorImpl.invoke(DelegatingMethodAccessorImpl.java:43)
	at java.lang.reflect.Method.invoke(Method.java:606)
	at org.apache.maven.surefire.util.ReflectionUtils.invokeMethodWithArray2(ReflectionUtils.java:208)
	at org.apache.maven.surefire.booter.ProviderFactory$ProviderProxy.invoke(ProviderFactory.java:158)
	at org.apache.maven.surefire.booter.ProviderFactory.invokeProvider(ProviderFactory.java:86)
	at org.apache.maven.surefire.booter.ForkedBooter.runSuitesInProcess(ForkedBooter.java:153)
	at org.apache.maven.surefire.booter.ForkedBooter.main(ForkedBooter.java:95)
Result for 127.0.0.1 - test@spf5.james.apache.org - spf5.james.apache.org = temperror args=[]
Tests run: 8, Failures: 0, Errors: 0, Skipped: 0, Time elapsed: 0.474 sec
Running org.apache.james.smtpserver.SetMimeHeaderHandlerTest
Tests run: 2, Failures: 0, Errors: 0, Skipped: 0, Time elapsed: 0.152 sec

Results :

Tests run: 65, Failures: 0, Errors: 0, Skipped: 1

[JENKINS] Recording test results

---------------------------------------------------------------------
To unsubscribe, e-mail: server-dev-unsubscribe@james.apache.org
For additional commands, e-mail: server-dev-help@james.apache.org


Mime
View raw message