james-server-dev mailing list archives

Site index · List index
Message view « Date » · « Thread »
Top « Date » · « Thread »
From Apache Jenkins Server <jenk...@builds.apache.org>
Subject Build failed in Jenkins: james-server-trunk » Apache James :: Server :: Data :: HBase Persistence #5099
Date Fri, 10 Apr 2015 00:32:35 GMT
See <https://builds.apache.org/job/james-server-trunk/org.apache.james$james-server-data-hbase/5099/>

------------------------------------------
[...truncated 84 lines...]
Running org.apache.james.rrt.hbase.HBaseRecipientRewriteTableTest
SLF4J: Class path contains multiple SLF4J bindings.
SLF4J: Found binding in [jar:file:/home/jenkins/jenkins-slave/maven-repositories/0/org/slf4j/slf4j-log4j12/1.7.2/slf4j-log4j12-1.7.2.jar!/org/slf4j/impl/StaticLoggerBinder.class]
SLF4J: Found binding in [jar:file:/home/jenkins/jenkins-slave/maven-repositories/0/org/slf4j/slf4j-simple/1.7.2/slf4j-simple-1.7.2.jar!/org/slf4j/impl/StaticLoggerBinder.class]
SLF4J: See http://www.slf4j.org/codes.html#multiple_bindings for an explanation.
SLF4J: Actual binding is of type [org.slf4j.impl.Log4jLoggerFactory]
2015-04-10 00:21:38,656 [main] WARN  org.apache.hadoop.hdfs.server.namenode.FSNamesystem -
The dfs.support.append option is in your configuration, however append is not supported. This
configuration option is no longer required to enable sync.
2015-04-10 00:21:38,965 [main] WARN  org.apache.hadoop.metrics2.impl.MetricsSystemImpl - Source
name ugi already exists!
2015-04-10 00:21:39,006 [main] WARN  org.apache.hadoop.metrics2.impl.MetricsSystemImpl - Source
name ugi already exists!
2015-04-10 00:21:39,017 [main] WARN  org.apache.hadoop.hdfs.server.namenode.FSNamesystem -
The dfs.support.append option is in your configuration, however append is not supported. This
configuration option is no longer required to enable sync.
Starting DataNode 0 with dfs.data.dir: <https://builds.apache.org/job/james-server-trunk/org.apache.james$james-server-data-hbase/ws/target/test-data/8b92b2a1-70ce-46ff-bbad-f6876a06d650/dfscluster_d2ff7580-0d24-4f3c-bafc-174697324a43/dfs/data/data1,/home/jenkins/jenkins-slave/workspace/james-server-trunk/trunk/data/data-hbase/target/test-data/8b92b2a1-70ce-46ff-bbad-f6876a06d650/dfscluster_d2ff7580-0d24-4f3c-bafc-174697324a43/dfs/data/data2>
2015-04-10 00:21:39,798 [main] WARN  org.apache.hadoop.metrics2.impl.MetricsSystemImpl - NameNode
metrics system already initialized!
2015-04-10 00:21:39,798 [main] WARN  org.apache.hadoop.metrics2.impl.MetricsSystemImpl - Source
name ugi already exists!
2015-04-10 00:21:40,227 [main] WARN  org.apache.hadoop.metrics2.impl.MetricsSystemImpl - Source
name jvm already exists!
Cluster is active
2015-04-10 00:21:41,920 [org.apache.hadoop.hdfs.server.datanode.DataXceiver@4fc3d2f3] WARN
 org.apache.hadoop.util.NativeCodeLoader - Unable to load native-hadoop library for your platform...
using builtin-java classes where applicable
2015-04-10 00:21:50,657 [Master:0;pomona.apache.org,43200,1428625301487] WARN  org.apache.hadoop.hbase.zookeeper.RecoverableZooKeeper
- Node /hbase/root-region-server already deleted, and this is not a retry
2015-04-10 00:21:58,637 [main] ERROR MockLog - Exception during regexMap processing: 
java.util.regex.PatternSyntaxException: Regex should be formatted as regex:<regular-expression>:<parameterized-string>
near index 0
regex:(.*)@localhost
^
	at org.apache.james.rrt.lib.RecipientRewriteTableUtil.regexMap(RecipientRewriteTableUtil.java:67)
	at org.apache.james.rrt.lib.AbstractRecipientRewriteTable.getMappings(AbstractRecipientRewriteTable.java:137)
	at org.apache.james.rrt.lib.AbstractRecipientRewriteTable.getMappings(AbstractRecipientRewriteTable.java:114)
	at org.apache.james.rrt.lib.AbstractRecipientRewriteTableTest.testStoreAndRetrieveRegexMapping(AbstractRecipientRewriteTableTest.java:96)
	at sun.reflect.NativeMethodAccessorImpl.invoke0(Native Method)
	at sun.reflect.NativeMethodAccessorImpl.invoke(NativeMethodAccessorImpl.java:57)
	at sun.reflect.DelegatingMethodAccessorImpl.invoke(DelegatingMethodAccessorImpl.java:43)
	at java.lang.reflect.Method.invoke(Method.java:606)
	at org.junit.runners.model.FrameworkMethod$1.runReflectiveCall(FrameworkMethod.java:47)
	at org.junit.internal.runners.model.ReflectiveCallable.run(ReflectiveCallable.java:12)
	at org.junit.runners.model.FrameworkMethod.invokeExplosively(FrameworkMethod.java:44)
	at org.junit.internal.runners.statements.InvokeMethod.evaluate(InvokeMethod.java:17)
	at org.junit.internal.runners.statements.RunBefores.evaluate(RunBefores.java:26)
	at org.junit.internal.runners.statements.RunAfters.evaluate(RunAfters.java:27)
	at org.junit.runners.ParentRunner.runLeaf(ParentRunner.java:271)
	at org.junit.runners.BlockJUnit4ClassRunner.runChild(BlockJUnit4ClassRunner.java:70)
	at org.junit.runners.BlockJUnit4ClassRunner.runChild(BlockJUnit4ClassRunner.java:50)
	at org.junit.runners.ParentRunner$3.run(ParentRunner.java:238)
	at org.junit.runners.ParentRunner$1.schedule(ParentRunner.java:63)
	at org.junit.runners.ParentRunner.runChildren(ParentRunner.java:236)
	at org.junit.runners.ParentRunner.access$000(ParentRunner.java:53)
	at org.junit.runners.ParentRunner$2.evaluate(ParentRunner.java:229)
	at org.junit.runners.ParentRunner.run(ParentRunner.java:309)
	at org.apache.maven.surefire.junit4.JUnit4Provider.execute(JUnit4Provider.java:264)
	at org.apache.maven.surefire.junit4.JUnit4Provider.executeTestSet(JUnit4Provider.java:153)
	at org.apache.maven.surefire.junit4.JUnit4Provider.invoke(JUnit4Provider.java:124)
	at sun.reflect.NativeMethodAccessorImpl.invoke0(Native Method)
	at sun.reflect.NativeMethodAccessorImpl.invoke(NativeMethodAccessorImpl.java:57)
	at sun.reflect.DelegatingMethodAccessorImpl.invoke(DelegatingMethodAccessorImpl.java:43)
	at java.lang.reflect.Method.invoke(Method.java:606)
	at org.apache.maven.surefire.util.ReflectionUtils.invokeMethodWithArray2(ReflectionUtils.java:208)
	at org.apache.maven.surefire.booter.ProviderFactory$ProviderProxy.invoke(ProviderFactory.java:158)
	at org.apache.maven.surefire.booter.ProviderFactory.invokeProvider(ProviderFactory.java:86)
	at org.apache.maven.surefire.booter.ForkedBooter.runSuitesInProcess(ForkedBooter.java:153)
	at org.apache.maven.surefire.booter.ForkedBooter.main(ForkedBooter.java:95)
2015-04-10 00:21:58,661 [main] ERROR MockLog - Exception during regexMap processing: 
java.util.regex.PatternSyntaxException: Regex should be formatted as regex:<regular-expression>:<parameterized-string>
near index 0
regex:(.+)@test
^
	at org.apache.james.rrt.lib.RecipientRewriteTableUtil.regexMap(RecipientRewriteTableUtil.java:67)
	at org.apache.james.rrt.lib.AbstractRecipientRewriteTable.getMappings(AbstractRecipientRewriteTable.java:137)
	at org.apache.james.rrt.lib.AbstractRecipientRewriteTable.getMappings(AbstractRecipientRewriteTable.java:114)
	at org.apache.james.rrt.lib.AbstractRecipientRewriteTableTest.testStoreAndRetrieveRegexMapping(AbstractRecipientRewriteTableTest.java:96)
	at sun.reflect.NativeMethodAccessorImpl.invoke0(Native Method)
	at sun.reflect.NativeMethodAccessorImpl.invoke(NativeMethodAccessorImpl.java:57)
	at sun.reflect.DelegatingMethodAccessorImpl.invoke(DelegatingMethodAccessorImpl.java:43)
	at java.lang.reflect.Method.invoke(Method.java:606)
	at org.junit.runners.model.FrameworkMethod$1.runReflectiveCall(FrameworkMethod.java:47)
	at org.junit.internal.runners.model.ReflectiveCallable.run(ReflectiveCallable.java:12)
	at org.junit.runners.model.FrameworkMethod.invokeExplosively(FrameworkMethod.java:44)
	at org.junit.internal.runners.statements.InvokeMethod.evaluate(InvokeMethod.java:17)
	at org.junit.internal.runners.statements.RunBefores.evaluate(RunBefores.java:26)
	at org.junit.internal.runners.statements.RunAfters.evaluate(RunAfters.java:27)
	at org.junit.runners.ParentRunner.runLeaf(ParentRunner.java:271)
	at org.junit.runners.BlockJUnit4ClassRunner.runChild(BlockJUnit4ClassRunner.java:70)
	at org.junit.runners.BlockJUnit4ClassRunner.runChild(BlockJUnit4ClassRunner.java:50)
	at org.junit.runners.ParentRunner$3.run(ParentRunner.java:238)
	at org.junit.runners.ParentRunner$1.schedule(ParentRunner.java:63)
	at org.junit.runners.ParentRunner.runChildren(ParentRunner.java:236)
	at org.junit.runners.ParentRunner.access$000(ParentRunner.java:53)
	at org.junit.runners.ParentRunner$2.evaluate(ParentRunner.java:229)
	at org.junit.runners.ParentRunner.run(ParentRunner.java:309)
	at org.apache.maven.surefire.junit4.JUnit4Provider.execute(JUnit4Provider.java:264)
	at org.apache.maven.surefire.junit4.JUnit4Provider.executeTestSet(JUnit4Provider.java:153)
	at org.apache.maven.surefire.junit4.JUnit4Provider.invoke(JUnit4Provider.java:124)
	at sun.reflect.NativeMethodAccessorImpl.invoke0(Native Method)
	at sun.reflect.NativeMethodAccessorImpl.invoke(NativeMethodAccessorImpl.java:57)
	at sun.reflect.DelegatingMethodAccessorImpl.invoke(DelegatingMethodAccessorImpl.java:43)
	at java.lang.reflect.Method.invoke(Method.java:606)
	at org.apache.maven.surefire.util.ReflectionUtils.invokeMethodWithArray2(ReflectionUtils.java:208)
	at org.apache.maven.surefire.booter.ProviderFactory$ProviderProxy.invoke(ProviderFactory.java:158)
	at org.apache.maven.surefire.booter.ProviderFactory.invokeProvider(ProviderFactory.java:86)
	at org.apache.maven.surefire.booter.ForkedBooter.runSuitesInProcess(ForkedBooter.java:153)
	at org.apache.maven.surefire.booter.ForkedBooter.main(ForkedBooter.java:95)
Tests run: 6, Failures: 0, Errors: 0, Skipped: 0, Time elapsed: 21.665 sec
2015-04-10 00:22:00,356 [RegionServer:0;pomona.apache.org,55812,1428625301700] WARN  org.apache.hadoop.hbase.regionserver.HRegionServer
- Received close for region we are already opening or closing; 70236052
Running org.apache.james.user.hbase.HBaseUsersRepositoryTest
SLF4J: Class path contains multiple SLF4J bindings.
SLF4J: Found binding in [jar:file:/home/jenkins/jenkins-slave/maven-repositories/0/org/slf4j/slf4j-log4j12/1.7.2/slf4j-log4j12-1.7.2.jar!/org/slf4j/impl/StaticLoggerBinder.class]
SLF4J: Found binding in [jar:file:/home/jenkins/jenkins-slave/maven-repositories/0/org/slf4j/slf4j-simple/1.7.2/slf4j-simple-1.7.2.jar!/org/slf4j/impl/StaticLoggerBinder.class]
SLF4J: See http://www.slf4j.org/codes.html#multiple_bindings for an explanation.
SLF4J: Actual binding is of type [org.slf4j.impl.Log4jLoggerFactory]
2015-04-10 00:22:03,834 [main] WARN  org.apache.hadoop.hdfs.server.namenode.FSNamesystem -
The dfs.support.append option is in your configuration, however append is not supported. This
configuration option is no longer required to enable sync.
2015-04-10 00:22:04,190 [main] WARN  org.apache.hadoop.metrics2.impl.MetricsSystemImpl - Source
name ugi already exists!
2015-04-10 00:22:04,223 [main] WARN  org.apache.hadoop.metrics2.impl.MetricsSystemImpl - Source
name ugi already exists!
2015-04-10 00:22:04,235 [main] WARN  org.apache.hadoop.hdfs.server.namenode.FSNamesystem -
The dfs.support.append option is in your configuration, however append is not supported. This
configuration option is no longer required to enable sync.
Starting DataNode 0 with dfs.data.dir: <https://builds.apache.org/job/james-server-trunk/org.apache.james$james-server-data-hbase/ws/target/test-data/823ad4c7-961f-4710-b5c3-0258e218db45/dfscluster_fcbf32d7-eb30-46ea-895d-de61e93c0008/dfs/data/data1,/home/jenkins/jenkins-slave/workspace/james-server-trunk/trunk/data/data-hbase/target/test-data/823ad4c7-961f-4710-b5c3-0258e218db45/dfscluster_fcbf32d7-eb30-46ea-895d-de61e93c0008/dfs/data/data2>
2015-04-10 00:22:05,042 [main] WARN  org.apache.hadoop.metrics2.impl.MetricsSystemImpl - NameNode
metrics system already initialized!
2015-04-10 00:22:05,042 [main] WARN  org.apache.hadoop.metrics2.impl.MetricsSystemImpl - Source
name ugi already exists!
2015-04-10 00:22:05,391 [main] WARN  org.apache.hadoop.metrics2.impl.MetricsSystemImpl - Source
name jvm already exists!
Cluster is active
2015-04-10 00:22:06,716 [org.apache.hadoop.hdfs.server.datanode.DataXceiver@757ed18b] WARN
 org.apache.hadoop.util.NativeCodeLoader - Unable to load native-hadoop library for your platform...
using builtin-java classes where applicable
2015-04-10 00:22:11,947 [RegionServer:0;pomona.apache.org,54646,1428625326648] ERROR org.apache.hadoop.hbase.regionserver.HRegionServer
- Failed init
java.net.BindException: Address already in use
	at sun.nio.ch.Net.bind0(Native Method)
	at sun.nio.ch.Net.bind(Net.java:444)
	at sun.nio.ch.Net.bind(Net.java:436)
	at sun.nio.ch.ServerSocketChannelImpl.bind(ServerSocketChannelImpl.java:214)
	at sun.nio.ch.ServerSocketAdaptor.bind(ServerSocketAdaptor.java:74)
	at org.mortbay.jetty.nio.SelectChannelConnector.open(SelectChannelConnector.java:216)
	at org.apache.hadoop.http.HttpServer.start(HttpServer.java:593)
	at org.apache.hadoop.hbase.regionserver.HRegionServer.putUpWebUI(HRegionServer.java:1417)
	at org.apache.hadoop.hbase.regionserver.HRegionServer.startServiceThreads(HRegionServer.java:1383)
	at org.apache.hadoop.hbase.regionserver.HRegionServer.handleReportForDutyResponse(HRegionServer.java:926)
	at org.apache.hadoop.hbase.MiniHBaseCluster$MiniHBaseClusterRegionServer.handleReportForDutyResponse(MiniHBaseCluster.java:110)
	at org.apache.hadoop.hbase.regionserver.HRegionServer.run(HRegionServer.java:639)
	at org.apache.hadoop.hbase.MiniHBaseCluster$MiniHBaseClusterRegionServer.runRegionServer(MiniHBaseCluster.java:136)
	at org.apache.hadoop.hbase.MiniHBaseCluster$MiniHBaseClusterRegionServer.access$000(MiniHBaseCluster.java:89)
	at org.apache.hadoop.hbase.MiniHBaseCluster$MiniHBaseClusterRegionServer$1.run(MiniHBaseCluster.java:120)
	at java.security.AccessController.doPrivileged(Native Method)
	at javax.security.auth.Subject.doAs(Subject.java:356)
	at org.apache.hadoop.security.UserGroupInformation.doAs(UserGroupInformation.java:1118)
	at sun.reflect.NativeMethodAccessorImpl.invoke0(Native Method)
	at sun.reflect.NativeMethodAccessorImpl.invoke(NativeMethodAccessorImpl.java:57)
	at sun.reflect.DelegatingMethodAccessorImpl.invoke(DelegatingMethodAccessorImpl.java:43)
	at java.lang.reflect.Method.invoke(Method.java:606)
	at org.apache.hadoop.hbase.util.Methods.call(Methods.java:37)
	at org.apache.hadoop.hbase.security.User.call(User.java:586)
	at org.apache.hadoop.hbase.security.User.access$700(User.java:50)
	at org.apache.hadoop.hbase.security.User$SecureHadoopUser.runAs(User.java:426)
	at org.apache.hadoop.hbase.MiniHBaseCluster$MiniHBaseClusterRegionServer.run(MiniHBaseCluster.java:118)
	at java.lang.Thread.run(Thread.java:745)
2015-04-10 00:22:11,952 [RegionServer:0;pomona.apache.org,54646,1428625326648] FATAL org.apache.hadoop.hbase.regionserver.HRegionServer
- ABORTING region server pomona.apache.org,54646,1428625326648: Unhandled exception: Address
already in use
java.net.BindException: Address already in use
	at sun.nio.ch.Net.bind0(Native Method)
	at sun.nio.ch.Net.bind(Net.java:444)
	at sun.nio.ch.Net.bind(Net.java:436)
	at sun.nio.ch.ServerSocketChannelImpl.bind(ServerSocketChannelImpl.java:214)
	at sun.nio.ch.ServerSocketAdaptor.bind(ServerSocketAdaptor.java:74)
	at org.mortbay.jetty.nio.SelectChannelConnector.open(SelectChannelConnector.java:216)
	at org.apache.hadoop.http.HttpServer.start(HttpServer.java:593)
	at org.apache.hadoop.hbase.regionserver.HRegionServer.putUpWebUI(HRegionServer.java:1417)
	at org.apache.hadoop.hbase.regionserver.HRegionServer.startServiceThreads(HRegionServer.java:1383)
	at org.apache.hadoop.hbase.regionserver.HRegionServer.handleReportForDutyResponse(HRegionServer.java:926)
	at org.apache.hadoop.hbase.MiniHBaseCluster$MiniHBaseClusterRegionServer.handleReportForDutyResponse(MiniHBaseCluster.java:110)
	at org.apache.hadoop.hbase.regionserver.HRegionServer.run(HRegionServer.java:639)
	at org.apache.hadoop.hbase.MiniHBaseCluster$MiniHBaseClusterRegionServer.runRegionServer(MiniHBaseCluster.java:136)
	at org.apache.hadoop.hbase.MiniHBaseCluster$MiniHBaseClusterRegionServer.access$000(MiniHBaseCluster.java:89)
	at org.apache.hadoop.hbase.MiniHBaseCluster$MiniHBaseClusterRegionServer$1.run(MiniHBaseCluster.java:120)
	at java.security.AccessController.doPrivileged(Native Method)
	at javax.security.auth.Subject.doAs(Subject.java:356)
	at org.apache.hadoop.security.UserGroupInformation.doAs(UserGroupInformation.java:1118)
	at sun.reflect.NativeMethodAccessorImpl.invoke0(Native Method)
	at sun.reflect.NativeMethodAccessorImpl.invoke(NativeMethodAccessorImpl.java:57)
	at sun.reflect.DelegatingMethodAccessorImpl.invoke(DelegatingMethodAccessorImpl.java:43)
	at java.lang.reflect.Method.invoke(Method.java:606)
	at org.apache.hadoop.hbase.util.Methods.call(Methods.java:37)
	at org.apache.hadoop.hbase.security.User.call(User.java:586)
	at org.apache.hadoop.hbase.security.User.access$700(User.java:50)
	at org.apache.hadoop.hbase.security.User$SecureHadoopUser.runAs(User.java:426)
	at org.apache.hadoop.hbase.MiniHBaseCluster$MiniHBaseClusterRegionServer.run(MiniHBaseCluster.java:118)
	at java.lang.Thread.run(Thread.java:745)
2015-04-10 00:22:11,953 [RegionServer:0;pomona.apache.org,54646,1428625326648] FATAL org.apache.hadoop.hbase.regionserver.HRegionServer
- RegionServer abort: loaded coprocessors are: []
2015-04-10 00:22:11,955 [IPC Server handler 4 on 52062] ERROR org.apache.hadoop.hbase.master.HMaster
- Region server   pomona.apache.org,54646,1428625326648 reported a fatal error:
ABORTING region server pomona.apache.org,54646,1428625326648: Unhandled exception: Address
already in use
Cause:
java.net.BindException: Address already in use
	at sun.nio.ch.Net.bind0(Native Method)
	at sun.nio.ch.Net.bind(Net.java:444)
	at sun.nio.ch.Net.bind(Net.java:436)
	at sun.nio.ch.ServerSocketChannelImpl.bind(ServerSocketChannelImpl.java:214)
	at sun.nio.ch.ServerSocketAdaptor.bind(ServerSocketAdaptor.java:74)
	at org.mortbay.jetty.nio.SelectChannelConnector.open(SelectChannelConnector.java:216)
	at org.apache.hadoop.http.HttpServer.start(HttpServer.java:593)
	at org.apache.hadoop.hbase.regionserver.HRegionServer.putUpWebUI(HRegionServer.java:1417)
	at org.apache.hadoop.hbase.regionserver.HRegionServer.startServiceThreads(HRegionServer.java:1383)
	at org.apache.hadoop.hbase.regionserver.HRegionServer.handleReportForDutyResponse(HRegionServer.java:926)
	at org.apache.hadoop.hbase.MiniHBaseCluster$MiniHBaseClusterRegionServer.handleReportForDutyResponse(MiniHBaseCluster.java:110)
	at org.apache.hadoop.hbase.regionserver.HRegionServer.run(HRegionServer.java:639)
	at org.apache.hadoop.hbase.MiniHBaseCluster$MiniHBaseClusterRegionServer.runRegionServer(MiniHBaseCluster.java:136)
	at org.apache.hadoop.hbase.MiniHBaseCluster$MiniHBaseClusterRegionServer.access$000(MiniHBaseCluster.java:89)
	at org.apache.hadoop.hbase.MiniHBaseCluster$MiniHBaseClusterRegionServer$1.run(MiniHBaseCluster.java:120)
	at java.security.AccessController.doPrivileged(Native Method)
	at javax.security.auth.Subject.doAs(Subject.java:356)
	at org.apache.hadoop.security.UserGroupInformation.doAs(UserGroupInformation.java:1118)
	at sun.reflect.NativeMethodAccessorImpl.invoke0(Native Method)
	at sun.reflect.NativeMethodAccessorImpl.invoke(NativeMethodAccessorImpl.java:57)
	at sun.reflect.DelegatingMethodAccessorImpl.invoke(DelegatingMethodAccessorImpl.java:43)
	at java.lang.reflect.Method.invoke(Method.java:606)
	at org.apache.hadoop.hbase.util.Methods.call(Methods.java:37)
	at org.apache.hadoop.hbase.security.User.call(User.java:586)
	at org.apache.hadoop.hbase.security.User.access$700(User.java:50)
	at org.apache.hadoop.hbase.security.User$SecureHadoopUser.runAs(User.java:426)
	at org.apache.hadoop.hbase.MiniHBaseCluster$MiniHBaseClusterRegionServer.run(MiniHBaseCluster.java:118)
	at java.lang.Thread.run(Thread.java:745)

2015-04-10 00:26:39,102 [NIOServerCxn.Factory:0.0.0.0/0.0.0.0:21818] WARN  org.apache.zookeeper.server.NIOServerCnxn
- caught end of stream exception
EndOfStreamException: Unable to read additional data from client sessionid 0x14ca0b47e230006,
likely client has closed socket
	at org.apache.zookeeper.server.NIOServerCnxn.doIO(NIOServerCnxn.java:220)
	at org.apache.zookeeper.server.NIOServerCnxnFactory.run(NIOServerCnxnFactory.java:224)
	at java.lang.Thread.run(Thread.java:745)
2015-04-10 00:26:39,103 [NIOServerCxn.Factory:0.0.0.0/0.0.0.0:21818] WARN  org.apache.zookeeper.server.NIOServerCnxn
- caught end of stream exception
EndOfStreamException: Unable to read additional data from client sessionid 0x14ca0b47e230005,
likely client has closed socket
	at org.apache.zookeeper.server.NIOServerCnxn.doIO(NIOServerCnxn.java:220)
	at org.apache.zookeeper.server.NIOServerCnxnFactory.run(NIOServerCnxnFactory.java:224)
	at java.lang.Thread.run(Thread.java:745)
Tests run: 1, Failures: 0, Errors: 1, Skipped: 0, Time elapsed: 605.184 sec <<< FAILURE!
org.apache.james.user.hbase.HBaseUsersRepositoryTest  Time elapsed: 605.183 sec  <<<
ERROR!
java.lang.NoClassDefFoundError: Could not initialize class org.apache.james.user.hbase.HBaseUsersRepositoryTest
	at java.lang.Class.forName0(Native Method)
	at java.lang.Class.forName(Class.java:190)
	at org.apache.maven.surefire.report.SmartStackTraceParser.getClass(SmartStackTraceParser.java:63)
	at org.apache.maven.surefire.report.SmartStackTraceParser.<init>(SmartStackTraceParser.java:53)
	at org.apache.maven.surefire.common.junit4.JUnit4StackTraceWriter.smartTrimmedStackTrace(JUnit4StackTraceWriter.java:72)
	at org.apache.maven.surefire.booter.ForkingRunListener.encode(ForkingRunListener.java:328)
	at org.apache.maven.surefire.booter.ForkingRunListener.encode(ForkingRunListener.java:312)
	at org.apache.maven.surefire.booter.ForkingRunListener.toString(ForkingRunListener.java:258)
	at org.apache.maven.surefire.booter.ForkingRunListener.testError(ForkingRunListener.java:131)
	at org.apache.maven.surefire.common.junit4.JUnit4RunListener.testFailure(JUnit4RunListener.java:111)
	at org.junit.runner.notification.RunNotifier$4.notifyListener(RunNotifier.java:139)
	at org.junit.runner.notification.RunNotifier$SafeNotifier.run(RunNotifier.java:61)
	at org.junit.runner.notification.RunNotifier.fireTestFailures(RunNotifier.java:134)
	at org.junit.runner.notification.RunNotifier.fireTestFailure(RunNotifier.java:128)
	at org.junit.internal.runners.model.EachTestNotifier.addFailure(EachTestNotifier.java:23)
	at org.junit.runners.ParentRunner.run(ParentRunner.java:315)
	at org.apache.maven.surefire.junit4.JUnit4Provider.execute(JUnit4Provider.java:264)
	at org.apache.maven.surefire.junit4.JUnit4Provider.executeTestSet(JUnit4Provider.java:153)
	at org.apache.maven.surefire.junit4.JUnit4Provider.invoke(JUnit4Provider.java:124)


Results :

Tests in error: 
  JUnit4Provider.invoke:124->executeTestSet:153->execute:264 � NoClassDefFound C...

Tests run: 16, Failures: 0, Errors: 1, Skipped: 0

[JENKINS] Recording test results

---------------------------------------------------------------------
To unsubscribe, e-mail: server-dev-unsubscribe@james.apache.org
For additional commands, e-mail: server-dev-help@james.apache.org


Mime
View raw message