james-server-dev mailing list archives

Site index · List index
Message view « Date » · « Thread »
Top « Date » · « Thread »
From Apache Jenkins Server <jenk...@builds.apache.org>
Subject Build failed in Jenkins: james-server-trunk » Apache James :: Server :: Data :: HBase Persistence #5221
Date Wed, 20 May 2015 07:33:36 GMT
See <https://builds.apache.org/job/james-server-trunk/org.apache.james$james-server-data-hbase/5221/>

------------------------------------------
[...truncated 380 lines...]
2015-05-20 07:28:37,698 [main] WARN  org.apache.hadoop.hdfs.server.namenode.FSNamesystem -
The dfs.support.append option is in your configuration, however append is not supported. This
configuration option is no longer required to enable sync.
Starting DataNode 0 with dfs.data.dir: <https://builds.apache.org/job/james-server-trunk/org.apache.james$james-server-data-hbase/ws/target/test-data/dc2c0966-7de3-4266-b4d7-8e203a7841e3/dfscluster_01060df0-0870-4b21-b1e8-6442d1dd8856/dfs/data/data1,/jenkins/workspace/james-server-trunk/trunk/data/data-hbase/target/test-data/dc2c0966-7de3-4266-b4d7-8e203a7841e3/dfscluster_01060df0-0870-4b21-b1e8-6442d1dd8856/dfs/data/data2>
2015-05-20 07:28:38,553 [main] WARN  org.apache.hadoop.metrics2.impl.MetricsSystemImpl - NameNode
metrics system already initialized!
2015-05-20 07:28:38,553 [main] WARN  org.apache.hadoop.metrics2.impl.MetricsSystemImpl - Source
name ugi already exists!
2015-05-20 07:28:39,007 [main] WARN  org.apache.hadoop.metrics2.impl.MetricsSystemImpl - Source
name jvm already exists!
Cluster is active
2015-05-20 07:28:40,073 [org.apache.hadoop.hdfs.server.datanode.DataXceiver@28aff069] WARN
 org.apache.hadoop.util.NativeCodeLoader - Unable to load native-hadoop library for your platform...
using builtin-java classes where applicable
2015-05-20 07:28:48,018 [Master:0;jenkins-ubuntu-1404-4gb-25,43874,1432106919733] WARN  org.apache.hadoop.hbase.zookeeper.RecoverableZooKeeper
- Node /hbase/root-region-server already deleted, and this is not a retry
2015-05-20 07:28:52,525 [NIOServerCxn.Factory:0.0.0.0/0.0.0.0:21818] WARN  org.apache.zookeeper.server.NIOServerCnxn
- caught end of stream exception
EndOfStreamException: Unable to read additional data from client sessionid 0x14d703965110007,
likely client has closed socket
	at org.apache.zookeeper.server.NIOServerCnxn.doIO(NIOServerCnxn.java:220)
	at org.apache.zookeeper.server.NIOServerCnxnFactory.run(NIOServerCnxnFactory.java:224)
	at java.lang.Thread.run(Thread.java:745)
2015-05-20 07:28:56,433 [main] ERROR MockLog - Exception during regexMap processing: 
java.util.regex.PatternSyntaxException: Regex should be formatted as regex:<regular-expression>:<parameterized-string>
near index 0
regex:(.*)@localhost
^
	at org.apache.james.rrt.lib.RecipientRewriteTableUtil.regexMap(RecipientRewriteTableUtil.java:67)
	at org.apache.james.rrt.lib.AbstractRecipientRewriteTable.getMappings(AbstractRecipientRewriteTable.java:137)
	at org.apache.james.rrt.lib.AbstractRecipientRewriteTable.getMappings(AbstractRecipientRewriteTable.java:114)
	at org.apache.james.rrt.lib.AbstractRecipientRewriteTableTest.testStoreAndRetrieveRegexMapping(AbstractRecipientRewriteTableTest.java:96)
	at sun.reflect.NativeMethodAccessorImpl.invoke0(Native Method)
	at sun.reflect.NativeMethodAccessorImpl.invoke(NativeMethodAccessorImpl.java:57)
	at sun.reflect.DelegatingMethodAccessorImpl.invoke(DelegatingMethodAccessorImpl.java:43)
	at java.lang.reflect.Method.invoke(Method.java:606)
	at org.junit.runners.model.FrameworkMethod$1.runReflectiveCall(FrameworkMethod.java:47)
	at org.junit.internal.runners.model.ReflectiveCallable.run(ReflectiveCallable.java:12)
	at org.junit.runners.model.FrameworkMethod.invokeExplosively(FrameworkMethod.java:44)
	at org.junit.internal.runners.statements.InvokeMethod.evaluate(InvokeMethod.java:17)
	at org.junit.internal.runners.statements.RunBefores.evaluate(RunBefores.java:26)
	at org.junit.internal.runners.statements.RunAfters.evaluate(RunAfters.java:27)
	at org.junit.runners.ParentRunner.runLeaf(ParentRunner.java:271)
	at org.junit.runners.BlockJUnit4ClassRunner.runChild(BlockJUnit4ClassRunner.java:70)
	at org.junit.runners.BlockJUnit4ClassRunner.runChild(BlockJUnit4ClassRunner.java:50)
	at org.junit.runners.ParentRunner$3.run(ParentRunner.java:238)
	at org.junit.runners.ParentRunner$1.schedule(ParentRunner.java:63)
	at org.junit.runners.ParentRunner.runChildren(ParentRunner.java:236)
	at org.junit.runners.ParentRunner.access$000(ParentRunner.java:53)
	at org.junit.runners.ParentRunner$2.evaluate(ParentRunner.java:229)
	at org.junit.runners.ParentRunner.run(ParentRunner.java:309)
	at org.apache.maven.surefire.junit4.JUnit4Provider.execute(JUnit4Provider.java:264)
	at org.apache.maven.surefire.junit4.JUnit4Provider.executeTestSet(JUnit4Provider.java:153)
	at org.apache.maven.surefire.junit4.JUnit4Provider.invoke(JUnit4Provider.java:124)
	at sun.reflect.NativeMethodAccessorImpl.invoke0(Native Method)
	at sun.reflect.NativeMethodAccessorImpl.invoke(NativeMethodAccessorImpl.java:57)
	at sun.reflect.DelegatingMethodAccessorImpl.invoke(DelegatingMethodAccessorImpl.java:43)
	at java.lang.reflect.Method.invoke(Method.java:606)
	at org.apache.maven.surefire.util.ReflectionUtils.invokeMethodWithArray2(ReflectionUtils.java:208)
	at org.apache.maven.surefire.booter.ProviderFactory$ProviderProxy.invoke(ProviderFactory.java:158)
	at org.apache.maven.surefire.booter.ProviderFactory.invokeProvider(ProviderFactory.java:86)
	at org.apache.maven.surefire.booter.ForkedBooter.runSuitesInProcess(ForkedBooter.java:153)
	at org.apache.maven.surefire.booter.ForkedBooter.main(ForkedBooter.java:95)
2015-05-20 07:28:56,453 [main] ERROR MockLog - Exception during regexMap processing: 
java.util.regex.PatternSyntaxException: Regex should be formatted as regex:<regular-expression>:<parameterized-string>
near index 0
regex:(.+)@test
^
	at org.apache.james.rrt.lib.RecipientRewriteTableUtil.regexMap(RecipientRewriteTableUtil.java:67)
	at org.apache.james.rrt.lib.AbstractRecipientRewriteTable.getMappings(AbstractRecipientRewriteTable.java:137)
	at org.apache.james.rrt.lib.AbstractRecipientRewriteTable.getMappings(AbstractRecipientRewriteTable.java:114)
	at org.apache.james.rrt.lib.AbstractRecipientRewriteTableTest.testStoreAndRetrieveRegexMapping(AbstractRecipientRewriteTableTest.java:96)
	at sun.reflect.NativeMethodAccessorImpl.invoke0(Native Method)
	at sun.reflect.NativeMethodAccessorImpl.invoke(NativeMethodAccessorImpl.java:57)
	at sun.reflect.DelegatingMethodAccessorImpl.invoke(DelegatingMethodAccessorImpl.java:43)
	at java.lang.reflect.Method.invoke(Method.java:606)
	at org.junit.runners.model.FrameworkMethod$1.runReflectiveCall(FrameworkMethod.java:47)
	at org.junit.internal.runners.model.ReflectiveCallable.run(ReflectiveCallable.java:12)
	at org.junit.runners.model.FrameworkMethod.invokeExplosively(FrameworkMethod.java:44)
	at org.junit.internal.runners.statements.InvokeMethod.evaluate(InvokeMethod.java:17)
	at org.junit.internal.runners.statements.RunBefores.evaluate(RunBefores.java:26)
	at org.junit.internal.runners.statements.RunAfters.evaluate(RunAfters.java:27)
	at org.junit.runners.ParentRunner.runLeaf(ParentRunner.java:271)
	at org.junit.runners.BlockJUnit4ClassRunner.runChild(BlockJUnit4ClassRunner.java:70)
	at org.junit.runners.BlockJUnit4ClassRunner.runChild(BlockJUnit4ClassRunner.java:50)
	at org.junit.runners.ParentRunner$3.run(ParentRunner.java:238)
	at org.junit.runners.ParentRunner$1.schedule(ParentRunner.java:63)
	at org.junit.runners.ParentRunner.runChildren(ParentRunner.java:236)
	at org.junit.runners.ParentRunner.access$000(ParentRunner.java:53)
	at org.junit.runners.ParentRunner$2.evaluate(ParentRunner.java:229)
	at org.junit.runners.ParentRunner.run(ParentRunner.java:309)
	at org.apache.maven.surefire.junit4.JUnit4Provider.execute(JUnit4Provider.java:264)
	at org.apache.maven.surefire.junit4.JUnit4Provider.executeTestSet(JUnit4Provider.java:153)
	at org.apache.maven.surefire.junit4.JUnit4Provider.invoke(JUnit4Provider.java:124)
	at sun.reflect.NativeMethodAccessorImpl.invoke0(Native Method)
	at sun.reflect.NativeMethodAccessorImpl.invoke(NativeMethodAccessorImpl.java:57)
	at sun.reflect.DelegatingMethodAccessorImpl.invoke(DelegatingMethodAccessorImpl.java:43)
	at java.lang.reflect.Method.invoke(Method.java:606)
	at org.apache.maven.surefire.util.ReflectionUtils.invokeMethodWithArray2(ReflectionUtils.java:208)
	at org.apache.maven.surefire.booter.ProviderFactory$ProviderProxy.invoke(ProviderFactory.java:158)
	at org.apache.maven.surefire.booter.ProviderFactory.invokeProvider(ProviderFactory.java:86)
	at org.apache.maven.surefire.booter.ForkedBooter.runSuitesInProcess(ForkedBooter.java:153)
	at org.apache.maven.surefire.booter.ForkedBooter.main(ForkedBooter.java:95)
Tests run: 6, Failures: 0, Errors: 0, Skipped: 0, Time elapsed: 21.206 sec
2015-05-20 07:28:57,792 [RegionServer:0;jenkins-ubuntu-1404-4gb-25,36251,1432106919995] WARN
 org.apache.hadoop.hbase.regionserver.HRegionServer - Received close for region we are already
opening or closing; 70236052
Running org.apache.james.domainlist.hbase.HBaseDomainListTest
SLF4J: Class path contains multiple SLF4J bindings.
SLF4J: Found binding in [jar:file:/jenkins/maven-repositories/0/org/slf4j/slf4j-log4j12/1.7.2/slf4j-log4j12-1.7.2.jar!/org/slf4j/impl/StaticLoggerBinder.class]
SLF4J: Found binding in [jar:file:/jenkins/maven-repositories/0/org/slf4j/slf4j-simple/1.7.2/slf4j-simple-1.7.2.jar!/org/slf4j/impl/StaticLoggerBinder.class]
SLF4J: See http://www.slf4j.org/codes.html#multiple_bindings for an explanation.
SLF4J: Actual binding is of type [org.slf4j.impl.Log4jLoggerFactory]
2015-05-20 07:29:01,731 [main] WARN  org.apache.hadoop.hdfs.server.namenode.FSNamesystem -
The dfs.support.append option is in your configuration, however append is not supported. This
configuration option is no longer required to enable sync.
2015-05-20 07:29:02,130 [main] WARN  org.apache.hadoop.metrics2.impl.MetricsSystemImpl - Source
name ugi already exists!
2015-05-20 07:29:02,198 [main] WARN  org.apache.hadoop.metrics2.impl.MetricsSystemImpl - Source
name ugi already exists!
2015-05-20 07:29:02,212 [main] WARN  org.apache.hadoop.hdfs.server.namenode.FSNamesystem -
The dfs.support.append option is in your configuration, however append is not supported. This
configuration option is no longer required to enable sync.
Starting DataNode 0 with dfs.data.dir: <https://builds.apache.org/job/james-server-trunk/org.apache.james$james-server-data-hbase/ws/target/test-data/ac06ea1d-7e43-4b21-b80c-61c73bc54b28/dfscluster_e52bd586-d006-43b9-a3c8-86e83ebca35f/dfs/data/data1,/jenkins/workspace/james-server-trunk/trunk/data/data-hbase/target/test-data/ac06ea1d-7e43-4b21-b80c-61c73bc54b28/dfscluster_e52bd586-d006-43b9-a3c8-86e83ebca35f/dfs/data/data2>
2015-05-20 07:29:03,085 [main] WARN  org.apache.hadoop.metrics2.impl.MetricsSystemImpl - NameNode
metrics system already initialized!
2015-05-20 07:29:03,085 [main] WARN  org.apache.hadoop.metrics2.impl.MetricsSystemImpl - Source
name ugi already exists!
2015-05-20 07:29:03,483 [main] WARN  org.apache.hadoop.metrics2.impl.MetricsSystemImpl - Source
name jvm already exists!
Cluster is active
2015-05-20 07:29:04,933 [org.apache.hadoop.hdfs.server.datanode.DataXceiver@c3fc233] WARN
 org.apache.hadoop.util.NativeCodeLoader - Unable to load native-hadoop library for your platform...
using builtin-java classes where applicable
2015-05-20 07:29:13,271 [Master:0;jenkins-ubuntu-1404-4gb-25,52883,1432106944586] WARN  org.apache.hadoop.hbase.zookeeper.RecoverableZooKeeper
- Node /hbase/root-region-server already deleted, and this is not a retry
Tests run: 5, Failures: 0, Errors: 0, Skipped: 0, Time elapsed: 19.704 sec
2015-05-20 07:29:20,023 [RegionServer:0;jenkins-ubuntu-1404-4gb-25,38290,1432106944856] WARN
 org.apache.hadoop.hbase.regionserver.HRegionServer - Received close for region we are already
opening or closing; 70236052
Running org.apache.james.system.hbase.TablePoolTest
SLF4J: Class path contains multiple SLF4J bindings.
SLF4J: Found binding in [jar:file:/jenkins/maven-repositories/0/org/slf4j/slf4j-log4j12/1.7.2/slf4j-log4j12-1.7.2.jar!/org/slf4j/impl/StaticLoggerBinder.class]
SLF4J: Found binding in [jar:file:/jenkins/maven-repositories/0/org/slf4j/slf4j-simple/1.7.2/slf4j-simple-1.7.2.jar!/org/slf4j/impl/StaticLoggerBinder.class]
SLF4J: See http://www.slf4j.org/codes.html#multiple_bindings for an explanation.
SLF4J: Actual binding is of type [org.slf4j.impl.Log4jLoggerFactory]
2015-05-20 07:29:23,875 [main] WARN  org.apache.hadoop.hdfs.server.namenode.FSNamesystem -
The dfs.support.append option is in your configuration, however append is not supported. This
configuration option is no longer required to enable sync.
2015-05-20 07:29:24,274 [main] WARN  org.apache.hadoop.metrics2.impl.MetricsSystemImpl - Source
name ugi already exists!
2015-05-20 07:29:24,338 [main] WARN  org.apache.hadoop.metrics2.impl.MetricsSystemImpl - Source
name ugi already exists!
2015-05-20 07:29:24,352 [main] WARN  org.apache.hadoop.hdfs.server.namenode.FSNamesystem -
The dfs.support.append option is in your configuration, however append is not supported. This
configuration option is no longer required to enable sync.
Starting DataNode 0 with dfs.data.dir: <https://builds.apache.org/job/james-server-trunk/org.apache.james$james-server-data-hbase/ws/target/test-data/2c81348c-f3df-4633-9292-6dccf32ed728/dfscluster_f7cc8ca8-8655-4044-adc5-38b8263d45a7/dfs/data/data1,/jenkins/workspace/james-server-trunk/trunk/data/data-hbase/target/test-data/2c81348c-f3df-4633-9292-6dccf32ed728/dfscluster_f7cc8ca8-8655-4044-adc5-38b8263d45a7/dfs/data/data2>
2015-05-20 07:29:25,209 [main] WARN  org.apache.hadoop.metrics2.impl.MetricsSystemImpl - NameNode
metrics system already initialized!
2015-05-20 07:29:25,209 [main] WARN  org.apache.hadoop.metrics2.impl.MetricsSystemImpl - Source
name ugi already exists!
2015-05-20 07:29:25,612 [main] WARN  org.apache.hadoop.metrics2.impl.MetricsSystemImpl - Source
name jvm already exists!
Cluster is active
2015-05-20 07:29:26,657 [org.apache.hadoop.hdfs.server.datanode.DataXceiver@4de9150a] WARN
 org.apache.hadoop.util.NativeCodeLoader - Unable to load native-hadoop library for your platform...
using builtin-java classes where applicable
2015-05-20 07:29:33,780 [Master:0;jenkins-ubuntu-1404-4gb-25,37229,1432106966309] WARN  org.apache.hadoop.hbase.zookeeper.RecoverableZooKeeper
- Node /hbase/root-region-server already deleted, and this is not a retry
Tests run: 4, Failures: 0, Errors: 0, Skipped: 0, Time elapsed: 18.191 sec
2015-05-20 07:29:43,541 [RegionServer:0;jenkins-ubuntu-1404-4gb-25,42587,1432106966578] WARN
 org.apache.hadoop.hbase.regionserver.HRegionServer - Received close for region we are already
opening or closing; 70236052
Running org.apache.james.user.hbase.HBaseUsersRepositoryTest
SLF4J: Class path contains multiple SLF4J bindings.
SLF4J: Found binding in [jar:file:/jenkins/maven-repositories/0/org/slf4j/slf4j-log4j12/1.7.2/slf4j-log4j12-1.7.2.jar!/org/slf4j/impl/StaticLoggerBinder.class]
SLF4J: Found binding in [jar:file:/jenkins/maven-repositories/0/org/slf4j/slf4j-simple/1.7.2/slf4j-simple-1.7.2.jar!/org/slf4j/impl/StaticLoggerBinder.class]
SLF4J: See http://www.slf4j.org/codes.html#multiple_bindings for an explanation.
SLF4J: Actual binding is of type [org.slf4j.impl.Log4jLoggerFactory]
2015-05-20 07:29:47,412 [main] WARN  org.apache.hadoop.hdfs.server.namenode.FSNamesystem -
The dfs.support.append option is in your configuration, however append is not supported. This
configuration option is no longer required to enable sync.
2015-05-20 07:29:47,810 [main] WARN  org.apache.hadoop.metrics2.impl.MetricsSystemImpl - Source
name ugi already exists!
2015-05-20 07:29:47,879 [main] WARN  org.apache.hadoop.metrics2.impl.MetricsSystemImpl - Source
name ugi already exists!
2015-05-20 07:29:47,893 [main] WARN  org.apache.hadoop.hdfs.server.namenode.FSNamesystem -
The dfs.support.append option is in your configuration, however append is not supported. This
configuration option is no longer required to enable sync.
Starting DataNode 0 with dfs.data.dir: <https://builds.apache.org/job/james-server-trunk/org.apache.james$james-server-data-hbase/ws/target/test-data/64390f51-9c16-4759-ba42-412358e24a8c/dfscluster_837f7574-7b97-4603-8c08-d3c0e5560891/dfs/data/data1,/jenkins/workspace/james-server-trunk/trunk/data/data-hbase/target/test-data/64390f51-9c16-4759-ba42-412358e24a8c/dfscluster_837f7574-7b97-4603-8c08-d3c0e5560891/dfs/data/data2>
2015-05-20 07:29:48,762 [main] WARN  org.apache.hadoop.metrics2.impl.MetricsSystemImpl - NameNode
metrics system already initialized!
2015-05-20 07:29:48,763 [main] WARN  org.apache.hadoop.metrics2.impl.MetricsSystemImpl - Source
name ugi already exists!
2015-05-20 07:29:49,165 [main] WARN  org.apache.hadoop.metrics2.impl.MetricsSystemImpl - Source
name jvm already exists!
Cluster is active
2015-05-20 07:29:50,222 [org.apache.hadoop.hdfs.server.datanode.DataXceiver@7ae9c52d] WARN
 org.apache.hadoop.util.NativeCodeLoader - Unable to load native-hadoop library for your platform...
using builtin-java classes where applicable
2015-05-20 07:29:58,981 [Master:0;jenkins-ubuntu-1404-4gb-25,37138,1432106989879] WARN  org.apache.hadoop.hbase.zookeeper.RecoverableZooKeeper
- Node /hbase/root-region-server already deleted, and this is not a retry
Tests run: 7, Failures: 0, Errors: 0, Skipped: 0, Time elapsed: 20.451 sec
2015-05-20 07:30:08,724 [RegionServer:0;jenkins-ubuntu-1404-4gb-25,59777,1432106990147] WARN
 org.apache.hadoop.hbase.regionserver.HRegionServer - Received close for region we are already
opening or closing; 70236052

Results :

Tests run: 22, Failures: 0, Errors: 0, Skipped: 0

[JENKINS] Recording test results
[INFO] 
[INFO] --- maven-bundle-plugin:2.3.7:bundle (default-bundle) @ james-server-data-hbase ---
[INFO] 
[INFO] --- maven-jar-plugin:2.4:jar (jar) @ james-server-data-hbase ---
[INFO] 
[INFO] --- maven-jar-plugin:2.4:test-jar (test-jar) @ james-server-data-hbase ---
[INFO] Building jar: <https://builds.apache.org/job/james-server-trunk/org.apache.james$james-server-data-hbase/ws/target/james-server-data-hbase-3.0.0-beta5-SNAPSHOT-tests.jar>
[WARNING] Failed to getClass for org.apache.maven.plugin.source.SourceJarMojo
[INFO] 
[INFO] --- maven-source-plugin:2.2.1:jar (attach-sources) @ james-server-data-hbase ---
[INFO] Building jar: <https://builds.apache.org/job/james-server-trunk/org.apache.james$james-server-data-hbase/ws/target/james-server-data-hbase-3.0.0-beta5-SNAPSHOT-sources.jar>
[WARNING] Failed to getClass for org.apache.maven.plugin.source.TestSourceJarMojo
[INFO] 
[INFO] --- maven-source-plugin:2.2.1:test-jar (attach-sources) @ james-server-data-hbase ---
[INFO] Building jar: <https://builds.apache.org/job/james-server-trunk/org.apache.james$james-server-data-hbase/ws/target/james-server-data-hbase-3.0.0-beta5-SNAPSHOT-test-sources.jar>
[INFO] 
[INFO] --- maven-site-plugin:3.2:attach-descriptor (attach-descriptor) @ james-server-data-hbase
---
[INFO] 
[INFO] --- maven-install-plugin:2.5.1:install (default-install) @ james-server-data-hbase
---
[INFO] Installing <https://builds.apache.org/job/james-server-trunk/org.apache.james$james-server-data-hbase/ws/target/james-server-data-hbase-3.0.0-beta5-SNAPSHOT.jar>
to /jenkins/maven-repositories/0/org/apache/james/james-server-data-hbase/3.0.0-beta5-SNAPSHOT/james-server-data-hbase-3.0.0-beta5-SNAPSHOT.jar
[INFO] Installing <https://builds.apache.org/job/james-server-trunk/org.apache.james$james-server-data-hbase/ws/pom.xml>
to /jenkins/maven-repositories/0/org/apache/james/james-server-data-hbase/3.0.0-beta5-SNAPSHOT/james-server-data-hbase-3.0.0-beta5-SNAPSHOT.pom
[INFO] Installing <https://builds.apache.org/job/james-server-trunk/org.apache.james$james-server-data-hbase/ws/target/james-server-data-hbase-3.0.0-beta5-SNAPSHOT-tests.jar>
to /jenkins/maven-repositories/0/org/apache/james/james-server-data-hbase/3.0.0-beta5-SNAPSHOT/james-server-data-hbase-3.0.0-beta5-SNAPSHOT-tests.jar
[INFO] Installing <https://builds.apache.org/job/james-server-trunk/org.apache.james$james-server-data-hbase/ws/target/james-server-data-hbase-3.0.0-beta5-SNAPSHOT-sources.jar>
to /jenkins/maven-repositories/0/org/apache/james/james-server-data-hbase/3.0.0-beta5-SNAPSHOT/james-server-data-hbase-3.0.0-beta5-SNAPSHOT-sources.jar
[INFO] Installing <https://builds.apache.org/job/james-server-trunk/org.apache.james$james-server-data-hbase/ws/target/james-server-data-hbase-3.0.0-beta5-SNAPSHOT-test-sources.jar>
to /jenkins/maven-repositories/0/org/apache/james/james-server-data-hbase/3.0.0-beta5-SNAPSHOT/james-server-data-hbase-3.0.0-beta5-SNAPSHOT-test-sources.jar
[INFO] 
[INFO] --- maven-bundle-plugin:2.3.7:install (default-install) @ james-server-data-hbase ---
[INFO] Installing org/apache/james/james-server-data-hbase/3.0.0-beta5-SNAPSHOT/james-server-data-hbase-3.0.0-beta5-SNAPSHOT.jar
[INFO] Writing OBR metadata
[INFO] 
[INFO] --- maven-remote-resources-plugin:1.4:process (default) @ james-server-data-hbase ---
[INFO] 
[INFO] --- maven-resources-plugin:2.6:resources (default-resources) @ james-server-data-hbase
---
[INFO] Using 'UTF-8' encoding to copy filtered resources.
[INFO] skip non existing resourceDirectory <https://builds.apache.org/job/james-server-trunk/org.apache.james$james-server-data-hbase/ws/src/main/resources>
[INFO] Copying 3 resources
[INFO] Copying 3 resources
[INFO] 
[INFO] --- maven-compiler-plugin:3.0:compile (default-compile) @ james-server-data-hbase ---
[INFO] Changes detected - recompiling the module!
[INFO] Compiling 7 source files to <https://builds.apache.org/job/james-server-trunk/org.apache.james$james-server-data-hbase/ws/target/classes>
[INFO] 
[INFO] --- maven-resources-plugin:2.6:testResources (default-testResources) @ james-server-data-hbase
---
[INFO] Using 'UTF-8' encoding to copy filtered resources.
[INFO] Copying 2 resources
[INFO] Copying 3 resources
[INFO] Copying 3 resources
[INFO] 
[INFO] --- maven-compiler-plugin:3.0:testCompile (default-testCompile) @ james-server-data-hbase
---
[INFO] Changes detected - recompiling the module!
[INFO] Compiling 4 source files to <https://builds.apache.org/job/james-server-trunk/org.apache.james$james-server-data-hbase/ws/target/test-classes>
[WARNING] <https://builds.apache.org/job/james-server-trunk/org.apache.james$james-server-data-hbase/ws/src/test/java/org/apache/james/system/hbase/TablePoolTest.java>:
<https://builds.apache.org/job/james-server-trunk/org.apache.james$james-server-data-hbase/ws/src/test/java/org/apache/james/system/hbase/TablePoolTest.java>
uses or overrides a deprecated API.
[WARNING] <https://builds.apache.org/job/james-server-trunk/org.apache.james$james-server-data-hbase/ws/src/test/java/org/apache/james/system/hbase/TablePoolTest.java>:
Recompile with -Xlint:deprecation for details.
[INFO] 
[INFO] --- maven-surefire-plugin:2.13:test (default-test) @ james-server-data-hbase ---
[INFO] Skipping execution of surefire because it has already been run for this configuration
[JENKINS] Recording test results
[INFO] 
[INFO] --- maven-bundle-plugin:2.3.7:bundle (default-bundle) @ james-server-data-hbase ---
[INFO] 
[INFO] --- maven-jar-plugin:2.4:jar (jar) @ james-server-data-hbase ---
[INFO] 
[INFO] --- maven-jar-plugin:2.4:test-jar (test-jar) @ james-server-data-hbase ---
[INFO] Building jar: <https://builds.apache.org/job/james-server-trunk/org.apache.james$james-server-data-hbase/ws/target/james-server-data-hbase-3.0.0-beta5-SNAPSHOT-tests.jar>
[WARNING] Artifact org.apache.james:james-server-data-hbase:test-jar:tests:3.0.0-beta5-SNAPSHOT
already attached to project, ignoring duplicate
[WARNING] Failed to getClass for org.apache.maven.plugin.source.SourceJarMojo
[INFO] 
[INFO] --- maven-source-plugin:2.2.1:jar (attach-sources) @ james-server-data-hbase ---
[INFO] Building jar: <https://builds.apache.org/job/james-server-trunk/org.apache.james$james-server-data-hbase/ws/target/james-server-data-hbase-3.0.0-beta5-SNAPSHOT-sources.jar>
[WARNING] Artifact org.apache.james:james-server-data-hbase:java-source:sources:3.0.0-beta5-SNAPSHOT
already attached to project, ignoring duplicate
[WARNING] Failed to getClass for org.apache.maven.plugin.source.TestSourceJarMojo
[INFO] 
[INFO] --- maven-source-plugin:2.2.1:test-jar (attach-sources) @ james-server-data-hbase ---
[INFO] Building jar: <https://builds.apache.org/job/james-server-trunk/org.apache.james$james-server-data-hbase/ws/target/james-server-data-hbase-3.0.0-beta5-SNAPSHOT-test-sources.jar>
[WARNING] Artifact org.apache.james:james-server-data-hbase:java-source:test-sources:3.0.0-beta5-SNAPSHOT
already attached to project, ignoring duplicate
[INFO] 
[INFO] --- maven-site-plugin:3.2:attach-descriptor (attach-descriptor) @ james-server-data-hbase
---
[INFO] 
[INFO] --- maven-install-plugin:2.5.1:install (default-install) @ james-server-data-hbase
---
[INFO] Installing <https://builds.apache.org/job/james-server-trunk/org.apache.james$james-server-data-hbase/ws/target/james-server-data-hbase-3.0.0-beta5-SNAPSHOT.jar>
to /jenkins/maven-repositories/0/org/apache/james/james-server-data-hbase/3.0.0-beta5-SNAPSHOT/james-server-data-hbase-3.0.0-beta5-SNAPSHOT.jar
[INFO] Installing <https://builds.apache.org/job/james-server-trunk/org.apache.james$james-server-data-hbase/ws/pom.xml>
to /jenkins/maven-repositories/0/org/apache/james/james-server-data-hbase/3.0.0-beta5-SNAPSHOT/james-server-data-hbase-3.0.0-beta5-SNAPSHOT.pom
[INFO] Installing <https://builds.apache.org/job/james-server-trunk/org.apache.james$james-server-data-hbase/ws/target/james-server-data-hbase-3.0.0-beta5-SNAPSHOT-tests.jar>
to /jenkins/maven-repositories/0/org/apache/james/james-server-data-hbase/3.0.0-beta5-SNAPSHOT/james-server-data-hbase-3.0.0-beta5-SNAPSHOT-tests.jar
[INFO] Installing <https://builds.apache.org/job/james-server-trunk/org.apache.james$james-server-data-hbase/ws/target/james-server-data-hbase-3.0.0-beta5-SNAPSHOT-sources.jar>
to /jenkins/maven-repositories/0/org/apache/james/james-server-data-hbase/3.0.0-beta5-SNAPSHOT/james-server-data-hbase-3.0.0-beta5-SNAPSHOT-sources.jar
[INFO] Installing <https://builds.apache.org/job/james-server-trunk/org.apache.james$james-server-data-hbase/ws/target/james-server-data-hbase-3.0.0-beta5-SNAPSHOT-test-sources.jar>
to /jenkins/maven-repositories/0/org/apache/james/james-server-data-hbase/3.0.0-beta5-SNAPSHOT/james-server-data-hbase-3.0.0-beta5-SNAPSHOT-test-sources.jar
[INFO] 
[INFO] --- maven-bundle-plugin:2.3.7:install (default-install) @ james-server-data-hbase ---
[INFO] Installing org/apache/james/james-server-data-hbase/3.0.0-beta5-SNAPSHOT/james-server-data-hbase-3.0.0-beta5-SNAPSHOT.jar
[INFO] Writing OBR metadata
[INFO] 
[INFO] --- maven-deploy-plugin:2.7:deploy (default-deploy) @ james-server-data-hbase ---
Downloading: https://repository.apache.org/content/repositories/snapshots/org/apache/james/james-server-data-hbase/3.0.0-beta5-SNAPSHOT/maven-metadata.xml
Downloaded: https://repository.apache.org/content/repositories/snapshots/org/apache/james/james-server-data-hbase/3.0.0-beta5-SNAPSHOT/maven-metadata.xml
(2 KB at 0.3 KB/sec)
Uploading: https://repository.apache.org/content/repositories/snapshots/org/apache/james/james-server-data-hbase/3.0.0-beta5-SNAPSHOT/james-server-data-hbase-3.0.0-beta5-20150520.073021-1033.jar
Uploading: https://repository.apache.org/content/repositories/snapshots/org/apache/james/james-server-data-hbase/3.0.0-beta5-SNAPSHOT/james-server-data-hbase-3.0.0-beta5-20150520.073021-1033.pom

---------------------------------------------------------------------
To unsubscribe, e-mail: server-dev-unsubscribe@james.apache.org
For additional commands, e-mail: server-dev-help@james.apache.org


Mime
View raw message