james-server-dev mailing list archives

Site index · List index
Message view « Date » · « Thread »
Top « Date » · « Thread »
From Apache Jenkins Server <jenk...@builds.apache.org>
Subject Build failed in Jenkins: jdkim-trunk #2410
Date Thu, 11 Jun 2015 11:23:31 GMT
See <https://builds.apache.org/job/jdkim-trunk/2410/>

------------------------------------------
[...truncated 97 lines...]
AU        main/src/test/resources/org/apache/james/jdkim/Mail-DKIM/corpus/mine_ietf01_4.txt
AU        main/src/test/resources/org/apache/james/jdkim/Mail-DKIM/corpus/goodkey_3.txt
AU        main/src/test/resources/org/apache/james/jdkim/Mail-DKIM/corpus/goodkey_4.txt
AU        main/src/test/resources/org/apache/james/jdkim/Mail-DKIM/corpus/bad_dk_1.txt
AU        main/src/test/resources/org/apache/james/jdkim/Mail-DKIM/corpus/badkey_6.txt
AU        main/src/test/resources/org/apache/james/jdkim/Mail-DKIM/corpus/mine_ietf05_1.txt
AU        main/src/test/resources/org/apache/james/jdkim/Mail-DKIM/corpus/bad_dk_2.txt
AU        main/src/test/resources/org/apache/james/jdkim/Mail-DKIM/corpus/badkey_7.txt
AU        main/src/test/resources/org/apache/james/jdkim/Mail-DKIM/corpus/good_dk_1.txt
AU        main/src/test/resources/org/apache/james/jdkim/Mail-DKIM/corpus/badkey_8.txt
AU        main/src/test/resources/org/apache/james/jdkim/Mail-DKIM/corpus/good_dk_2.txt
AU        main/src/test/resources/org/apache/james/jdkim/Mail-DKIM/corpus/badkey_9.txt
AU        main/src/test/resources/org/apache/james/jdkim/Mail-DKIM/corpus/good_rfc4871_3.txt
AU        main/src/test/resources/org/apache/james/jdkim/Mail-DKIM/corpus/good_dk_3.txt
AU        main/src/test/resources/org/apache/james/jdkim/Mail-DKIM/corpus/good_rfc4871_4.txt
AU        main/src/test/resources/org/apache/james/jdkim/Mail-DKIM/corpus/good_dk_4.txt
AU        main/src/test/resources/org/apache/james/jdkim/Mail-DKIM/corpus/dk_multiple_1.txt
AU        main/src/test/resources/org/apache/james/jdkim/Mail-DKIM/corpus/good_dk_5.txt
AU        main/src/test/resources/org/apache/james/jdkim/Mail-DKIM/corpus/good_dk_6.txt
AU        main/src/test/resources/org/apache/james/jdkim/Mail-DKIM/corpus/good_dk_7.txt
AU        main/src/test/resources/org/apache/james/jdkim/Mail-DKIM/corpus/bad_1.txt
AU        main/src/test/resources/org/apache/james/jdkim/Mail-DKIM/corpus/good_1878523.txt
AU        main/src/test/resources/org/apache/james/jdkim/Mail-DKIM/corpus/multiple_1.txt
AU        main/src/test/resources/org/apache/james/jdkim/Mail-DKIM/corpus/multiple_2.txt
AU        main/src/test/resources/org/apache/james/jdkim/Mail-DKIM/corpus/good_dk_gmail.txt
AU        main/src/test/resources/org/apache/james/jdkim/Mail-DKIM/corpus/good_ietf00_1.txt
AU        main/src/test/resources/org/apache/james/jdkim/Mail-DKIM/corpus/good_ietf00_2.txt
AU        main/src/test/resources/org/apache/james/jdkim/Mail-DKIM/corpus/good_ietf00_3.txt
AU        main/src/test/resources/org/apache/james/jdkim/Mail-DKIM/corpus/good_ietf00_4.txt
AU        main/src/test/resources/org/apache/james/jdkim/Mail-DKIM/corpus/good_ietf00_5.txt
AU        main/src/test/resources/org/apache/james/jdkim/Mail-DKIM/corpus/good_dk_yahoo.txt
AU        main/src/test/resources/org/apache/james/jdkim/Mail-DKIM/corpus/good_qp_1.txt
AU        main/src/test/resources/org/apache/james/jdkim/Mail-DKIM/corpus/good_qp_2.txt
AU        main/src/test/resources/org/apache/james/jdkim/Mail-DKIM/corpus/dk_headers_1.txt
AU        main/src/test/resources/org/apache/james/jdkim/Mail-DKIM/corpus/good_qp_3.txt
AU        main/src/test/resources/org/apache/james/jdkim/Mail-DKIM/corpus/dk_headers_2.txt
AU        main/src/test/resources/org/apache/james/jdkim/Mail-DKIM/corpus/bad_1878954.txt
AU        main/src/test/resources/org/apache/james/jdkim/Mail-DKIM/LICENSE.txt
A         main/src/test/resources/org/apache/james/jdkim/corpus
A         main/src/test/resources/org/apache/james/jdkim/corpus/FAIL_illegalargumentexception.eml
A         main/src/test/resources/org/apache/james/jdkim/corpus/gamma_gmail.com.eml
A         main/src/test/resources/org/apache/james/jdkim/corpus/gamma_gmail.com_duplicateheaders.eml
A         main/src/test/resources/org/apache/james/jdkim/corpus/pmta_myspace.com.eml
A         main/src/test/resources/org/apache/james/jdkim/corpus/FAIL_BADBH_s1024_yahoo.com.eml
A         main/src/test/resources/org/apache/james/jdkim/corpus/s1024_yahoo.com.eml
A         main/src/test/java
A         main/src/test/java/org
A         main/src/test/java/org/apache
A         main/src/test/java/org/apache/james
A         main/src/test/java/org/apache/james/jdkim
A         main/src/test/java/org/apache/james/jdkim/impl
AU        main/src/test/java/org/apache/james/jdkim/SignatureRecordImplTest.java
AU        main/src/test/java/org/apache/james/jdkim/DNSPublicKeyRetrieverTest.java
AU        main/src/test/java/org/apache/james/jdkim/PublicKeyRecordTest.java
AU        main/src/test/java/org/apache/james/jdkim/PerlDKIMTest.java
AU        main/src/test/java/org/apache/james/jdkim/MockPublicKeyRecordRetriever.java
A         main/src/test/java/org/apache/james/jdkim/tagvalue
AU        main/src/test/java/org/apache/james/jdkim/tagvalue/TagValueTest.java
AU        main/src/test/java/org/apache/james/jdkim/FileBasedTest.java
A         main/src/test/java/org/apache/james/jdkim/canon
AU        main/src/test/java/org/apache/james/jdkim/canon/AbstractOutputStreamTestCase.java
AU        main/src/test/java/org/apache/james/jdkim/canon/DigestOutputStreamTest.java
AU        main/src/test/java/org/apache/james/jdkim/canon/CompoundOutputStreamTest.java
AU        main/src/test/java/org/apache/james/jdkim/canon/LimitedOutputStreamTest.java
AU        main/src/test/java/org/apache/james/jdkim/canon/RelaxedBodyCanonicalizerTest.java
AU        main/src/test/java/org/apache/james/jdkim/canon/SimpleBodyCanonicalizerTest.java
AU        main/src/test/java/org/apache/james/jdkim/DKIMVerifierTest.java
AU        main/src/test/java/org/apache/james/jdkim/MultiplexingPublicKeyRecordRetrieverTest.java
AU        main/src/test/java/org/apache/james/jdkim/SignatureRecordTest.java
AU        main/pom.xml
A         .gitignore
AU        RELEASE_NOTES.txt
A         src
A         src/reporting-site
AU        src/reporting-site/site.xml
A         src/site
A         src/site/resources
A         src/site/resources/images
AU        src/site/resources/images/asf-logo-reduced.gif
AU        src/site/resources/images/james-jdkim-logo.gif
A         src/site/xdoc
AU        src/site/xdoc/index.xml
A         src/site/site.xml
A         pom.xml
A         README.txt
A         assemble
A         assemble/src
A         assemble/src/assemble
AU        assemble/src/assemble/bin.xml
A         assemble/src/licensing
AU        assemble/src/licensing/noticeForApp.txt
AU        assemble/src/licensing/licenseForApp.txt
A         assemble/src/reporting-site
AU        assemble/src/reporting-site/site.xml
AU        assemble/pom.xml
A         mailets
A         mailets/src
A         mailets/src/reporting-site
AU        mailets/src/reporting-site/site.xml
A         mailets/src/test
A         mailets/src/test/resources
A         mailets/src/test/java
A         mailets/src/test/java/org
A         mailets/src/test/java/org/apache
A         mailets/src/test/java/org/apache/james
A         mailets/src/test/java/org/apache/james/jdkim
A         mailets/src/test/java/org/apache/james/jdkim/mailets
AU        mailets/src/test/java/org/apache/james/jdkim/mailets/DKIMSignTest.java
AU        mailets/src/test/java/org/apache/james/jdkim/mailets/DKIMVerifyTest.java
A         mailets/src/main
A         mailets/src/main/java
A         mailets/src/main/java/org
A         mailets/src/main/java/org/apache
A         mailets/src/main/java/org/apache/james
A         mailets/src/main/java/org/apache/james/jdkim
A         mailets/src/main/java/org/apache/james/jdkim/mailets
AU        mailets/src/main/java/org/apache/james/jdkim/mailets/MimeMessageHeaders.java
AU        mailets/src/main/java/org/apache/james/jdkim/mailets/ConvertTo7Bit.java
AU        mailets/src/main/java/org/apache/james/jdkim/mailets/DKIMVerify.java
AU        mailets/src/main/java/org/apache/james/jdkim/mailets/HeaderSkippingOutputStream.java
AU        mailets/src/main/java/org/apache/james/jdkim/mailets/CRLFOutputStream.java
AU        mailets/src/main/java/org/apache/james/jdkim/mailets/DKIMSign.java
A         mailets/src/main/resources
A         mailets/src/site
A         mailets/src/site/site.xml
A         mailets/src/site/resources
A         mailets/src/site/resources/images
AU        mailets/src/site/resources/images/james-jdkim-logo.gif
AU        mailets/src/site/resources/images/asf-logo-reduced.gif
A         mailets/src/site/xdoc
AU        mailets/src/site/xdoc/index.xml
A         mailets/pom.xml
 U        .
At revision 1684856
WARNING: clock of the subversion server appears to be out of sync. This can result in inconsistent
check out behavior.
no change for http://svn.apache.org/repos/asf/james/jdkim/trunk since the previous build
[locks-and-latches] Checking to see if we really have the locks
[locks-and-latches] Have all the locks, build can start
Parsing POMs
Downloaded artifact http://repository.apache.org/snapshots/org/apache/james/james-project/1.8.3-SNAPSHOT/maven-metadata.xml
maven3-agent.jar already up to date
maven3-interceptor.jar already up to date
maven3-interceptor-commons.jar already up to date
[trunk] $ /home/jenkins/tools/java/latest1.6/bin/java -Xmx2g -Xms256m -XX:MaxPermSize=512m
-cp /home/jenkins/jenkins-slave/maven3-agent.jar:/home/jenkins/tools/maven/apache-maven-3.0.4/boot/plexus-classworlds-2.4.jar
org.jvnet.hudson.maven3.agent.Maven3Main /home/jenkins/tools/maven/apache-maven-3.0.4 /home/jenkins/jenkins-slave/slave.jar
/home/jenkins/jenkins-slave/maven3-interceptor.jar /home/jenkins/jenkins-slave/maven3-interceptor-commons.jar
57339
<===[JENKINS REMOTING CAPACITY]===>   channel started
Executing Maven:  -B -f <https://builds.apache.org/job/jdkim-trunk/ws/trunk/pom.xml>
-Dmaven.repo.local=/home/jenkins/jenkins-slave/maven-repositories/0 -U clean deploy
[INFO] Scanning for projects...
[INFO] ------------------------------------------------------------------------
[INFO] Reactor Build Order:
[INFO] 
[INFO] Apache James :: jDKIM :: DomainKey Project
[INFO] Apache James :: jDKIM
[INFO] Apache James :: jDKIM :: Mailets
[INFO] Apache James :: jDKIM :: Assembly
[INFO]                                                                         
[INFO] ------------------------------------------------------------------------
[INFO] Building Apache James :: jDKIM :: DomainKey Project 0.3-SNAPSHOT
[INFO] ------------------------------------------------------------------------
[INFO] 
[INFO] --- maven-clean-plugin:2.5:clean (default-clean) @ apache-jdkim-project ---
[TASKS] Scanning folder '<https://builds.apache.org/job/jdkim-trunk/ws/trunk'> for files
matching the pattern '**/*.java' - excludes: main/**/*, mailets/**/*, assemble/**/*
[TASKS] Found 0 files to scan for tasks
Found 0 open tasks.
[TASKS] Computing warning deltas based on reference build #2409
log4j:WARN No appenders could be found for logger (org.apache.commons.beanutils.converters.BooleanConverter).
log4j:WARN Please initialize the log4j system properly.
[INFO] 
[INFO] --- maven-remote-resources-plugin:1.4:process (default) @ apache-jdkim-project ---
[INFO] 
[INFO] --- maven-jar-plugin:2.4:jar (jar) @ apache-jdkim-project ---
[WARNING] JAR will be empty - no content was marked for inclusion!
[INFO] Building jar: <https://builds.apache.org/job/jdkim-trunk/ws/trunk/target/apache-jdkim-project-0.3-SNAPSHOT.jar>
[INFO] 
[INFO] --- maven-jar-plugin:2.4:test-jar (test-jar) @ apache-jdkim-project ---
[WARNING] JAR will be empty - no content was marked for inclusion!
[INFO] Building jar: <https://builds.apache.org/job/jdkim-trunk/ws/trunk/target/apache-jdkim-project-0.3-SNAPSHOT-tests.jar>
[WARNING] Failed to getClass for org.apache.maven.plugin.source.SourceJarMojo
[INFO] 
[INFO] --- maven-source-plugin:2.2.1:jar (attach-sources) @ apache-jdkim-project ---
[WARNING] Failed to getClass for org.apache.maven.plugin.source.TestSourceJarMojo
[INFO] 
[INFO] --- maven-source-plugin:2.2.1:test-jar (attach-sources) @ apache-jdkim-project ---
[INFO] 
[INFO] --- maven-site-plugin:3.2:attach-descriptor (attach-descriptor) @ apache-jdkim-project
---
[INFO] 
[INFO] --- maven-install-plugin:2.5.1:install (default-install) @ apache-jdkim-project ---
[INFO] Installing <https://builds.apache.org/job/jdkim-trunk/ws/trunk/pom.xml> to /home/jenkins/jenkins-slave/maven-repositories/0/org/apache/james/jdkim/apache-jdkim-project/0.3-SNAPSHOT/apache-jdkim-project-0.3-SNAPSHOT.pom
[INFO] Installing <https://builds.apache.org/job/jdkim-trunk/ws/trunk/target/apache-jdkim-project-0.3-SNAPSHOT-tests.jar>
to /home/jenkins/jenkins-slave/maven-repositories/0/org/apache/james/jdkim/apache-jdkim-project/0.3-SNAPSHOT/apache-jdkim-project-0.3-SNAPSHOT-tests.jar
[INFO] Installing <https://builds.apache.org/job/jdkim-trunk/ws/trunk/target/apache-jdkim-project-0.3-SNAPSHOT-site.xml>
to /home/jenkins/jenkins-slave/maven-repositories/0/org/apache/james/jdkim/apache-jdkim-project/0.3-SNAPSHOT/apache-jdkim-project-0.3-SNAPSHOT-site.xml
[INFO] 
[INFO] --- maven-deploy-plugin:2.7:deploy (default-deploy) @ apache-jdkim-project ---
Downloading: https://repository.apache.org/content/repositories/snapshots/org/apache/james/jdkim/apache-jdkim-project/0.3-SNAPSHOT/maven-metadata.xml
[WARNING] Could not transfer metadata org.apache.james.jdkim:apache-jdkim-project:0.3-SNAPSHOT/maven-metadata.xml
from/to apache.snapshots.https (https://repository.apache.org/content/repositories/snapshots):
java.lang.RuntimeException: Could not generate DH keypair
[INFO] ------------------------------------------------------------------------
[INFO] Reactor Summary:
[INFO] 
[INFO] Apache James :: jDKIM :: DomainKey Project ........ FAILURE [11.321s]
[INFO] Apache James :: jDKIM ............................. SKIPPED
[INFO] Apache James :: jDKIM :: Mailets .................. SKIPPED
[INFO] Apache James :: jDKIM :: Assembly ................. SKIPPED
[INFO] ------------------------------------------------------------------------
[INFO] BUILD FAILURE
[INFO] ------------------------------------------------------------------------
[INFO] Total time: 13.595s
[INFO] Finished at: Thu Jun 11 11:19:44 UTC 2015
[INFO] Final Memory: 15M/247M
[INFO] ------------------------------------------------------------------------
Waiting for Jenkins to finish collecting data[ERROR] Failed to execute goal org.apache.maven.plugins:maven-deploy-plugin:2.7:deploy
(default-deploy) on project apache-jdkim-project: Failed to retrieve remote metadata org.apache.james.jdkim:apache-jdkim-project:0.3-SNAPSHOT/maven-metadata.xml:
Could not transfer metadata org.apache.james.jdkim:apache-jdkim-project:0.3-SNAPSHOT/maven-metadata.xml
from/to apache.snapshots.https (https://repository.apache.org/content/repositories/snapshots):
java.lang.RuntimeException: Could not generate DH keypair: Prime size must be multiple of
64, and can only range from 512 to 1024 (inclusive) -> [Help 1]
[ERROR] 
[ERROR] To see the full stack trace of the errors, re-run Maven with the -e switch.
[ERROR] Re-run Maven using the -X switch to enable full debug logging.
[ERROR] 
[ERROR] For more information about the errors and possible solutions, please read the following
articles:
[ERROR] [Help 1] http://cwiki.apache.org/confluence/display/MAVEN/MojoExecutionException

[JENKINS] Archiving <https://builds.apache.org/job/jdkim-trunk/ws/trunk/mailets/pom.xml>
to org.apache.james.jdkim/apache-jdkim-mailets/0.3-SNAPSHOT/apache-jdkim-mailets-0.3-SNAPSHOT.pom
Sending artifact delta relative to jdkim-trunk » Apache James :: jDKIM :: Mailets #2409
Archived 1 artifacts
Archive block size is 32768
Received 0 blocks and 4545 bytes
Compression is 0.0%
Took 0.28 sec
[JENKINS] Archiving <https://builds.apache.org/job/jdkim-trunk/ws/trunk/target/apache-jdkim-project-0.3-SNAPSHOT.jar>
to org.apache.james.jdkim/apache-jdkim-project/0.3-SNAPSHOT/apache-jdkim-project-0.3-SNAPSHOT.pom
[JENKINS] Archiving <https://builds.apache.org/job/jdkim-trunk/ws/trunk/target/apache-jdkim-project-0.3-SNAPSHOT-tests.jar>
to org.apache.james.jdkim/apache-jdkim-project/0.3-SNAPSHOT/apache-jdkim-project-0.3-SNAPSHOT-tests.jar
[JENKINS] Archiving <https://builds.apache.org/job/jdkim-trunk/ws/trunk/target/apache-jdkim-project-0.3-SNAPSHOT-site.xml>
to org.apache.james.jdkim/apache-jdkim-project/0.3-SNAPSHOT/apache-jdkim-project-0.3-SNAPSHOT-site.xml
Sending artifact delta relative to jdkim-trunk » Apache James :: jDKIM :: DomainKey Project
#2409
Archived 3 artifacts
Archive block size is 32768
Received 0 blocks and 9008 bytes
Compression is 0.0%
Took 0.28 sec
[JENKINS] Archiving <https://builds.apache.org/job/jdkim-trunk/ws/trunk/assemble/pom.xml>
to org.apache.james.jdkim/apache-jdkim/0.3-SNAPSHOT/apache-jdkim-0.3-SNAPSHOT.pom
Sending artifact delta relative to jdkim-trunk » Apache James :: jDKIM :: Assembly #2409
Archived 1 artifacts
Archive block size is 32768
Received 0 blocks and 4401 bytes
Compression is 0.0%
Took 1.4 sec
[JENKINS] Archiving <https://builds.apache.org/job/jdkim-trunk/ws/trunk/main/pom.xml>
to org.apache.james.jdkim/apache-jdkim-library/0.3-SNAPSHOT/apache-jdkim-library-0.3-SNAPSHOT.pom
Sending artifact delta relative to jdkim-trunk » Apache James :: jDKIM #2409
Archived 1 artifacts
Archive block size is 32768
Received 0 blocks and 8796 bytes
Compression is 0.0%
Took 0.21 sec
Sending e-mails to: server-dev@james.apache.org
channel stopped
[locks-and-latches] Releasing all the locks
[locks-and-latches] All the locks released

---------------------------------------------------------------------
To unsubscribe, e-mail: server-dev-unsubscribe@james.apache.org
For additional commands, e-mail: server-dev-help@james.apache.org


Mime
View raw message