james-server-dev mailing list archives

Site index · List index
Message view « Date » · « Thread »
Top « Date » · « Thread »
From Apache Jenkins Server <jenk...@builds.apache.org>
Subject Build failed in Jenkins: james-server-trunk » Apache James :: Server :: Mailbox Adapter #5349
Date Wed, 19 Aug 2015 12:19:22 GMT
See <https://builds.apache.org/job/james-server-trunk/org.apache.james$james-server-mailbox-adapter/5349/>

------------------------------------------
[INFO]                                                                         
[INFO] ------------------------------------------------------------------------
[INFO] Building Apache James :: Server :: Mailbox Adapter 3.0.0-beta5-SNAPSHOT
[INFO] ------------------------------------------------------------------------
Downloading: http://repository.apache.org/snapshots/org/apache/james/apache-james-mailbox-api/0.6-SNAPSHOT/maven-metadata.xml
Downloaded: http://repository.apache.org/snapshots/org/apache/james/apache-james-mailbox-api/0.6-SNAPSHOT/maven-metadata.xml
(2 KB at 0.7 KB/sec)
Downloading: http://repository.apache.org/snapshots/org/apache/james/apache-james-mailbox/0.6-SNAPSHOT/maven-metadata.xml
Downloaded: http://repository.apache.org/snapshots/org/apache/james/apache-james-mailbox/0.6-SNAPSHOT/maven-metadata.xml
(2 KB at 0.7 KB/sec)
Downloading: http://repository.apache.org/snapshots/org/apache/james/apache-james-mailbox-store/0.6-SNAPSHOT/maven-metadata.xml
Downloaded: http://repository.apache.org/snapshots/org/apache/james/apache-james-mailbox-store/0.6-SNAPSHOT/maven-metadata.xml
(2 KB at 1.1 KB/sec)
Downloading: http://repository.apache.org/snapshots/org/apache/james/apache-mime4j-core/0.8.0-SNAPSHOT/maven-metadata.xml
Downloaded: http://repository.apache.org/snapshots/org/apache/james/apache-mime4j-core/0.8.0-SNAPSHOT/maven-metadata.xml
(2 KB at 2.4 KB/sec)
Downloading: http://repository.apache.org/snapshots/org/apache/james/apache-mime4j-project/0.8.0-SNAPSHOT/maven-metadata.xml
Downloaded: http://repository.apache.org/snapshots/org/apache/james/apache-mime4j-project/0.8.0-SNAPSHOT/maven-metadata.xml
(2 KB at 1.3 KB/sec)
Downloading: http://repository.apache.org/snapshots/org/apache/james/apache-mime4j-dom/0.8.0-SNAPSHOT/maven-metadata.xml
Downloaded: http://repository.apache.org/snapshots/org/apache/james/apache-mime4j-dom/0.8.0-SNAPSHOT/maven-metadata.xml
(2 KB at 3.2 KB/sec)
Downloading: http://repository.apache.org/snapshots/org/apache/james/apache-james-mailbox-maildir/0.6-SNAPSHOT/maven-metadata.xml
Downloaded: http://repository.apache.org/snapshots/org/apache/james/apache-james-mailbox-maildir/0.6-SNAPSHOT/maven-metadata.xml
(2 KB at 1.1 KB/sec)
Downloading: http://repository.apache.org/snapshots/org/apache/james/apache-james-mailbox-memory/0.6-SNAPSHOT/maven-metadata.xml
Downloaded: http://repository.apache.org/snapshots/org/apache/james/apache-james-mailbox-memory/0.6-SNAPSHOT/maven-metadata.xml
(2 KB at 1.4 KB/sec)
[INFO] 
[INFO] --- maven-clean-plugin:2.5:clean (default-clean) @ james-server-mailbox-adapter ---
[INFO] Deleting <https://builds.apache.org/job/james-server-trunk/org.apache.james$james-server-mailbox-adapter/ws/target>
[INFO] 
[INFO] --- maven-remote-resources-plugin:1.4:process (default) @ james-server-mailbox-adapter
---
[INFO] 
[INFO] --- maven-resources-plugin:2.6:resources (default-resources) @ james-server-mailbox-adapter
---
[INFO] Using 'UTF-8' encoding to copy filtered resources.
[INFO] Copying 1 resource
[INFO] Copying 3 resources
[INFO] 
[INFO] --- maven-compiler-plugin:3.0:compile (default-compile) @ james-server-mailbox-adapter
---
[INFO] Changes detected - recompiling the module!
[INFO] Compiling 4 source files to <https://builds.apache.org/job/james-server-trunk/org.apache.james$james-server-mailbox-adapter/ws/target/classes>
[INFO] 
[INFO] --- maven-resources-plugin:2.6:testResources (default-testResources) @ james-server-mailbox-adapter
---
[INFO] Using 'UTF-8' encoding to copy filtered resources.
[INFO] skip non existing resourceDirectory <https://builds.apache.org/job/james-server-trunk/org.apache.james$james-server-mailbox-adapter/ws/src/test/resources>
[INFO] Copying 3 resources
[INFO] 
[INFO] --- maven-compiler-plugin:3.0:testCompile (default-testCompile) @ james-server-mailbox-adapter
---
[INFO] Changes detected - recompiling the module!
[INFO] Compiling 1 source file to <https://builds.apache.org/job/james-server-trunk/org.apache.james$james-server-mailbox-adapter/ws/target/test-classes>
[INFO] -------------------------------------------------------------
[ERROR] COMPILATION ERROR : 
[INFO] -------------------------------------------------------------
[ERROR] <https://builds.apache.org/job/james-server-trunk/org.apache.james$james-server-mailbox-adapter/ws/src/test/java/org/apache/james/adapter/mailbox/MailboxManagementTest.java>:[27,41]
cannot find symbol
  symbol:   class InMemoryId
  location: package org.apache.james.mailbox.inmemory
[ERROR] <https://builds.apache.org/job/james-server-trunk/org.apache.james$james-server-mailbox-adapter/ws/src/test/java/org/apache/james/adapter/mailbox/MailboxManagementTest.java>:[54,29]
cannot find symbol
  symbol:   class InMemoryId
  location: class org.apache.james.adapter.mailbox.MailboxManagementTest
[ERROR] <https://builds.apache.org/job/james-server-trunk/org.apache.james$james-server-mailbox-adapter/ws/src/test/java/org/apache/james/adapter/mailbox/MailboxManagementTest.java>:[54,82]
cannot find symbol
  symbol:   class InMemoryId
  location: class org.apache.james.adapter.mailbox.MailboxManagementTest
[ERROR] <https://builds.apache.org/job/james-server-trunk/org.apache.james$james-server-mailbox-adapter/ws/src/test/java/org/apache/james/adapter/mailbox/MailboxManagementTest.java>:[69,83]
cannot find symbol
  symbol:   class InMemoryId
  location: class org.apache.james.adapter.mailbox.MailboxManagementTest
[ERROR] <https://builds.apache.org/job/james-server-trunk/org.apache.james$james-server-mailbox-adapter/ws/src/test/java/org/apache/james/adapter/mailbox/MailboxManagementTest.java>:[71,9]
cannot access java.util.Optional
  class file for java.util.Optional not found
[ERROR] <https://builds.apache.org/job/james-server-trunk/org.apache.james$james-server-mailbox-adapter/ws/src/test/java/org/apache/james/adapter/mailbox/MailboxManagementTest.java>:[76,83]
cannot find symbol
  symbol:   class InMemoryId
  location: class org.apache.james.adapter.mailbox.MailboxManagementTest
[ERROR] <https://builds.apache.org/job/james-server-trunk/org.apache.james$james-server-mailbox-adapter/ws/src/test/java/org/apache/james/adapter/mailbox/MailboxManagementTest.java>:[78,9]
cannot access java.time.ZonedDateTime
  class file for java.time.ZonedDateTime not found
[ERROR] <https://builds.apache.org/job/james-server-trunk/org.apache.james$james-server-mailbox-adapter/ws/src/test/java/org/apache/james/adapter/mailbox/MailboxManagementTest.java>:[83,83]
cannot find symbol
  symbol:   class InMemoryId
  location: class org.apache.james.adapter.mailbox.MailboxManagementTest
[ERROR] <https://builds.apache.org/job/james-server-trunk/org.apache.james$james-server-mailbox-adapter/ws/src/test/java/org/apache/james/adapter/mailbox/MailboxManagementTest.java>:[85,9]
cannot access java.time.LocalDateTime
  class file for java.time.LocalDateTime not found
[ERROR] <https://builds.apache.org/job/james-server-trunk/org.apache.james$james-server-mailbox-adapter/ws/src/test/java/org/apache/james/adapter/mailbox/MailboxManagementTest.java>:[90,17]
cannot find symbol
  symbol:   class InMemoryId
  location: class org.apache.james.adapter.mailbox.MailboxManagementTest
[ERROR] <https://builds.apache.org/job/james-server-trunk/org.apache.james$james-server-mailbox-adapter/ws/src/test/java/org/apache/james/adapter/mailbox/MailboxManagementTest.java>:[90,57]
cannot find symbol
  symbol:   class InMemoryId
  location: class org.apache.james.adapter.mailbox.MailboxManagementTest
[ERROR] <https://builds.apache.org/job/james-server-trunk/org.apache.james$james-server-mailbox-adapter/ws/src/test/java/org/apache/james/adapter/mailbox/MailboxManagementTest.java>:[93,9]
cannot access java.time.LocalTime
  class file for java.time.LocalTime not found
[ERROR] <https://builds.apache.org/job/james-server-trunk/org.apache.james$james-server-mailbox-adapter/ws/src/test/java/org/apache/james/adapter/mailbox/MailboxManagementTest.java>:[98,17]
cannot find symbol
  symbol:   class InMemoryId
  location: class org.apache.james.adapter.mailbox.MailboxManagementTest
[ERROR] <https://builds.apache.org/job/james-server-trunk/org.apache.james$james-server-mailbox-adapter/ws/src/test/java/org/apache/james/adapter/mailbox/MailboxManagementTest.java>:[98,57]
cannot find symbol
  symbol:   class InMemoryId
  location: class org.apache.james.adapter.mailbox.MailboxManagementTest
[ERROR] <https://builds.apache.org/job/james-server-trunk/org.apache.james$james-server-mailbox-adapter/ws/src/test/java/org/apache/james/adapter/mailbox/MailboxManagementTest.java>:[101,9]
cannot access java.time.LocalDate
  class file for java.time.LocalDate not found
[ERROR] <https://builds.apache.org/job/james-server-trunk/org.apache.james$james-server-mailbox-adapter/ws/src/test/java/org/apache/james/adapter/mailbox/MailboxManagementTest.java>:[106,83]
cannot find symbol
  symbol:   class InMemoryId
  location: class org.apache.james.adapter.mailbox.MailboxManagementTest
[ERROR] <https://builds.apache.org/job/james-server-trunk/org.apache.james$james-server-mailbox-adapter/ws/src/test/java/org/apache/james/adapter/mailbox/MailboxManagementTest.java>:[123,83]
cannot find symbol
  symbol:   class InMemoryId
  location: class org.apache.james.adapter.mailbox.MailboxManagementTest
[ERROR] <https://builds.apache.org/job/james-server-trunk/org.apache.james$james-server-mailbox-adapter/ws/src/test/java/org/apache/james/adapter/mailbox/MailboxManagementTest.java>:[124,83]
cannot find symbol
  symbol:   class InMemoryId
  location: class org.apache.james.adapter.mailbox.MailboxManagementTest
[ERROR] <https://builds.apache.org/job/james-server-trunk/org.apache.james$james-server-mailbox-adapter/ws/src/test/java/org/apache/james/adapter/mailbox/MailboxManagementTest.java>:[125,83]
cannot find symbol
  symbol:   class InMemoryId
  location: class org.apache.james.adapter.mailbox.MailboxManagementTest
[ERROR] <https://builds.apache.org/job/james-server-trunk/org.apache.james$james-server-mailbox-adapter/ws/src/test/java/org/apache/james/adapter/mailbox/MailboxManagementTest.java>:[140,17]
cannot find symbol
  symbol:   class InMemoryId
  location: class org.apache.james.adapter.mailbox.MailboxManagementTest
[ERROR] <https://builds.apache.org/job/james-server-trunk/org.apache.james$james-server-mailbox-adapter/ws/src/test/java/org/apache/james/adapter/mailbox/MailboxManagementTest.java>:[140,57]
cannot find symbol
  symbol:   class InMemoryId
  location: class org.apache.james.adapter.mailbox.MailboxManagementTest
[ERROR] <https://builds.apache.org/job/james-server-trunk/org.apache.james$james-server-mailbox-adapter/ws/src/test/java/org/apache/james/adapter/mailbox/MailboxManagementTest.java>:[178,17]
cannot find symbol
  symbol:   class InMemoryId
  location: class org.apache.james.adapter.mailbox.MailboxManagementTest
[ERROR] <https://builds.apache.org/job/james-server-trunk/org.apache.james$james-server-mailbox-adapter/ws/src/test/java/org/apache/james/adapter/mailbox/MailboxManagementTest.java>:[178,58]
cannot find symbol
  symbol:   class InMemoryId
  location: class org.apache.james.adapter.mailbox.MailboxManagementTest
[ERROR] <https://builds.apache.org/job/james-server-trunk/org.apache.james$james-server-mailbox-adapter/ws/src/test/java/org/apache/james/adapter/mailbox/MailboxManagementTest.java>:[179,17]
cannot find symbol
  symbol:   class InMemoryId
  location: class org.apache.james.adapter.mailbox.MailboxManagementTest
[ERROR] <https://builds.apache.org/job/james-server-trunk/org.apache.james$james-server-mailbox-adapter/ws/src/test/java/org/apache/james/adapter/mailbox/MailboxManagementTest.java>:[179,58]
cannot find symbol
  symbol:   class InMemoryId
  location: class org.apache.james.adapter.mailbox.MailboxManagementTest
[ERROR] <https://builds.apache.org/job/james-server-trunk/org.apache.james$james-server-mailbox-adapter/ws/src/test/java/org/apache/james/adapter/mailbox/MailboxManagementTest.java>:[180,17]
cannot find symbol
  symbol:   class InMemoryId
  location: class org.apache.james.adapter.mailbox.MailboxManagementTest
[ERROR] <https://builds.apache.org/job/james-server-trunk/org.apache.james$james-server-mailbox-adapter/ws/src/test/java/org/apache/james/adapter/mailbox/MailboxManagementTest.java>:[180,58]
cannot find symbol
  symbol:   class InMemoryId
  location: class org.apache.james.adapter.mailbox.MailboxManagementTest
[ERROR] <https://builds.apache.org/job/james-server-trunk/org.apache.james$james-server-mailbox-adapter/ws/src/test/java/org/apache/james/adapter/mailbox/MailboxManagementTest.java>:[181,17]
cannot find symbol
  symbol:   class InMemoryId
  location: class org.apache.james.adapter.mailbox.MailboxManagementTest
[ERROR] <https://builds.apache.org/job/james-server-trunk/org.apache.james$james-server-mailbox-adapter/ws/src/test/java/org/apache/james/adapter/mailbox/MailboxManagementTest.java>:[181,58]
cannot find symbol
  symbol:   class InMemoryId
  location: class org.apache.james.adapter.mailbox.MailboxManagementTest
[ERROR] <https://builds.apache.org/job/james-server-trunk/org.apache.james$james-server-mailbox-adapter/ws/src/test/java/org/apache/james/adapter/mailbox/MailboxManagementTest.java>:[182,17]
cannot find symbol
  symbol:   class InMemoryId
  location: class org.apache.james.adapter.mailbox.MailboxManagementTest
[ERROR] <https://builds.apache.org/job/james-server-trunk/org.apache.james$james-server-mailbox-adapter/ws/src/test/java/org/apache/james/adapter/mailbox/MailboxManagementTest.java>:[182,58]
cannot find symbol
  symbol:   class InMemoryId
  location: class org.apache.james.adapter.mailbox.MailboxManagementTest
[ERROR] <https://builds.apache.org/job/james-server-trunk/org.apache.james$james-server-mailbox-adapter/ws/src/test/java/org/apache/james/adapter/mailbox/MailboxManagementTest.java>:[183,17]
cannot find symbol
  symbol:   class InMemoryId
  location: class org.apache.james.adapter.mailbox.MailboxManagementTest
[ERROR] <https://builds.apache.org/job/james-server-trunk/org.apache.james$james-server-mailbox-adapter/ws/src/test/java/org/apache/james/adapter/mailbox/MailboxManagementTest.java>:[183,58]
cannot find symbol
  symbol:   class InMemoryId
  location: class org.apache.james.adapter.mailbox.MailboxManagementTest
[ERROR] <https://builds.apache.org/job/james-server-trunk/org.apache.james$james-server-mailbox-adapter/ws/src/test/java/org/apache/james/adapter/mailbox/MailboxManagementTest.java>:[205,83]
cannot find symbol
  symbol:   class InMemoryId
  location: class org.apache.james.adapter.mailbox.MailboxManagementTest
[ERROR] <https://builds.apache.org/job/james-server-trunk/org.apache.james$james-server-mailbox-adapter/ws/src/test/java/org/apache/james/adapter/mailbox/MailboxManagementTest.java>:[212,17]
cannot find symbol
  symbol:   class InMemoryId
  location: class org.apache.james.adapter.mailbox.MailboxManagementTest
[ERROR] <https://builds.apache.org/job/james-server-trunk/org.apache.james$james-server-mailbox-adapter/ws/src/test/java/org/apache/james/adapter/mailbox/MailboxManagementTest.java>:[212,57]
cannot find symbol
  symbol:   class InMemoryId
  location: class org.apache.james.adapter.mailbox.MailboxManagementTest
[ERROR] <https://builds.apache.org/job/james-server-trunk/org.apache.james$james-server-mailbox-adapter/ws/src/test/java/org/apache/james/adapter/mailbox/MailboxManagementTest.java>:[220,17]
cannot find symbol
  symbol:   class InMemoryId
  location: class org.apache.james.adapter.mailbox.MailboxManagementTest
[ERROR] <https://builds.apache.org/job/james-server-trunk/org.apache.james$james-server-mailbox-adapter/ws/src/test/java/org/apache/james/adapter/mailbox/MailboxManagementTest.java>:[220,57]
cannot find symbol
  symbol:   class InMemoryId
  location: class org.apache.james.adapter.mailbox.MailboxManagementTest
[ERROR] <https://builds.apache.org/job/james-server-trunk/org.apache.james$james-server-mailbox-adapter/ws/src/test/java/org/apache/james/adapter/mailbox/MailboxManagementTest.java>:[228,17]
cannot find symbol
  symbol:   class InMemoryId
  location: class org.apache.james.adapter.mailbox.MailboxManagementTest
[ERROR] <https://builds.apache.org/job/james-server-trunk/org.apache.james$james-server-mailbox-adapter/ws/src/test/java/org/apache/james/adapter/mailbox/MailboxManagementTest.java>:[228,57]
cannot find symbol
  symbol:   class InMemoryId
  location: class org.apache.james.adapter.mailbox.MailboxManagementTest
[INFO] 40 errors 
[INFO] -------------------------------------------------------------

---------------------------------------------------------------------
To unsubscribe, e-mail: server-dev-unsubscribe@james.apache.org
For additional commands, e-mail: server-dev-help@james.apache.org


Mime
View raw message