james-server-dev mailing list archives

Site index · List index
Message view « Date » · « Thread »
Top « Date » · « Thread »
From Apache Jenkins Server <jenk...@builds.apache.org>
Subject Build failed in Jenkins: james-server-trunk » Apache James :: Server :: Mailbox Adapter #5350
Date Thu, 20 Aug 2015 11:40:43 GMT
See <https://builds.apache.org/job/james-server-trunk/org.apache.james$james-server-mailbox-adapter/5350/>

------------------------------------------
[INFO]                                                                         
[INFO] ------------------------------------------------------------------------
[INFO] Building Apache James :: Server :: Mailbox Adapter 3.0.0-beta5-SNAPSHOT
[INFO] ------------------------------------------------------------------------
Downloading: http://repository.apache.org/snapshots/org/apache/james/apache-james-mailbox-api/0.6-SNAPSHOT/maven-metadata.xml
Downloaded: http://repository.apache.org/snapshots/org/apache/james/apache-james-mailbox-api/0.6-SNAPSHOT/maven-metadata.xml
(2 KB at 3.7 KB/sec)
Downloading: http://repository.apache.org/snapshots/org/apache/james/apache-james-mailbox-api/0.6-SNAPSHOT/apache-james-mailbox-api-0.6-20150508.040939-710.pom
Downloaded: http://repository.apache.org/snapshots/org/apache/james/apache-james-mailbox-api/0.6-SNAPSHOT/apache-james-mailbox-api-0.6-20150508.040939-710.pom
(3 KB at 5.8 KB/sec)
Downloading: http://repository.apache.org/snapshots/org/apache/james/apache-james-mailbox/0.6-SNAPSHOT/maven-metadata.xml
Downloaded: http://repository.apache.org/snapshots/org/apache/james/apache-james-mailbox/0.6-SNAPSHOT/maven-metadata.xml
(2 KB at 0.8 KB/sec)
Downloading: http://repository.apache.org/snapshots/org/apache/james/apache-james-mailbox/0.6-SNAPSHOT/apache-james-mailbox-0.6-20150617.103315-750.pom
Downloaded: http://repository.apache.org/snapshots/org/apache/james/apache-james-mailbox/0.6-SNAPSHOT/apache-james-mailbox-0.6-20150617.103315-750.pom
(24 KB at 37.6 KB/sec)
Downloading: http://repository.apache.org/snapshots/org/apache/james/apache-james-mailbox-store/0.6-SNAPSHOT/maven-metadata.xml
Downloaded: http://repository.apache.org/snapshots/org/apache/james/apache-james-mailbox-store/0.6-SNAPSHOT/maven-metadata.xml
(2 KB at 1.2 KB/sec)
Downloading: http://repository.apache.org/snapshots/org/apache/james/apache-james-mailbox-store/0.6-SNAPSHOT/apache-james-mailbox-store-0.6-20150508.041003-704.pom
Downloaded: http://repository.apache.org/snapshots/org/apache/james/apache-james-mailbox-store/0.6-SNAPSHOT/apache-james-mailbox-store-0.6-20150508.041003-704.pom
(4 KB at 5.3 KB/sec)
Downloading: http://repository.apache.org/snapshots/org/apache/james/apache-mime4j-core/0.8.0-SNAPSHOT/maven-metadata.xml
Downloaded: http://repository.apache.org/snapshots/org/apache/james/apache-mime4j-core/0.8.0-SNAPSHOT/maven-metadata.xml
(2 KB at 4.0 KB/sec)
Downloading: http://repository.apache.org/snapshots/org/apache/james/apache-mime4j-core/0.8.0-SNAPSHOT/apache-mime4j-core-0.8.0-20150617.024907-738.pom
Downloaded: http://repository.apache.org/snapshots/org/apache/james/apache-mime4j-core/0.8.0-SNAPSHOT/apache-mime4j-core-0.8.0-20150617.024907-738.pom
(3 KB at 5.5 KB/sec)
Downloading: http://repository.apache.org/snapshots/org/apache/james/apache-mime4j-project/0.8.0-SNAPSHOT/maven-metadata.xml
Downloaded: http://repository.apache.org/snapshots/org/apache/james/apache-mime4j-project/0.8.0-SNAPSHOT/maven-metadata.xml
(2 KB at 3.3 KB/sec)
Downloading: http://repository.apache.org/snapshots/org/apache/james/apache-mime4j-project/0.8.0-SNAPSHOT/apache-mime4j-project-0.8.0-20150617.024837-740.pom
Downloaded: http://repository.apache.org/snapshots/org/apache/james/apache-mime4j-project/0.8.0-SNAPSHOT/apache-mime4j-project-0.8.0-20150617.024837-740.pom
(8 KB at 17.0 KB/sec)
Downloading: http://repo.maven.apache.org/maven2/org/apache/james/james-project/1.8.2/james-project-1.8.2.pom
Downloaded: http://repo.maven.apache.org/maven2/org/apache/james/james-project/1.8.2/james-project-1.8.2.pom
(58 KB at 1631.3 KB/sec)
Downloading: http://repository.apache.org/snapshots/org/apache/james/apache-mime4j-dom/0.8.0-SNAPSHOT/maven-metadata.xml
Downloaded: http://repository.apache.org/snapshots/org/apache/james/apache-mime4j-dom/0.8.0-SNAPSHOT/maven-metadata.xml
(2 KB at 0.9 KB/sec)
Downloading: http://repository.apache.org/snapshots/org/apache/james/apache-mime4j-dom/0.8.0-SNAPSHOT/apache-mime4j-dom-0.8.0-20150617.024927-735.pom
Downloaded: http://repository.apache.org/snapshots/org/apache/james/apache-mime4j-dom/0.8.0-SNAPSHOT/apache-mime4j-dom-0.8.0-20150617.024927-735.pom
(4 KB at 7.0 KB/sec)
Downloading: http://repository.apache.org/snapshots/org/apache/james/apache-james-mailbox-maildir/0.6-SNAPSHOT/maven-metadata.xml
Downloaded: http://repository.apache.org/snapshots/org/apache/james/apache-james-mailbox-maildir/0.6-SNAPSHOT/maven-metadata.xml
(2 KB at 1.3 KB/sec)
Downloading: http://repository.apache.org/snapshots/org/apache/james/apache-james-mailbox-maildir/0.6-SNAPSHOT/apache-james-mailbox-maildir-0.6-20150426.040611-654.pom
Downloaded: http://repository.apache.org/snapshots/org/apache/james/apache-james-mailbox-maildir/0.6-SNAPSHOT/apache-james-mailbox-maildir-0.6-20150426.040611-654.pom
(4 KB at 6.3 KB/sec)
Downloading: http://repo.maven.apache.org/maven2/org/assertj/assertj-core/3.0.0/assertj-core-3.0.0.pom
Downloaded: http://repo.maven.apache.org/maven2/org/assertj/assertj-core/3.0.0/assertj-core-3.0.0.pom
(9 KB at 353.8 KB/sec)
Downloading: http://repo.maven.apache.org/maven2/org/assertj/assertj-parent-pom/1.3.5/assertj-parent-pom-1.3.5.pom
Downloaded: http://repo.maven.apache.org/maven2/org/assertj/assertj-parent-pom/1.3.5/assertj-parent-pom-1.3.5.pom
(15 KB at 620.5 KB/sec)
Downloading: http://repository.apache.org/snapshots/org/apache/james/apache-james-mailbox-memory/0.6-SNAPSHOT/maven-metadata.xml
Downloaded: http://repository.apache.org/snapshots/org/apache/james/apache-james-mailbox-memory/0.6-SNAPSHOT/maven-metadata.xml
(2 KB at 0.9 KB/sec)
Downloading: http://repository.apache.org/snapshots/org/apache/james/apache-james-mailbox-memory/0.6-SNAPSHOT/apache-james-mailbox-memory-0.6-20150426.040655-655.pom
Downloaded: http://repository.apache.org/snapshots/org/apache/james/apache-james-mailbox-memory/0.6-SNAPSHOT/apache-james-mailbox-memory-0.6-20150426.040655-655.pom
(3 KB at 3.4 KB/sec)
Downloading: http://repository.apache.org/snapshots/org/apache/james/apache-james-mailbox-api/0.6-SNAPSHOT/apache-james-mailbox-api-0.6-20150508.040939-710.jar
Downloading: http://repository.apache.org/snapshots/org/apache/james/apache-james-mailbox-store/0.6-SNAPSHOT/apache-james-mailbox-store-0.6-20150508.041003-704.jar
Downloading: http://repository.apache.org/snapshots/org/apache/james/apache-mime4j-core/0.8.0-SNAPSHOT/apache-mime4j-core-0.8.0-20150617.024907-738.jar
Downloading: http://repository.apache.org/snapshots/org/apache/james/apache-mime4j-dom/0.8.0-SNAPSHOT/apache-mime4j-dom-0.8.0-20150617.024927-735.jar
Downloading: http://repository.apache.org/snapshots/org/apache/james/apache-james-mailbox-maildir/0.6-SNAPSHOT/apache-james-mailbox-maildir-0.6-20150426.040611-654.jar
Downloaded: http://repository.apache.org/snapshots/org/apache/james/apache-james-mailbox-api/0.6-SNAPSHOT/apache-james-mailbox-api-0.6-20150508.040939-710.jar
(118 KB at 88.0 KB/sec)
Downloading: http://repository.apache.org/snapshots/org/apache/james/apache-james-mailbox-memory/0.6-SNAPSHOT/apache-james-mailbox-memory-0.6-20150426.040655-655.jar
Downloaded: http://repository.apache.org/snapshots/org/apache/james/apache-mime4j-core/0.8.0-SNAPSHOT/apache-mime4j-core-0.8.0-20150617.024907-738.jar
(102 KB at 61.3 KB/sec)
Downloading: http://repository.apache.org/snapshots/org/apache/james/apache-james-mailbox-store/0.6-SNAPSHOT/apache-james-mailbox-store-0.6-20150508.041003-704-tests.jar
Downloaded: http://repository.apache.org/snapshots/org/apache/james/apache-james-mailbox-maildir/0.6-SNAPSHOT/apache-james-mailbox-maildir-0.6-20150426.040611-654.jar
(74 KB at 43.8 KB/sec)
Downloaded: http://repository.apache.org/snapshots/org/apache/james/apache-james-mailbox-store/0.6-SNAPSHOT/apache-james-mailbox-store-0.6-20150508.041003-704.jar
(187 KB at 93.3 KB/sec)
Downloaded: http://repository.apache.org/snapshots/org/apache/james/apache-james-mailbox-memory/0.6-SNAPSHOT/apache-james-mailbox-memory-0.6-20150426.040655-655.jar
(23 KB at 27.7 KB/sec)
Downloaded: http://repository.apache.org/snapshots/org/apache/james/apache-mime4j-dom/0.8.0-SNAPSHOT/apache-mime4j-dom-0.8.0-20150617.024927-735.jar
(320 KB at 147.2 KB/sec)
Downloaded: http://repository.apache.org/snapshots/org/apache/james/apache-james-mailbox-store/0.6-SNAPSHOT/apache-james-mailbox-store-0.6-20150508.041003-704-tests.jar
(48 KB at 68.1 KB/sec)
Downloading: http://repo.maven.apache.org/maven2/org/assertj/assertj-core/3.0.0/assertj-core-3.0.0.jar
Downloaded: http://repo.maven.apache.org/maven2/org/assertj/assertj-core/3.0.0/assertj-core-3.0.0.jar
(680 KB at 11720.2 KB/sec)
[INFO] 
[INFO] --- maven-clean-plugin:2.5:clean (default-clean) @ james-server-mailbox-adapter ---
[INFO] 
[INFO] --- maven-remote-resources-plugin:1.4:process (default) @ james-server-mailbox-adapter
---
[INFO] 
[INFO] --- maven-resources-plugin:2.6:resources (default-resources) @ james-server-mailbox-adapter
---
[INFO] Using 'UTF-8' encoding to copy filtered resources.
[INFO] Copying 1 resource
[INFO] Copying 3 resources
[INFO] 
[INFO] --- maven-compiler-plugin:3.0:compile (default-compile) @ james-server-mailbox-adapter
---
[INFO] Changes detected - recompiling the module!
[INFO] Compiling 4 source files to <https://builds.apache.org/job/james-server-trunk/org.apache.james$james-server-mailbox-adapter/ws/target/classes>
[INFO] 
[INFO] --- maven-resources-plugin:2.6:testResources (default-testResources) @ james-server-mailbox-adapter
---
[INFO] Using 'UTF-8' encoding to copy filtered resources.
[INFO] skip non existing resourceDirectory <https://builds.apache.org/job/james-server-trunk/org.apache.james$james-server-mailbox-adapter/ws/src/test/resources>
[INFO] Copying 3 resources
[INFO] 
[INFO] --- maven-compiler-plugin:3.0:testCompile (default-testCompile) @ james-server-mailbox-adapter
---
[INFO] Changes detected - recompiling the module!
[INFO] Compiling 1 source file to <https://builds.apache.org/job/james-server-trunk/org.apache.james$james-server-mailbox-adapter/ws/target/test-classes>
[INFO] -------------------------------------------------------------
[ERROR] COMPILATION ERROR : 
[INFO] -------------------------------------------------------------
[ERROR] <https://builds.apache.org/job/james-server-trunk/org.apache.james$james-server-mailbox-adapter/ws/src/test/java/org/apache/james/adapter/mailbox/MailboxManagementTest.java>:[27,41]
cannot find symbol
  symbol:   class InMemoryId
  location: package org.apache.james.mailbox.inmemory
[ERROR] <https://builds.apache.org/job/james-server-trunk/org.apache.james$james-server-mailbox-adapter/ws/src/test/java/org/apache/james/adapter/mailbox/MailboxManagementTest.java>:[54,29]
cannot find symbol
  symbol:   class InMemoryId
  location: class org.apache.james.adapter.mailbox.MailboxManagementTest
[ERROR] <https://builds.apache.org/job/james-server-trunk/org.apache.james$james-server-mailbox-adapter/ws/src/test/java/org/apache/james/adapter/mailbox/MailboxManagementTest.java>:[54,82]
cannot find symbol
  symbol:   class InMemoryId
  location: class org.apache.james.adapter.mailbox.MailboxManagementTest
[ERROR] <https://builds.apache.org/job/james-server-trunk/org.apache.james$james-server-mailbox-adapter/ws/src/test/java/org/apache/james/adapter/mailbox/MailboxManagementTest.java>:[69,83]
cannot find symbol
  symbol:   class InMemoryId
  location: class org.apache.james.adapter.mailbox.MailboxManagementTest
[ERROR] <https://builds.apache.org/job/james-server-trunk/org.apache.james$james-server-mailbox-adapter/ws/src/test/java/org/apache/james/adapter/mailbox/MailboxManagementTest.java>:[71,9]
cannot access java.util.Optional
  class file for java.util.Optional not found
[ERROR] <https://builds.apache.org/job/james-server-trunk/org.apache.james$james-server-mailbox-adapter/ws/src/test/java/org/apache/james/adapter/mailbox/MailboxManagementTest.java>:[76,83]
cannot find symbol
  symbol:   class InMemoryId
  location: class org.apache.james.adapter.mailbox.MailboxManagementTest
[ERROR] <https://builds.apache.org/job/james-server-trunk/org.apache.james$james-server-mailbox-adapter/ws/src/test/java/org/apache/james/adapter/mailbox/MailboxManagementTest.java>:[78,9]
cannot access java.time.ZonedDateTime
  class file for java.time.ZonedDateTime not found
[ERROR] <https://builds.apache.org/job/james-server-trunk/org.apache.james$james-server-mailbox-adapter/ws/src/test/java/org/apache/james/adapter/mailbox/MailboxManagementTest.java>:[83,83]
cannot find symbol
  symbol:   class InMemoryId
  location: class org.apache.james.adapter.mailbox.MailboxManagementTest
[ERROR] <https://builds.apache.org/job/james-server-trunk/org.apache.james$james-server-mailbox-adapter/ws/src/test/java/org/apache/james/adapter/mailbox/MailboxManagementTest.java>:[85,9]
cannot access java.time.LocalDateTime
  class file for java.time.LocalDateTime not found
[ERROR] <https://builds.apache.org/job/james-server-trunk/org.apache.james$james-server-mailbox-adapter/ws/src/test/java/org/apache/james/adapter/mailbox/MailboxManagementTest.java>:[90,17]
cannot find symbol
  symbol:   class InMemoryId
  location: class org.apache.james.adapter.mailbox.MailboxManagementTest
[ERROR] <https://builds.apache.org/job/james-server-trunk/org.apache.james$james-server-mailbox-adapter/ws/src/test/java/org/apache/james/adapter/mailbox/MailboxManagementTest.java>:[90,57]
cannot find symbol
  symbol:   class InMemoryId
  location: class org.apache.james.adapter.mailbox.MailboxManagementTest
[ERROR] <https://builds.apache.org/job/james-server-trunk/org.apache.james$james-server-mailbox-adapter/ws/src/test/java/org/apache/james/adapter/mailbox/MailboxManagementTest.java>:[93,9]
cannot access java.time.LocalTime
  class file for java.time.LocalTime not found
[ERROR] <https://builds.apache.org/job/james-server-trunk/org.apache.james$james-server-mailbox-adapter/ws/src/test/java/org/apache/james/adapter/mailbox/MailboxManagementTest.java>:[98,17]
cannot find symbol
  symbol:   class InMemoryId
  location: class org.apache.james.adapter.mailbox.MailboxManagementTest
[ERROR] <https://builds.apache.org/job/james-server-trunk/org.apache.james$james-server-mailbox-adapter/ws/src/test/java/org/apache/james/adapter/mailbox/MailboxManagementTest.java>:[98,57]
cannot find symbol
  symbol:   class InMemoryId
  location: class org.apache.james.adapter.mailbox.MailboxManagementTest
[ERROR] <https://builds.apache.org/job/james-server-trunk/org.apache.james$james-server-mailbox-adapter/ws/src/test/java/org/apache/james/adapter/mailbox/MailboxManagementTest.java>:[101,9]
cannot access java.time.LocalDate
  class file for java.time.LocalDate not found
[ERROR] <https://builds.apache.org/job/james-server-trunk/org.apache.james$james-server-mailbox-adapter/ws/src/test/java/org/apache/james/adapter/mailbox/MailboxManagementTest.java>:[106,83]
cannot find symbol
  symbol:   class InMemoryId
  location: class org.apache.james.adapter.mailbox.MailboxManagementTest
[ERROR] <https://builds.apache.org/job/james-server-trunk/org.apache.james$james-server-mailbox-adapter/ws/src/test/java/org/apache/james/adapter/mailbox/MailboxManagementTest.java>:[123,83]
cannot find symbol
  symbol:   class InMemoryId
  location: class org.apache.james.adapter.mailbox.MailboxManagementTest
[ERROR] <https://builds.apache.org/job/james-server-trunk/org.apache.james$james-server-mailbox-adapter/ws/src/test/java/org/apache/james/adapter/mailbox/MailboxManagementTest.java>:[124,83]
cannot find symbol
  symbol:   class InMemoryId
  location: class org.apache.james.adapter.mailbox.MailboxManagementTest
[ERROR] <https://builds.apache.org/job/james-server-trunk/org.apache.james$james-server-mailbox-adapter/ws/src/test/java/org/apache/james/adapter/mailbox/MailboxManagementTest.java>:[125,83]
cannot find symbol
  symbol:   class InMemoryId
  location: class org.apache.james.adapter.mailbox.MailboxManagementTest
[ERROR] <https://builds.apache.org/job/james-server-trunk/org.apache.james$james-server-mailbox-adapter/ws/src/test/java/org/apache/james/adapter/mailbox/MailboxManagementTest.java>:[140,17]
cannot find symbol
  symbol:   class InMemoryId
  location: class org.apache.james.adapter.mailbox.MailboxManagementTest
[ERROR] <https://builds.apache.org/job/james-server-trunk/org.apache.james$james-server-mailbox-adapter/ws/src/test/java/org/apache/james/adapter/mailbox/MailboxManagementTest.java>:[140,57]
cannot find symbol
  symbol:   class InMemoryId
  location: class org.apache.james.adapter.mailbox.MailboxManagementTest
[ERROR] <https://builds.apache.org/job/james-server-trunk/org.apache.james$james-server-mailbox-adapter/ws/src/test/java/org/apache/james/adapter/mailbox/MailboxManagementTest.java>:[178,17]
cannot find symbol
  symbol:   class InMemoryId
  location: class org.apache.james.adapter.mailbox.MailboxManagementTest
[ERROR] <https://builds.apache.org/job/james-server-trunk/org.apache.james$james-server-mailbox-adapter/ws/src/test/java/org/apache/james/adapter/mailbox/MailboxManagementTest.java>:[178,58]
cannot find symbol
  symbol:   class InMemoryId
  location: class org.apache.james.adapter.mailbox.MailboxManagementTest
[ERROR] <https://builds.apache.org/job/james-server-trunk/org.apache.james$james-server-mailbox-adapter/ws/src/test/java/org/apache/james/adapter/mailbox/MailboxManagementTest.java>:[179,17]
cannot find symbol
  symbol:   class InMemoryId
  location: class org.apache.james.adapter.mailbox.MailboxManagementTest
[ERROR] <https://builds.apache.org/job/james-server-trunk/org.apache.james$james-server-mailbox-adapter/ws/src/test/java/org/apache/james/adapter/mailbox/MailboxManagementTest.java>:[179,58]
cannot find symbol
  symbol:   class InMemoryId
  location: class org.apache.james.adapter.mailbox.MailboxManagementTest
[ERROR] <https://builds.apache.org/job/james-server-trunk/org.apache.james$james-server-mailbox-adapter/ws/src/test/java/org/apache/james/adapter/mailbox/MailboxManagementTest.java>:[180,17]
cannot find symbol
  symbol:   class InMemoryId
  location: class org.apache.james.adapter.mailbox.MailboxManagementTest
[ERROR] <https://builds.apache.org/job/james-server-trunk/org.apache.james$james-server-mailbox-adapter/ws/src/test/java/org/apache/james/adapter/mailbox/MailboxManagementTest.java>:[180,58]
cannot find symbol
  symbol:   class InMemoryId
  location: class org.apache.james.adapter.mailbox.MailboxManagementTest
[ERROR] <https://builds.apache.org/job/james-server-trunk/org.apache.james$james-server-mailbox-adapter/ws/src/test/java/org/apache/james/adapter/mailbox/MailboxManagementTest.java>:[181,17]
cannot find symbol
  symbol:   class InMemoryId
  location: class org.apache.james.adapter.mailbox.MailboxManagementTest
[ERROR] <https://builds.apache.org/job/james-server-trunk/org.apache.james$james-server-mailbox-adapter/ws/src/test/java/org/apache/james/adapter/mailbox/MailboxManagementTest.java>:[181,58]
cannot find symbol
  symbol:   class InMemoryId
  location: class org.apache.james.adapter.mailbox.MailboxManagementTest
[ERROR] <https://builds.apache.org/job/james-server-trunk/org.apache.james$james-server-mailbox-adapter/ws/src/test/java/org/apache/james/adapter/mailbox/MailboxManagementTest.java>:[182,17]
cannot find symbol
  symbol:   class InMemoryId
  location: class org.apache.james.adapter.mailbox.MailboxManagementTest
[ERROR] <https://builds.apache.org/job/james-server-trunk/org.apache.james$james-server-mailbox-adapter/ws/src/test/java/org/apache/james/adapter/mailbox/MailboxManagementTest.java>:[182,58]
cannot find symbol
  symbol:   class InMemoryId
  location: class org.apache.james.adapter.mailbox.MailboxManagementTest
[ERROR] <https://builds.apache.org/job/james-server-trunk/org.apache.james$james-server-mailbox-adapter/ws/src/test/java/org/apache/james/adapter/mailbox/MailboxManagementTest.java>:[183,17]
cannot find symbol
  symbol:   class InMemoryId
  location: class org.apache.james.adapter.mailbox.MailboxManagementTest
[ERROR] <https://builds.apache.org/job/james-server-trunk/org.apache.james$james-server-mailbox-adapter/ws/src/test/java/org/apache/james/adapter/mailbox/MailboxManagementTest.java>:[183,58]
cannot find symbol
  symbol:   class InMemoryId
  location: class org.apache.james.adapter.mailbox.MailboxManagementTest
[ERROR] <https://builds.apache.org/job/james-server-trunk/org.apache.james$james-server-mailbox-adapter/ws/src/test/java/org/apache/james/adapter/mailbox/MailboxManagementTest.java>:[205,83]
cannot find symbol
  symbol:   class InMemoryId
  location: class org.apache.james.adapter.mailbox.MailboxManagementTest
[ERROR] <https://builds.apache.org/job/james-server-trunk/org.apache.james$james-server-mailbox-adapter/ws/src/test/java/org/apache/james/adapter/mailbox/MailboxManagementTest.java>:[212,17]
cannot find symbol
  symbol:   class InMemoryId
  location: class org.apache.james.adapter.mailbox.MailboxManagementTest
[ERROR] <https://builds.apache.org/job/james-server-trunk/org.apache.james$james-server-mailbox-adapter/ws/src/test/java/org/apache/james/adapter/mailbox/MailboxManagementTest.java>:[212,57]
cannot find symbol
  symbol:   class InMemoryId
  location: class org.apache.james.adapter.mailbox.MailboxManagementTest
[ERROR] <https://builds.apache.org/job/james-server-trunk/org.apache.james$james-server-mailbox-adapter/ws/src/test/java/org/apache/james/adapter/mailbox/MailboxManagementTest.java>:[220,17]
cannot find symbol
  symbol:   class InMemoryId
  location: class org.apache.james.adapter.mailbox.MailboxManagementTest
[ERROR] <https://builds.apache.org/job/james-server-trunk/org.apache.james$james-server-mailbox-adapter/ws/src/test/java/org/apache/james/adapter/mailbox/MailboxManagementTest.java>:[220,57]
cannot find symbol
  symbol:   class InMemoryId
  location: class org.apache.james.adapter.mailbox.MailboxManagementTest
[ERROR] <https://builds.apache.org/job/james-server-trunk/org.apache.james$james-server-mailbox-adapter/ws/src/test/java/org/apache/james/adapter/mailbox/MailboxManagementTest.java>:[228,17]
cannot find symbol
  symbol:   class InMemoryId
  location: class org.apache.james.adapter.mailbox.MailboxManagementTest
[ERROR] <https://builds.apache.org/job/james-server-trunk/org.apache.james$james-server-mailbox-adapter/ws/src/test/java/org/apache/james/adapter/mailbox/MailboxManagementTest.java>:[228,57]
cannot find symbol
  symbol:   class InMemoryId
  location: class org.apache.james.adapter.mailbox.MailboxManagementTest
[INFO] 40 errors 
[INFO] -------------------------------------------------------------

---------------------------------------------------------------------
To unsubscribe, e-mail: server-dev-unsubscribe@james.apache.org
For additional commands, e-mail: server-dev-help@james.apache.org


Mime
View raw message