james-server-dev mailing list archives

Site index · List index
Message view « Date » · « Thread »
Top « Date » · « Thread »
From Raphaël Ouazana (JIRA) <server-...@james.apache.org>
Subject [jira] [Updated] (JAMES-2412) ActiveMQ tests are flacky
Date Tue, 05 Jun 2018 15:24:00 GMT

     [ https://issues.apache.org/jira/browse/JAMES-2412?page=com.atlassian.jira.plugin.system.issuetabpanels:all-tabpanel
]

Raphaël Ouazana updated JAMES-2412:
-----------------------------------
    Description: 
For example:
{code}
[null] Tests run: 66, Failures: 1, Errors: 0, Skipped: 7, Time elapsed: 50.144 sec <<<
FAILURE! - in org.apache.james.queue.activemq.ActiveMQMailQueueBlobTest
[null] concurrentEnqueueShouldNotAlterBrowsing()  Time elapsed: 0.023 sec  <<< FAILURE!
[null] java.lang.AssertionError: 
[null] 
[null] Actual and expected should have same size but actual size was:
[null]   <3>
[null] while expected size was:
[null]   <2>
[null] Actual was:
[null]   <["name1", "name2", "name3"]>
[null] Expected was:
[null]   <["name1", "name2"]>
[null] 
[null] 	at org.apache.james.queue.api.ManageableMailQueueContract.concurrentEnqueueShouldNotAlterBrowsing(ManageableMailQueueContract.java:245)
{code}

  was:
For example:
```
[null] Tests run: 66, Failures: 1, Errors: 0, Skipped: 7, Time elapsed: 50.144 sec <<<
FAILURE! - in org.apache.james.queue.activemq.ActiveMQMailQueueBlobTest
[null] concurrentEnqueueShouldNotAlterBrowsing()  Time elapsed: 0.023 sec  <<< FAILURE!
[null] java.lang.AssertionError: 
[null] 
[null] Actual and expected should have same size but actual size was:
[null]   <3>
[null] while expected size was:
[null]   <2>
[null] Actual was:
[null]   <["name1", "name2", "name3"]>
[null] Expected was:
[null]   <["name1", "name2"]>
[null] 
[null] 	at org.apache.james.queue.api.ManageableMailQueueContract.concurrentEnqueueShouldNotAlterBrowsing(ManageableMailQueueContract.java:245)
```


> ActiveMQ tests are flacky
> -------------------------
>
>                 Key: JAMES-2412
>                 URL: https://issues.apache.org/jira/browse/JAMES-2412
>             Project: James Server
>          Issue Type: New Feature
>            Reporter: Raphaël Ouazana
>            Priority: Major
>
> For example:
> {code}
> [null] Tests run: 66, Failures: 1, Errors: 0, Skipped: 7, Time elapsed: 50.144 sec <<<
FAILURE! - in org.apache.james.queue.activemq.ActiveMQMailQueueBlobTest
> [null] concurrentEnqueueShouldNotAlterBrowsing()  Time elapsed: 0.023 sec  <<<
FAILURE!
> [null] java.lang.AssertionError: 
> [null] 
> [null] Actual and expected should have same size but actual size was:
> [null]   <3>
> [null] while expected size was:
> [null]   <2>
> [null] Actual was:
> [null]   <["name1", "name2", "name3"]>
> [null] Expected was:
> [null]   <["name1", "name2"]>
> [null] 
> [null] 	at org.apache.james.queue.api.ManageableMailQueueContract.concurrentEnqueueShouldNotAlterBrowsing(ManageableMailQueueContract.java:245)
> {code}



--
This message was sent by Atlassian JIRA
(v7.6.3#76005)

---------------------------------------------------------------------
To unsubscribe, e-mail: server-dev-unsubscribe@james.apache.org
For additional commands, e-mail: server-dev-help@james.apache.org


Mime
View raw message