jclouds-dev mailing list archives

Site index · List index
Message view « Date » · « Thread »
Top « Date » · « Thread »
From jenkins-no-re...@cloudbees.com
Subject Build failed in Jenkins: jclouds-karaf-1.6.x-branch #48
Date Tue, 04 Jun 2013 15:56:02 GMT
See <https://jclouds.ci.cloudbees.com/job/jclouds-karaf-1.6.x-branch/48/>

------------------------------------------
[...truncated 1358 lines...]
Downloaded: http://repo.cloudbees.com/content/repositories/central/org/codehaus/plexus/plexus-velocity/1.1.2/plexus-velocity-1.1.2.pom
(8 KB at 741.7 KB/sec)
Downloading: https://repository-jclouds.forge.cloudbees.com/release/org/codehaus/plexus/plexus-container-default/1.0-alpha-7/plexus-container-default-1.0-alpha-7.pom
Downloading: http://repo.cloudbees.com/content/repositories/central/org/codehaus/plexus/plexus-container-default/1.0-alpha-7/plexus-container-default-1.0-alpha-7.pom
Downloaded: http://repo.cloudbees.com/content/repositories/central/org/codehaus/plexus/plexus-container-default/1.0-alpha-7/plexus-container-default-1.0-alpha-7.pom
(2 KB at 114.4 KB/sec)
Downloading: https://repository-jclouds.forge.cloudbees.com/release/plexus/plexus-containers/1.0.2/plexus-containers-1.0.2.pom
Downloading: http://repo.cloudbees.com/content/repositories/central/plexus/plexus-containers/1.0.2/plexus-containers-1.0.2.pom
Downloaded: http://repo.cloudbees.com/content/repositories/central/plexus/plexus-containers/1.0.2/plexus-containers-1.0.2.pom
(471 B at 41.8 KB/sec)
Downloading: https://repository-jclouds.forge.cloudbees.com/release/plexus/plexus-root/1.0.3/plexus-root-1.0.3.pom
Downloading: http://repo.cloudbees.com/content/repositories/central/plexus/plexus-root/1.0.3/plexus-root-1.0.3.pom
Downloaded: http://repo.cloudbees.com/content/repositories/central/plexus/plexus-root/1.0.3/plexus-root-1.0.3.pom
(6 KB at 653.1 KB/sec)
Downloading: https://repository-jclouds.forge.cloudbees.com/release/plexus/plexus-utils/1.0.2/plexus-utils-1.0.2.pom
Downloading: http://repo.cloudbees.com/content/repositories/central/plexus/plexus-utils/1.0.2/plexus-utils-1.0.2.pom
Downloaded: http://repo.cloudbees.com/content/repositories/central/plexus/plexus-utils/1.0.2/plexus-utils-1.0.2.pom
(740 B at 19.0 KB/sec)
Downloading: https://repository-jclouds.forge.cloudbees.com/release/commons-logging/commons-logging-api/1.0.4/commons-logging-api-1.0.4.pom
Downloading: http://repo.cloudbees.com/content/repositories/central/commons-logging/commons-logging-api/1.0.4/commons-logging-api-1.0.4.pom
Downloaded: http://repo.cloudbees.com/content/repositories/central/commons-logging/commons-logging-api/1.0.4/commons-logging-api-1.0.4.pom
(168 B at 16.4 KB/sec)
Downloading: https://repository-jclouds.forge.cloudbees.com/release/org/apache/maven/doxia/doxia-decoration-model/1.0-alpha-7/doxia-decoration-model-1.0-alpha-7.pom
Downloading: http://repo.cloudbees.com/content/repositories/central/org/apache/maven/doxia/doxia-decoration-model/1.0-alpha-7/doxia-decoration-model-1.0-alpha-7.pom
Downloaded: http://repo.cloudbees.com/content/repositories/central/org/apache/maven/doxia/doxia-decoration-model/1.0-alpha-7/doxia-decoration-model-1.0-alpha-7.pom
(2 KB at 138.6 KB/sec)
Downloading: https://repository-jclouds.forge.cloudbees.com/release/org/apache/rat/apache-rat-core/0.8/apache-rat-core-0.8.jar
Downloading: https://repository-jclouds.forge.cloudbees.com/release/commons-collections/commons-collections/3.2/commons-collections-3.2.jar
Downloading: https://repository-jclouds.forge.cloudbees.com/release/commons-lang/commons-lang/2.1/commons-lang-2.1.jar
Downloading: https://repository-jclouds.forge.cloudbees.com/release/org/apache/commons/commons-compress/1.0/commons-compress-1.0.jar
Downloading: https://repository-jclouds.forge.cloudbees.com/release/commons-cli/commons-cli/1.2/commons-cli-1.2.jar
Downloading: https://repository-jclouds.forge.cloudbees.com/release/org/codehaus/plexus/plexus-utils/1.4/plexus-utils-1.4.jar
Downloading: https://repository-jclouds.forge.cloudbees.com/release/org/apache/maven/doxia/doxia-site-renderer/1.0-alpha-8/doxia-site-renderer-1.0-alpha-8.jar
Downloading: https://repository-jclouds.forge.cloudbees.com/release/org/apache/maven/doxia/doxia-core/1.0-alpha-8/doxia-core-1.0-alpha-8.jar
Downloading: https://repository-jclouds.forge.cloudbees.com/release/org/apache/maven/doxia/doxia-sink-api/1.0-alpha-8/doxia-sink-api-1.0-alpha-8.jar
Downloading: https://repository-jclouds.forge.cloudbees.com/release/org/codehaus/plexus/plexus-i18n/1.0-beta-6/plexus-i18n-1.0-beta-6.jar
Downloading: https://repository-jclouds.forge.cloudbees.com/release/org/codehaus/plexus/plexus-velocity/1.1.3/plexus-velocity-1.1.3.jar
Downloading: https://repository-jclouds.forge.cloudbees.com/release/velocity/velocity/1.4/velocity-1.4.jar
Downloading: https://repository-jclouds.forge.cloudbees.com/release/velocity/velocity-dep/1.4/velocity-dep-1.4.jar
Downloading: https://repository-jclouds.forge.cloudbees.com/release/org/apache/maven/doxia/doxia-decoration-model/1.0-alpha-8/doxia-decoration-model-1.0-alpha-8.jar
Downloading: https://repository-jclouds.forge.cloudbees.com/release/org/apache/maven/reporting/maven-reporting-impl/2.0.4/maven-reporting-impl-2.0.4.jar
Downloading: https://repository-jclouds.forge.cloudbees.com/release/commons-validator/commons-validator/1.2.0/commons-validator-1.2.0.jar
Downloading: https://repository-jclouds.forge.cloudbees.com/release/commons-digester/commons-digester/1.6/commons-digester-1.6.jar
Downloading: https://repository-jclouds.forge.cloudbees.com/release/commons-logging/commons-logging/1.0.4/commons-logging-1.0.4.jar
Downloading: https://repository-jclouds.forge.cloudbees.com/release/xml-apis/xml-apis/1.0.b2/xml-apis-1.0.b2.jar
Downloading: https://repository-jclouds.forge.cloudbees.com/release/oro/oro/2.0.7/oro-2.0.7.jar
Downloading: https://repository-jclouds.forge.cloudbees.com/release/org/apache/maven/reporting/maven-reporting-api/2.0.4/maven-reporting-api-2.0.4.jar
Downloading: http://repo.cloudbees.com/content/repositories/central/org/apache/rat/apache-rat-core/0.8/apache-rat-core-0.8.jar
Downloading: http://repo.cloudbees.com/content/repositories/central/commons-collections/commons-collections/3.2/commons-collections-3.2.jar
Downloading: http://repo.cloudbees.com/content/repositories/central/commons-lang/commons-lang/2.1/commons-lang-2.1.jar
Downloaded: http://repo.cloudbees.com/content/repositories/central/org/apache/rat/apache-rat-core/0.8/apache-rat-core-0.8.jar
(102 KB at 2368.6 KB/sec)
Downloading: http://repo.cloudbees.com/content/repositories/central/org/codehaus/plexus/plexus-utils/1.4/plexus-utils-1.4.jar
Downloaded: http://repo.cloudbees.com/content/repositories/central/org/codehaus/plexus/plexus-utils/1.4/plexus-utils-1.4.jar
(178 KB at 4235.7 KB/sec)
Downloading: http://repo.cloudbees.com/content/repositories/central/org/apache/maven/doxia/doxia-site-renderer/1.0-alpha-8/doxia-site-renderer-1.0-alpha-8.jar
Downloading: http://repo.cloudbees.com/content/repositories/central/org/apache/commons/commons-compress/1.0/commons-compress-1.0.jar
Downloading: http://repo.cloudbees.com/content/repositories/central/commons-cli/commons-cli/1.2/commons-cli-1.2.jar
Downloaded: http://repo.cloudbees.com/content/repositories/central/commons-collections/commons-collections/3.2/commons-collections-3.2.jar
(558 KB at 5364.1 KB/sec)
Downloading: http://repo.cloudbees.com/content/repositories/central/org/apache/maven/doxia/doxia-core/1.0-alpha-8/doxia-core-1.0-alpha-8.jar
Downloaded: http://repo.cloudbees.com/content/repositories/central/org/apache/maven/doxia/doxia-site-renderer/1.0-alpha-8/doxia-site-renderer-1.0-alpha-8.jar
(34 KB at 1449.8 KB/sec)
Downloading: http://repo.cloudbees.com/content/repositories/central/org/apache/maven/doxia/doxia-sink-api/1.0-alpha-8/doxia-sink-api-1.0-alpha-8.jar
Downloaded: http://repo.cloudbees.com/content/repositories/central/commons-cli/commons-cli/1.2/commons-cli-1.2.jar
(41 KB at 803.2 KB/sec)
Downloading: http://repo.cloudbees.com/content/repositories/central/org/codehaus/plexus/plexus-i18n/1.0-beta-6/plexus-i18n-1.0-beta-6.jar
Downloaded: http://repo.cloudbees.com/content/repositories/central/org/apache/maven/doxia/doxia-sink-api/1.0-alpha-8/doxia-sink-api-1.0-alpha-8.jar
(7 KB at 176.9 KB/sec)
Downloading: http://repo.cloudbees.com/content/repositories/central/org/codehaus/plexus/plexus-velocity/1.1.3/plexus-velocity-1.1.3.jar
Downloaded: http://repo.cloudbees.com/content/repositories/central/org/codehaus/plexus/plexus-i18n/1.0-beta-6/plexus-i18n-1.0-beta-6.jar
(12 KB at 260.6 KB/sec)
Downloading: http://repo.cloudbees.com/content/repositories/central/velocity/velocity/1.4/velocity-1.4.jar
Downloaded: http://repo.cloudbees.com/content/repositories/central/org/apache/maven/doxia/doxia-core/1.0-alpha-8/doxia-core-1.0-alpha-8.jar
(200 KB at 2077.3 KB/sec)
Downloaded: http://repo.cloudbees.com/content/repositories/central/org/apache/commons/commons-compress/1.0/commons-compress-1.0.jar
(141 KB at 1254.2 KB/sec)
Downloading: http://repo.cloudbees.com/content/repositories/central/velocity/velocity-dep/1.4/velocity-dep-1.4.jar
Downloading: http://repo.cloudbees.com/content/repositories/central/org/apache/maven/doxia/doxia-decoration-model/1.0-alpha-8/doxia-decoration-model-1.0-alpha-8.jar
Downloaded: http://repo.cloudbees.com/content/repositories/central/commons-lang/commons-lang/2.1/commons-lang-2.1.jar
(203 KB at 989.5 KB/sec)
Downloading: http://repo.cloudbees.com/content/repositories/central/org/apache/maven/reporting/maven-reporting-impl/2.0.4/maven-reporting-impl-2.0.4.jar
Downloaded: http://repo.cloudbees.com/content/repositories/central/org/codehaus/plexus/plexus-velocity/1.1.3/plexus-velocity-1.1.3.jar
(8 KB at 70.9 KB/sec)
Downloading: http://repo.cloudbees.com/content/repositories/central/commons-validator/commons-validator/1.2.0/commons-validator-1.2.0.jar
Downloaded: http://repo.cloudbees.com/content/repositories/central/org/apache/maven/doxia/doxia-decoration-model/1.0-alpha-8/doxia-decoration-model-1.0-alpha-8.jar
(40 KB at 716.1 KB/sec)
Downloading: http://repo.cloudbees.com/content/repositories/central/commons-digester/commons-digester/1.6/commons-digester-1.6.jar
Downloaded: http://repo.cloudbees.com/content/repositories/central/org/apache/maven/reporting/maven-reporting-impl/2.0.4/maven-reporting-impl-2.0.4.jar
(14 KB at 251.6 KB/sec)
Downloading: http://repo.cloudbees.com/content/repositories/central/commons-logging/commons-logging/1.0.4/commons-logging-1.0.4.jar
Downloaded: http://repo.cloudbees.com/content/repositories/central/commons-validator/commons-validator/1.2.0/commons-validator-1.2.0.jar
(89 KB at 3422.2 KB/sec)
Downloading: http://repo.cloudbees.com/content/repositories/central/xml-apis/xml-apis/1.0.b2/xml-apis-1.0.b2.jar
Downloaded: http://repo.cloudbees.com/content/repositories/central/commons-logging/commons-logging/1.0.4/commons-logging-1.0.4.jar
(38 KB at 1953.9 KB/sec)
Downloading: http://repo.cloudbees.com/content/repositories/central/oro/oro/2.0.7/oro-2.0.7.jar
Downloaded: http://repo.cloudbees.com/content/repositories/central/velocity/velocity/1.4/velocity-1.4.jar
(353 KB at 2399.4 KB/sec)
Downloading: http://repo.cloudbees.com/content/repositories/central/org/apache/maven/reporting/maven-reporting-api/2.0.4/maven-reporting-api-2.0.4.jar
Downloaded: http://repo.cloudbees.com/content/repositories/central/commons-digester/commons-digester/1.6/commons-digester-1.6.jar
(165 KB at 2108.9 KB/sec)
Downloaded: http://repo.cloudbees.com/content/repositories/central/oro/oro/2.0.7/oro-2.0.7.jar
(64 KB at 1161.7 KB/sec)
Downloaded: http://repo.cloudbees.com/content/repositories/central/xml-apis/xml-apis/1.0.b2/xml-apis-1.0.b2.jar
(107 KB at 1668.1 KB/sec)
Downloaded: http://repo.cloudbees.com/content/repositories/central/velocity/velocity-dep/1.4/velocity-dep-1.4.jar
(506 KB at 3463.2 KB/sec)
Downloaded: http://repo.cloudbees.com/content/repositories/central/org/apache/maven/reporting/maven-reporting-api/2.0.4/maven-reporting-api-2.0.4.jar
(5 KB at 347.9 KB/sec)
[INFO] Exclude: **/BUILD.txt
[INFO] Exclude: **/CHANGES.txt
[INFO] Exclude: **/NOTICE-src.txt
[INFO] Exclude: **/README.md
[INFO] Exclude: .git/**
[INFO] Exclude: **/.gitignore
[INFO] Exclude: **/*.json
[INFO] Exclude: **/*.log*
[INFO] Exclude: **/TODO
[INFO] Exclude: .mailmap
[INFO] Exclude: .idea/**
[INFO] Exclude: **/*.iml
[INFO] Exclude: **/.project
[INFO] Exclude: **/.classpath
[INFO] Exclude: **/.settings/**
[INFO] Exclude: **/.checkstyle
[INFO] Exclude: **/target/**
[INFO] Exclude: .repository/**
[INFO] Exclude: **/src/main/resources/**/*.txt
mojoSucceeded org.apache.rat:apache-rat-plugin:0.8(default)
mojoStarted org.apache.maven.plugins:maven-install-plugin:2.3.1(default-install)
[INFO] 
[INFO] --- maven-install-plugin:2.3.1:install (default-install) @ jclouds-karaf ---
Downloading: https://repository-jclouds.forge.cloudbees.com/release/org/codehaus/plexus/plexus-digest/1.0/plexus-digest-1.0.pom
Downloading: http://repo.cloudbees.com/content/repositories/central/org/codehaus/plexus/plexus-digest/1.0/plexus-digest-1.0.pom
Downloaded: http://repo.cloudbees.com/content/repositories/central/org/codehaus/plexus/plexus-digest/1.0/plexus-digest-1.0.pom
(2 KB at 94.0 KB/sec)
Downloading: https://repository-jclouds.forge.cloudbees.com/release/org/codehaus/plexus/plexus-components/1.1.7/plexus-components-1.1.7.pom
Downloading: http://repo.cloudbees.com/content/repositories/central/org/codehaus/plexus/plexus-components/1.1.7/plexus-components-1.1.7.pom
Downloaded: http://repo.cloudbees.com/content/repositories/central/org/codehaus/plexus/plexus-components/1.1.7/plexus-components-1.1.7.pom
(5 KB at 441.7 KB/sec)
Downloading: https://repository-jclouds.forge.cloudbees.com/release/org/codehaus/plexus/plexus-utils/2.0.5/plexus-utils-2.0.5.jar
Downloading: https://repository-jclouds.forge.cloudbees.com/release/org/codehaus/plexus/plexus-digest/1.0/plexus-digest-1.0.jar
Downloading: http://repo.cloudbees.com/content/repositories/central/org/codehaus/plexus/plexus-utils/2.0.5/plexus-utils-2.0.5.jar
Downloading: http://repo.cloudbees.com/content/repositories/central/org/codehaus/plexus/plexus-digest/1.0/plexus-digest-1.0.jar
Downloaded: http://repo.cloudbees.com/content/repositories/central/org/codehaus/plexus/plexus-digest/1.0/plexus-digest-1.0.jar
(12 KB at 1052.7 KB/sec)
Downloaded: http://repo.cloudbees.com/content/repositories/central/org/codehaus/plexus/plexus-utils/2.0.5/plexus-utils-2.0.5.jar
(218 KB at 7030.3 KB/sec)
[INFO] Installing <https://jclouds.ci.cloudbees.com/job/jclouds-karaf-1.6.x-branch/ws/pom.xml>
to /home/jenkins/.m2/repository/org/apache/jclouds/jclouds-karaf/1.6.1-incubating/jclouds-karaf-1.6.1-incubating.pom
mojoSucceeded org.apache.maven.plugins:maven-install-plugin:2.3.1(default-install)
mojoStarted org.apache.maven.plugins:maven-deploy-plugin:2.7(default-deploy)
[INFO] 
[INFO] --- maven-deploy-plugin:2.7:deploy (default-deploy) @ jclouds-karaf ---
Downloading: https://repository-jclouds.forge.cloudbees.com/release/org/codehaus/plexus/plexus-utils/1.5.6/plexus-utils-1.5.6.pom
Downloading: http://repo.cloudbees.com/content/repositories/central/org/codehaus/plexus/plexus-utils/1.5.6/plexus-utils-1.5.6.pom
Downloaded: http://repo.cloudbees.com/content/repositories/central/org/codehaus/plexus/plexus-utils/1.5.6/plexus-utils-1.5.6.pom
(6 KB at 117.7 KB/sec)
Downloading: https://repository-jclouds.forge.cloudbees.com/release/org/codehaus/plexus/plexus/1.0.12/plexus-1.0.12.pom
Downloading: http://repo.cloudbees.com/content/repositories/central/org/codehaus/plexus/plexus/1.0.12/plexus-1.0.12.pom
Downloaded: http://repo.cloudbees.com/content/repositories/central/org/codehaus/plexus/plexus/1.0.12/plexus-1.0.12.pom
(10 KB at 870.0 KB/sec)
Downloading: https://repository-jclouds.forge.cloudbees.com/release/org/codehaus/plexus/plexus-utils/1.5.6/plexus-utils-1.5.6.jar
Downloading: http://repo.cloudbees.com/content/repositories/central/org/codehaus/plexus/plexus-utils/1.5.6/plexus-utils-1.5.6.jar
Downloaded: http://repo.cloudbees.com/content/repositories/central/org/codehaus/plexus/plexus-utils/1.5.6/plexus-utils-1.5.6.jar
(245 KB at 13593.0 KB/sec)
Uploading: https://repository.apache.org/service/local/staging/deploy/maven2/org/apache/jclouds/jclouds-karaf/1.6.1-incubating/jclouds-karaf-1.6.1-incubating.pom
mojoFailed org.apache.maven.plugins:maven-deploy-plugin:2.7(default-deploy)
projectFailed org.apache.jclouds:jclouds-karaf:1.6.1-incubating
sessionEnded
[INFO] ------------------------------------------------------------------------
[INFO] Reactor Summary:
[INFO] 
[INFO] JClouds :: Karaf .................................. FAILURE [34.091s]
[INFO] JClouds :: Karaf :: Core .......................... SKIPPED
[INFO] JClouds :: Karaf :: Utils ......................... SKIPPED
[INFO] JClouds :: Karaf :: Recipe ........................ SKIPPED
[INFO] JClouds :: Karaf :: Cache ......................... SKIPPED
[INFO] JClouds :: Karaf :: Services ...................... SKIPPED
[INFO] JClouds :: Karaf :: Commands ...................... SKIPPED
[INFO] JClouds :: Karaf :: URL Handler ................... SKIPPED
[INFO] JClouds :: Karaf :: Chef .......................... SKIPPED
[INFO] JClouds :: Karaf :: Chef :: Core .................. SKIPPED
[INFO] JClouds :: Karaf :: Chef :: Services .............. SKIPPED
[INFO] JClouds :: Karaf :: Chef :: Commands .............. SKIPPED
[INFO] JClouds :: Karaf :: Chef :: Cache ................. SKIPPED
[INFO] JClouds :: Karaf :: Feature ....................... SKIPPED
[INFO] JClouds :: Karaf :: Integration Tests ............. SKIPPED
[INFO] ------------------------------------------------------------------------
[INFO] BUILD FAILURE
[INFO] ------------------------------------------------------------------------
[INFO] Total time: 45.715s
[INFO] Finished at: Tue Jun 04 11:55:54 EDT 2013
[Unloading class GregorSamsa$0]
[Unloading class GregorSamsa]
[Unloading class GregorSamsa$2]
[Unloading class GregorSamsa$1]
[INFO] Final Memory: 16M/160M
[INFO] ------------------------------------------------------------------------
Projects to build: [MavenProject: org.apache.jclouds:jclouds-karaf:1.6.1-incubating @ <https://jclouds.ci.cloudbees.com/job/jclouds-karaf-1.6.x-branch/ws/pom.xml,>
MavenProject: org.apache.jclouds.karaf:core:1.6.1-incubating @ <https://jclouds.ci.cloudbees.com/job/jclouds-karaf-1.6.x-branch/ws/core/pom.xml,>
MavenProject: org.apache.jclouds.karaf:utils:1.6.1-incubating @ <https://jclouds.ci.cloudbees.com/job/jclouds-karaf-1.6.x-branch/ws/utils/pom.xml,>
MavenProject: org.apache.jclouds.karaf:recipe:1.6.1-incubating @ <https://jclouds.ci.cloudbees.com/job/jclouds-karaf-1.6.x-branch/ws/recipe/pom.xml,>
MavenProject: org.apache.jclouds.karaf:cache:1.6.1-incubating @ <https://jclouds.ci.cloudbees.com/job/jclouds-karaf-1.6.x-branch/ws/cache/pom.xml,>
MavenProject: org.apache.jclouds.karaf:services:1.6.1-incubating @ <https://jclouds.ci.cloudbees.com/job/jclouds-karaf-1.6.x-branch/ws/services/pom.xml,>
MavenProject: org.apache.jclouds.karaf:commands:1.6.1-incubating @ <https://jclouds.ci.cloudbees.com/job/jclouds-karaf-1.6.x-branch/ws/commands/pom.xml,>
MavenProject: org.apache.jclouds.karaf:urlhandler:1.6.1-incubating @ <https://jclouds.ci.cloudbees.com/job/jclouds-karaf-1.6.x-branch/ws/urlhandler/pom.xml,>
MavenProject: org.apache.jclouds.karaf:chef:1.6.1-incubating @ <https://jclouds.ci.cloudbees.com/job/jclouds-karaf-1.6.x-branch/ws/chef/pom.xml,>
MavenProject: org.apache.jclouds.karaf.chef:core:1.6.1-incubating @ <https://jclouds.ci.cloudbees.com/job/jclouds-karaf-1.6.x-branch/ws/chef/core/pom.xml,>
MavenProject: org.apache.jclouds.karaf.chef:services:1.6.1-incubating @ <https://jclouds.ci.cloudbees.com/job/jclouds-karaf-1.6.x-branch/ws/chef/services/pom.xml,>
MavenProject: org.apache.jclouds.karaf.chef:commands:1.6.1-incubating @ <https://jclouds.ci.cloudbees.com/job/jclouds-karaf-1.6.x-branch/ws/chef/commands/pom.xml,>
MavenProject: org.apache.jclouds.karaf.chef:cache:1.6.1-incubating @ <https://jclouds.ci.cloudbees.com/job/jclouds-karaf-1.6.x-branch/ws/chef/cache/pom.xml,>
MavenProject: org.apache.jclouds.karaf:jclouds-karaf:1.6.1-incubating @ <https://jclouds.ci.cloudbees.com/job/jclouds-karaf-1.6.x-branch/ws/feature/pom.xml,>
MavenProject: org.apache.jclouds.karaf:itests:1.6.1-incubating @ <https://jclouds.ci.cloudbees.com/job/jclouds-karaf-1.6.x-branch/ws/itests/pom.xml]>
[JENKINS] Archiving <https://jclouds.ci.cloudbees.com/job/jclouds-karaf-1.6.x-branch/ws/utils/pom.xml>
to /home/jclouds/hudson_home/jobs/jclouds-karaf-1.6.x-branch/modules/org.apache.jclouds.karaf$utils/builds/2013-06-04_11-54-57/archive/org.apache.jclouds.karaf/utils/1.6.1-incubating/utils-1.6.1-incubating.pom
[JENKINS] Archiving <https://jclouds.ci.cloudbees.com/job/jclouds-karaf-1.6.x-branch/ws/cache/pom.xml>
to /home/jclouds/hudson_home/jobs/jclouds-karaf-1.6.x-branch/modules/org.apache.jclouds.karaf$cache/builds/2013-06-04_11-54-57/archive/org.apache.jclouds.karaf/cache/1.6.1-incubating/cache-1.6.1-incubating.pom
[JENKINS] Archiving <https://jclouds.ci.cloudbees.com/job/jclouds-karaf-1.6.x-branch/ws/chef/commands/pom.xml>
to /home/jclouds/hudson_home/jobs/jclouds-karaf-1.6.x-branch/modules/org.apache.jclouds.karaf.chef$commands/builds/2013-06-04_11-54-57/archive/org.apache.jclouds.karaf.chef/commands/1.6.1-incubating/commands-1.6.1-incubating.pom
[JENKINS] Archiving <https://jclouds.ci.cloudbees.com/job/jclouds-karaf-1.6.x-branch/ws/recipe/pom.xml>
to /home/jclouds/hudson_home/jobs/jclouds-karaf-1.6.x-branch/modules/org.apache.jclouds.karaf$recipe/builds/2013-06-04_11-54-57/archive/org.apache.jclouds.karaf/recipe/1.6.1-incubating/recipe-1.6.1-incubating.pom
[JENKINS] Archiving <https://jclouds.ci.cloudbees.com/job/jclouds-karaf-1.6.x-branch/ws/feature/pom.xml>
to /home/jclouds/hudson_home/jobs/jclouds-karaf-1.6.x-branch/modules/org.apache.jclouds.karaf$jclouds-karaf/builds/2013-06-04_11-54-57/archive/org.apache.jclouds.karaf/jclouds-karaf/1.6.1-incubating/jclouds-karaf-1.6.1-incubating.pom
[JENKINS] Archiving <https://jclouds.ci.cloudbees.com/job/jclouds-karaf-1.6.x-branch/ws/commands/pom.xml>
to /home/jclouds/hudson_home/jobs/jclouds-karaf-1.6.x-branch/modules/org.apache.jclouds.karaf$commands/builds/2013-06-04_11-54-57/archive/org.apache.jclouds.karaf/commands/1.6.1-incubating/commands-1.6.1-incubating.pom
[JENKINS] Archiving <https://jclouds.ci.cloudbees.com/job/jclouds-karaf-1.6.x-branch/ws/itests/pom.xml>
to /home/jclouds/hudson_home/jobs/jclouds-karaf-1.6.x-branch/modules/org.apache.jclouds.karaf$itests/builds/2013-06-04_11-54-57/archive/org.apache.jclouds.karaf/itests/1.6.1-incubating/itests-1.6.1-incubating.pom
[JENKINS] Archiving <https://jclouds.ci.cloudbees.com/job/jclouds-karaf-1.6.x-branch/ws/urlhandler/pom.xml>
to /home/jclouds/hudson_home/jobs/jclouds-karaf-1.6.x-branch/modules/org.apache.jclouds.karaf$urlhandler/builds/2013-06-04_11-54-57/archive/org.apache.jclouds.karaf/urlhandler/1.6.1-incubating/urlhandler-1.6.1-incubating.pom
[JENKINS] Archiving <https://jclouds.ci.cloudbees.com/job/jclouds-karaf-1.6.x-branch/ws/services/pom.xml>
to /home/jclouds/hudson_home/jobs/jclouds-karaf-1.6.x-branch/modules/org.apache.jclouds.karaf$services/builds/2013-06-04_11-54-57/archive/org.apache.jclouds.karaf/services/1.6.1-incubating/services-1.6.1-incubating.pom
[JENKINS] Archiving <https://jclouds.ci.cloudbees.com/job/jclouds-karaf-1.6.x-branch/ws/chef/core/pom.xml>
to /home/jclouds/hudson_home/jobs/jclouds-karaf-1.6.x-branch/modules/org.apache.jclouds.karaf.chef$core/builds/2013-06-04_11-54-57/archive/org.apache.jclouds.karaf.chef/core/1.6.1-incubating/core-1.6.1-incubating.pom
[JENKINS] Archiving <https://jclouds.ci.cloudbees.com/job/jclouds-karaf-1.6.x-branch/ws/chef/services/pom.xml>
to /home/jclouds/hudson_home/jobs/jclouds-karaf-1.6.x-branch/modules/org.apache.jclouds.karaf.chef$services/builds/2013-06-04_11-54-57/archive/org.apache.jclouds.karaf.chef/services/1.6.1-incubating/services-1.6.1-incubating.pom
[JENKINS] Archiving <https://jclouds.ci.cloudbees.com/job/jclouds-karaf-1.6.x-branch/ws/chef/pom.xml>
to /home/jclouds/hudson_home/jobs/jclouds-karaf-1.6.x-branch/modules/org.apache.jclouds.karaf$chef/builds/2013-06-04_11-54-57/archive/org.apache.jclouds.karaf/chef/1.6.1-incubating/chef-1.6.1-incubating.pom
[JENKINS] Archiving <https://jclouds.ci.cloudbees.com/job/jclouds-karaf-1.6.x-branch/ws/pom.xml>
to /home/jclouds/hudson_home/jobs/jclouds-karaf-1.6.x-branch/modules/org.apache.jclouds$jclouds-karaf/builds/2013-06-04_11-54-57/archive/org.apache.jclouds/jclouds-karaf/1.6.1-incubating/jclouds-karaf-1.6.1-incubating.pom
[JENKINS] Archiving <https://jclouds.ci.cloudbees.com/job/jclouds-karaf-1.6.x-branch/ws/core/pom.xml>
to /home/jclouds/hudson_home/jobs/jclouds-karaf-1.6.x-branch/modules/org.apache.jclouds.karaf$core/builds/2013-06-04_11-54-57/archive/org.apache.jclouds.karaf/core/1.6.1-incubating/core-1.6.1-incubating.pom
[JENKINS] Archiving <https://jclouds.ci.cloudbees.com/job/jclouds-karaf-1.6.x-branch/ws/chef/cache/pom.xml>
to /home/jclouds/hudson_home/jobs/jclouds-karaf-1.6.x-branch/modules/org.apache.jclouds.karaf.chef$cache/builds/2013-06-04_11-54-57/archive/org.apache.jclouds.karaf.chef/cache/1.6.1-incubating/cache-1.6.1-incubating.pom
[WARNING] The requested profile "doc" could not be activated because it does not exist.
[WARNING] The requested profile "src" could not be activated because it does not exist.
Waiting for Jenkins to finish collecting data
mavenExecutionResult exceptions not empty
message : Failed to execute goal org.apache.maven.plugins:maven-deploy-plugin:2.7:deploy (default-deploy)
on project jclouds-karaf: Failed to deploy artifacts: Could not transfer artifact org.apache.jclouds:jclouds-karaf:pom:1.6.1-incubating
from/to apache.releases.https (https://repository.apache.org/service/local/staging/deploy/maven2):
Failed to transfer file: https://repository.apache.org/service/local/staging/deploy/maven2/org/apache/jclouds/jclouds-karaf/1.6.1-incubating/jclouds-karaf-1.6.1-incubating.pom.
Return code is: 401
cause : Failed to deploy artifacts: Could not transfer artifact org.apache.jclouds:jclouds-karaf:pom:1.6.1-incubating
from/to apache.releases.https (https://repository.apache.org/service/local/staging/deploy/maven2):
Failed to transfer file: https://repository.apache.org/service/local/staging/deploy/maven2/org/apache/jclouds/jclouds-karaf/1.6.1-incubating/jclouds-karaf-1.6.1-incubating.pom.
Return code is: 401
Stack trace : 
org.apache.maven.lifecycle.LifecycleExecutionException: Failed to execute goal org.apache.maven.plugins:maven-deploy-plugin:2.7:deploy
(default-deploy) on project jclouds-karaf: Failed to deploy artifacts: Could not transfer
artifact org.apache.jclouds:jclouds-karaf:pom:1.6.1-incubating from/to apache.releases.https
(https://repository.apache.org/service/local/staging/deploy/maven2): Failed to transfer file:
https://repository.apache.org/service/local/staging/deploy/maven2/org/apache/jclouds/jclouds-karaf/1.6.1-incubating/jclouds-karaf-1.6.1-incubating.pom.
Return code is: 401
	at org.apache.maven.lifecycle.internal.MojoExecutor.execute(MojoExecutor.java:217)
	at org.apache.maven.lifecycle.internal.MojoExecutor.execute(MojoExecutor.java:153)
	at org.apache.maven.lifecycle.internal.MojoExecutor.execute(MojoExecutor.java:145)
	at org.apache.maven.lifecycle.internal.LifecycleModuleBuilder.buildProject(LifecycleModuleBuilder.java:84)
	at org.apache.maven.lifecycle.internal.LifecycleModuleBuilder.buildProject(LifecycleModuleBuilder.java:59)
	at org.apache.maven.lifecycle.internal.LifecycleStarter.singleThreadedBuild(LifecycleStarter.java:183)
	at org.apache.maven.lifecycle.internal.LifecycleStarter.execute(LifecycleStarter.java:161)
	at org.apache.maven.DefaultMaven.doExecute(DefaultMaven.java:319)
	at org.apache.maven.DefaultMaven.execute(DefaultMaven.java:156)
	at org.jvnet.hudson.maven3.launcher.Maven3Launcher.main(Maven3Launcher.java:79)
	at sun.reflect.NativeMethodAccessorImpl.invoke0(Native Method)
	at sun.reflect.NativeMethodAccessorImpl.invoke(NativeMethodAccessorImpl.java:39)
	at sun.reflect.DelegatingMethodAccessorImpl.invoke(DelegatingMethodAccessorImpl.java:25)
	at java.lang.reflect.Method.invoke(Method.java:597)
	at org.codehaus.plexus.classworlds.launcher.Launcher.launchStandard(Launcher.java:329)
	at org.codehaus.plexus.classworlds.launcher.Launcher.launch(Launcher.java:239)
	at org.jvnet.hudson.maven3.agent.Maven3Main.launch(Maven3Main.java:158)
	at hudson.maven.Maven3Builder.call(Maven3Builder.java:98)
	at hudson.maven.Maven3Builder.call(Maven3Builder.java:64)
	at hudson.remoting.UserRequest.perform(UserRequest.java:118)
	at hudson.remoting.UserRequest.perform(UserRequest.java:48)
	at hudson.remoting.Request$2.run(Request.java:326)
	at hudson.remoting.InterceptingExecutorService$1.call(InterceptingExecutorService.java:72)
	at java.util.concurrent.FutureTask$Sync.innerRun(FutureTask.java:303)
	at java.util.concurrent.FutureTask.run(FutureTask.java:138)
	at java.util.concurrent.ThreadPoolExecutor$Worker.runTask(ThreadPoolExecutor.java:895)
	at java.util.concurrent.ThreadPoolExecutor$Worker.run(ThreadPoolExecutor.java:918)
	at java.lang.Thread.run(Thread.java:662)
Caused by: org.apache.maven.plugin.MojoExecutionException: Failed to deploy artifacts: Could
not transfer artifact org.apache.jclouds:jclouds-karaf:pom:1.6.1-incubating from/to apache.releases.https
(https://repository.apache.org/service/local/staging/deploy/maven2): Failed to transfer file:
https://repository.apache.org/service/local/staging/deploy/maven2/org/apache/jclouds/jclouds-karaf/1.6.1-incubating/jclouds-karaf-1.6.1-incubating.pom.
Return code is: 401
	at org.apache.maven.plugin.deploy.DeployMojo.execute(DeployMojo.java:193)
	at org.apache.maven.plugin.DefaultBuildPluginManager.executeMojo(DefaultBuildPluginManager.java:101)
	at org.apache.maven.lifecycle.internal.MojoExecutor.execute(MojoExecutor.java:209)
	... 27 more
Caused by: org.apache.maven.artifact.deployer.ArtifactDeploymentException: Failed to deploy
artifacts: Could not transfer artifact org.apache.jclouds:jclouds-karaf:pom:1.6.1-incubating
from/to apache.releases.https (https://repository.apache.org/service/local/staging/deploy/maven2):
Failed to transfer file: https://repository.apache.org/service/local/staging/deploy/maven2/org/apache/jclouds/jclouds-karaf/1.6.1-incubating/jclouds-karaf-1.6.1-incubating.pom.
Return code is: 401
	at org.apache.maven.artifact.deployer.DefaultArtifactDeployer.deploy(DefaultArtifactDeployer.java:141)
	at org.apache.maven.plugin.deploy.AbstractDeployMojo.deploy(AbstractDeployMojo.java:167)
	at org.apache.maven.plugin.deploy.DeployMojo.execute(DeployMojo.java:149)
	... 29 more
Caused by: org.sonatype.aether.deployment.DeploymentException: Failed to deploy artifacts:
Could not transfer artifact org.apache.jclouds:jclouds-karaf:pom:1.6.1-incubating from/to
apache.releases.https (https://repository.apache.org/service/local/staging/deploy/maven2):
Failed to transfer file: https://repository.apache.org/service/local/staging/deploy/maven2/org/apache/jclouds/jclouds-karaf/1.6.1-incubating/jclouds-karaf-1.6.1-incubating.pom.
Return code is: 401
	at org.sonatype.aether.impl.internal.DefaultDeployer.deploy(DefaultDeployer.java:284)
	at org.sonatype.aether.impl.internal.DefaultDeployer.deploy(DefaultDeployer.java:215)
	at org.sonatype.aether.impl.internal.DefaultRepositorySystem.deploy(DefaultRepositorySystem.java:480)
	at org.apache.maven.artifact.deployer.DefaultArtifactDeployer.deploy(DefaultArtifactDeployer.java:137)
	... 31 more
Caused by: org.sonatype.aether.transfer.ArtifactTransferException: Could not transfer artifact
org.apache.jclouds:jclouds-karaf:pom:1.6.1-incubating from/to apache.releases.https (https://repository.apache.org/service/local/staging/deploy/maven2):
Failed to transfer file: https://repository.apache.org/service/local/staging/deploy/maven2/org/apache/jclouds/jclouds-karaf/1.6.1-incubating/jclouds-karaf-1.6.1-incubating.pom.
Return code is: 401
	at org.sonatype.aether.connector.wagon.WagonRepositoryConnector$4.wrap(WagonRepositoryConnector.java:949)
	at org.sonatype.aether.connector.wagon.WagonRepositoryConnector$4.wrap(WagonRepositoryConnector.java:940)
	at org.sonatype.aether.connector.wagon.WagonRepositoryConnector$PutTask.flush(WagonRepositoryConnector.java:864)
	at org.sonatype.aether.connector.wagon.WagonRepositoryConnector.put(WagonRepositoryConnector.java:466)
	at org.sonatype.aether.impl.internal.DefaultDeployer.deploy(DefaultDeployer.java:278)
	... 34 more
Caused by: org.apache.maven.wagon.TransferFailedException: Failed to transfer file: https://repository.apache.org/service/local/staging/deploy/maven2/org/apache/jclouds/jclouds-karaf/1.6.1-incubating/jclouds-karaf-1.6.1-incubating.pom.
Return code is: 401
	at org.apache.maven.wagon.providers.http.LightweightHttpWagon.finishPutTransfer(LightweightHttpWagon.java:205)
	at org.apache.maven.wagon.AbstractWagon.putTransfer(AbstractWagon.java:413)
	at org.apache.maven.wagon.AbstractWagon.transfer(AbstractWagon.java:392)
	at org.apache.maven.wagon.AbstractWagon.putTransfer(AbstractWagon.java:365)
	at org.apache.maven.wagon.StreamWagon.put(StreamWagon.java:163)
	at org.sonatype.aether.connector.wagon.WagonRepositoryConnector$PutTask.run(WagonRepositoryConnector.java:825)
	at org.sonatype.aether.connector.wagon.WagonRepositoryConnector.put(WagonRepositoryConnector.java:465)
	... 35 more
channel stopped

Mime
View raw message