jclouds-dev mailing list archives

Site index · List index
Message view « Date » · « Thread »
Top « Date » · « Thread »
From jenkins-no-re...@cloudbees.com
Subject Build failed in Jenkins: jclouds-cli-1.6.x-branch #23
Date Mon, 17 Jun 2013 02:50:39 GMT
See <https://jclouds.ci.cloudbees.com/job/jclouds-cli-1.6.x-branch/23/changes>

Changes:

[Andrew Bayer] Cleaning up lurking copyright issues/NOTICE txt

------------------------------------------
Started by an SCM change
Building remotely on s-054d4fb7 in workspace <https://jclouds.ci.cloudbees.com/job/jclouds-cli-1.6.x-branch/ws/>
Checkout:jclouds-cli-1.6.x-branch / <https://jclouds.ci.cloudbees.com/job/jclouds-cli-1.6.x-branch/ws/>
- hudson.remoting.Channel@316e0252:s-054d4fb7
Using strategy: Default
Last Built Revision: Revision adfe2e213bb0121d1faa6b7c135c092b70a93504 (origin/1.6.x)
Cloning the remote Git repository
Cloning repository https://git-wip-us.apache.org/repos/asf/incubator-jclouds-cli.git
git --version
git version 1.7.11.7
Fetching upstream changes from origin
Commencing build of Revision 4ed6947f2b7e6cf3daf23044353f77712fa4ab03 (origin/1.6.x)
Checking out Revision 4ed6947f2b7e6cf3daf23044353f77712fa4ab03 (origin/1.6.x)
Parsing POMs
Modules changed, recalculating dependency graph
[jclouds-cli-1.6.x-branch] $ /opt/jdk/jdk1.6.latest/bin/java -Xmx512m -Xloggc:gc.log -XX:MaxPermSize=128m
-XX:+UseParallelOldGC -cp /scratch/jenkins/maven3-agent.jar:/opt/maven/apache-maven-3.0.3/boot/plexus-classworlds-2.4.jar
org.jvnet.hudson.maven3.agent.Maven3Main /opt/maven/apache-maven-3.0.3 /scratch/jenkins/slave.jar
/scratch/jenkins/maven3-interceptor.jar 47528
<===[JENKINS REMOTING CAPACITY]===>   channel started
log4j:WARN No appenders could be found for logger (org.apache.commons.beanutils.converters.BooleanConverter).
log4j:WARN Please initialize the log4j system properly.
Executing Maven:  -B -f <https://jclouds.ci.cloudbees.com/job/jclouds-cli-1.6.x-branch/ws/pom.xml>
-s /private/jclouds/settings.xml clean deploy -e -U -Pdoc -Psrc
[INFO] Error stacktraces are turned on.
[INFO] Scanning for projects...
[INFO] ------------------------------------------------------------------------
[INFO] Reactor Build Order:
[INFO] 
[INFO] Apache jclouds :: cli
[INFO] jclouds :: cli :: branding
[INFO] jclouds :: cli :: runner
[INFO] jclouds :: cli :: assembly
Projects to build: [MavenProject: org.apache.jclouds.cli:jclouds-cli:1.6.1-incubating @ <https://jclouds.ci.cloudbees.com/job/jclouds-cli-1.6.x-branch/ws/pom.xml,>
MavenProject: org.apache.jclouds.cli:branding:1.6.1-incubating @ <https://jclouds.ci.cloudbees.com/job/jclouds-cli-1.6.x-branch/ws/branding/pom.xml,>
MavenProject: org.apache.jclouds.cli:runner:1.6.1-incubating @ <https://jclouds.ci.cloudbees.com/job/jclouds-cli-1.6.x-branch/ws/runner/pom.xml,>
MavenProject: org.apache.jclouds.cli:jclouds-cli-assembly:1.6.1-incubating @ <https://jclouds.ci.cloudbees.com/job/jclouds-cli-1.6.x-branch/ws/assembly/pom.xml]>
projectStarted org.apache.jclouds.cli:jclouds-cli:1.6.1-incubating
[INFO]                                                                         
[INFO] ------------------------------------------------------------------------
[INFO] Building Apache jclouds :: cli 1.6.1-incubating
[INFO] ------------------------------------------------------------------------
mojoStarted org.apache.maven.plugins:maven-clean-plugin:2.5(default-clean)
[INFO] 
[INFO] --- maven-clean-plugin:2.5:clean (default-clean) @ jclouds-cli ---
mojoSucceeded org.apache.maven.plugins:maven-clean-plugin:2.5(default-clean)
mojoStarted org.apache.maven.plugins:maven-remote-resources-plugin:1.4(default)
[INFO] 
[INFO] --- maven-remote-resources-plugin:1.4:process (default) @ jclouds-cli ---
mojoSucceeded org.apache.maven.plugins:maven-remote-resources-plugin:1.4(default)
mojoStarted org.apache.felix:maven-bundle-plugin:2.1.0(bundle-manifest)
[INFO] 
[INFO] --- maven-bundle-plugin:2.1.0:manifest (bundle-manifest) @ jclouds-cli ---
[WARNING] Ignoring project type pom - supportedProjectTypes = [jar, war, bundle]
mojoSucceeded org.apache.felix:maven-bundle-plugin:2.1.0(bundle-manifest)
mojoStarted org.apache.maven.plugins:maven-site-plugin:3.2(attach-descriptor)
[INFO] 
[INFO] --- maven-site-plugin:3.2:attach-descriptor (attach-descriptor) @ jclouds-cli ---
mojoSucceeded org.apache.maven.plugins:maven-site-plugin:3.2(attach-descriptor)
mojoStarted org.apache.rat:apache-rat-plugin:0.8(default)
[INFO] 
[INFO] --- apache-rat-plugin:0.8:check (default) @ jclouds-cli ---
[INFO] Exclude: **/LICENSE.txt
[INFO] Exclude: **/header.txt
[INFO] Exclude: **/NOTICE.txt
[INFO] Exclude: **/DISCLAIMER
[INFO] Exclude: **/BUILD.txt
[INFO] Exclude: **/CHANGES.txt
[INFO] Exclude: **/README.md
[INFO] Exclude: **/README.txt
[INFO] Exclude: **/DEPENDENCIES
[INFO] Exclude: .git/**
[INFO] Exclude: **/.gitignore
[INFO] Exclude: **/*.json
[INFO] Exclude: **/*.log*
[INFO] Exclude: **/TODO
[INFO] Exclude: .mailmap
[INFO] Exclude: .idea/**
[INFO] Exclude: **/*.iml
[INFO] Exclude: **/.project
[INFO] Exclude: **/.classpath
[INFO] Exclude: **/.settings/**
[INFO] Exclude: **/.checkstyle
[INFO] Exclude: **/target/**
[INFO] Exclude: .repository/**
mojoSucceeded org.apache.rat:apache-rat-plugin:0.8(default)
mojoStarted org.apache.maven.plugins:maven-install-plugin:2.3.1(default-install)
[INFO] 
[INFO] --- maven-install-plugin:2.3.1:install (default-install) @ jclouds-cli ---
[INFO] Installing <https://jclouds.ci.cloudbees.com/job/jclouds-cli-1.6.x-branch/ws/pom.xml>
to /home/jenkins/.m2/repository/org/apache/jclouds/cli/jclouds-cli/1.6.1-incubating/jclouds-cli-1.6.1-incubating.pom
mojoSucceeded org.apache.maven.plugins:maven-install-plugin:2.3.1(default-install)
mojoStarted org.apache.maven.plugins:maven-deploy-plugin:2.7(default-deploy)
[INFO] 
[INFO] --- maven-deploy-plugin:2.7:deploy (default-deploy) @ jclouds-cli ---
Uploading: https://repository.apache.org/service/local/staging/deploy/maven2/org/apache/jclouds/cli/jclouds-cli/1.6.1-incubating/jclouds-cli-1.6.1-incubating.pom
mojoFailed org.apache.maven.plugins:maven-deploy-plugin:2.7(default-deploy)
projectFailed org.apache.jclouds.cli:jclouds-cli:1.6.1-incubating
sessionEnded
[INFO] ------------------------------------------------------------------------
[INFO] Reactor Summary:
[INFO] 
[INFO] Apache jclouds :: cli ............................. FAILURE [24.672s]
[INFO] jclouds :: cli :: branding ........................ SKIPPED
[INFO] jclouds :: cli :: runner .......................... SKIPPED
[INFO] jclouds :: cli :: assembly ........................ SKIPPED
[INFO] ------------------------------------------------------------------------
[INFO] BUILD FAILURE
[INFO] ------------------------------------------------------------------------
[INFO] Total time: 30.868s
[INFO] Finished at: Sun Jun 16 22:50:32 EDT 2013
[Unloading class GregorSamsa$0]
[Unloading class GregorSamsa$1]
[Unloading class GregorSamsa$2]
[Unloading class GregorSamsa]
[INFO] Final Memory: 15M/123M
[INFO] ------------------------------------------------------------------------
Projects to build: [MavenProject: org.apache.jclouds.cli:jclouds-cli:1.6.1-incubating @ <https://jclouds.ci.cloudbees.com/job/jclouds-cli-1.6.x-branch/ws/pom.xml,>
MavenProject: org.apache.jclouds.cli:branding:1.6.1-incubating @ <https://jclouds.ci.cloudbees.com/job/jclouds-cli-1.6.x-branch/ws/branding/pom.xml,>
MavenProject: org.apache.jclouds.cli:runner:1.6.1-incubating @ <https://jclouds.ci.cloudbees.com/job/jclouds-cli-1.6.x-branch/ws/runner/pom.xml,>
MavenProject: org.apache.jclouds.cli:jclouds-cli-assembly:1.6.1-incubating @ <https://jclouds.ci.cloudbees.com/job/jclouds-cli-1.6.x-branch/ws/assembly/pom.xml]>
[JENKINS] Archiving <https://jclouds.ci.cloudbees.com/job/jclouds-cli-1.6.x-branch/ws/runner/pom.xml>
to /home/jclouds/hudson_home/jobs/jclouds-cli-1.6.x-branch/modules/org.apache.jclouds.cli$runner/builds/2013-06-16_22-49-41/archive/org.apache.jclouds.cli/runner/1.6.1-incubating/runner-1.6.1-incubating.pom
[JENKINS] Archiving <https://jclouds.ci.cloudbees.com/job/jclouds-cli-1.6.x-branch/ws/assembly/pom.xml>
to /home/jclouds/hudson_home/jobs/jclouds-cli-1.6.x-branch/modules/org.apache.jclouds.cli$jclouds-cli-assembly/builds/2013-06-16_22-49-41/archive/org.apache.jclouds.cli/jclouds-cli-assembly/1.6.1-incubating/jclouds-cli-assembly-1.6.1-incubating.pom
[JENKINS] Archiving <https://jclouds.ci.cloudbees.com/job/jclouds-cli-1.6.x-branch/ws/branding/pom.xml>
to /home/jclouds/hudson_home/jobs/jclouds-cli-1.6.x-branch/modules/org.apache.jclouds.cli$branding/builds/2013-06-16_22-49-41/archive/org.apache.jclouds.cli/branding/1.6.1-incubating/branding-1.6.1-incubating.pom
[JENKINS] Archiving <https://jclouds.ci.cloudbees.com/job/jclouds-cli-1.6.x-branch/ws/pom.xml>
to /home/jclouds/hudson_home/jobs/jclouds-cli-1.6.x-branch/modules/org.apache.jclouds.cli$jclouds-cli/builds/2013-06-16_22-49-41/archive/org.apache.jclouds.cli/jclouds-cli/1.6.1-incubating/jclouds-cli-1.6.1-incubating.pom
[WARNING] The requested profile "doc" could not be activated because it does not exist.
[WARNING] The requested profile "src" could not be activated because it does not exist.
Waiting for Jenkins to finish collecting data
mavenExecutionResult exceptions not empty
message : Failed to execute goal org.apache.maven.plugins:maven-deploy-plugin:2.7:deploy (default-deploy)
on project jclouds-cli: Failed to deploy artifacts: Could not transfer artifact org.apache.jclouds.cli:jclouds-cli:pom:1.6.1-incubating
from/to apache.releases.https (https://repository.apache.org/service/local/staging/deploy/maven2):
Failed to transfer file: https://repository.apache.org/service/local/staging/deploy/maven2/org/apache/jclouds/cli/jclouds-cli/1.6.1-incubating/jclouds-cli-1.6.1-incubating.pom.
Return code is: 401
cause : Failed to deploy artifacts: Could not transfer artifact org.apache.jclouds.cli:jclouds-cli:pom:1.6.1-incubating
from/to apache.releases.https (https://repository.apache.org/service/local/staging/deploy/maven2):
Failed to transfer file: https://repository.apache.org/service/local/staging/deploy/maven2/org/apache/jclouds/cli/jclouds-cli/1.6.1-incubating/jclouds-cli-1.6.1-incubating.pom.
Return code is: 401
Stack trace : 
org.apache.maven.lifecycle.LifecycleExecutionException: Failed to execute goal org.apache.maven.plugins:maven-deploy-plugin:2.7:deploy
(default-deploy) on project jclouds-cli: Failed to deploy artifacts: Could not transfer artifact
org.apache.jclouds.cli:jclouds-cli:pom:1.6.1-incubating from/to apache.releases.https (https://repository.apache.org/service/local/staging/deploy/maven2):
Failed to transfer file: https://repository.apache.org/service/local/staging/deploy/maven2/org/apache/jclouds/cli/jclouds-cli/1.6.1-incubating/jclouds-cli-1.6.1-incubating.pom.
Return code is: 401
	at org.apache.maven.lifecycle.internal.MojoExecutor.execute(MojoExecutor.java:217)
	at org.apache.maven.lifecycle.internal.MojoExecutor.execute(MojoExecutor.java:153)
	at org.apache.maven.lifecycle.internal.MojoExecutor.execute(MojoExecutor.java:145)
	at org.apache.maven.lifecycle.internal.LifecycleModuleBuilder.buildProject(LifecycleModuleBuilder.java:84)
	at org.apache.maven.lifecycle.internal.LifecycleModuleBuilder.buildProject(LifecycleModuleBuilder.java:59)
	at org.apache.maven.lifecycle.internal.LifecycleStarter.singleThreadedBuild(LifecycleStarter.java:183)
	at org.apache.maven.lifecycle.internal.LifecycleStarter.execute(LifecycleStarter.java:161)
	at org.apache.maven.DefaultMaven.doExecute(DefaultMaven.java:319)
	at org.apache.maven.DefaultMaven.execute(DefaultMaven.java:156)
	at org.jvnet.hudson.maven3.launcher.Maven3Launcher.main(Maven3Launcher.java:79)
	at sun.reflect.NativeMethodAccessorImpl.invoke0(Native Method)
	at sun.reflect.NativeMethodAccessorImpl.invoke(NativeMethodAccessorImpl.java:39)
	at sun.reflect.DelegatingMethodAccessorImpl.invoke(DelegatingMethodAccessorImpl.java:25)
	at java.lang.reflect.Method.invoke(Method.java:597)
	at org.codehaus.plexus.classworlds.launcher.Launcher.launchStandard(Launcher.java:329)
	at org.codehaus.plexus.classworlds.launcher.Launcher.launch(Launcher.java:239)
	at org.jvnet.hudson.maven3.agent.Maven3Main.launch(Maven3Main.java:158)
	at hudson.maven.Maven3Builder.call(Maven3Builder.java:98)
	at hudson.maven.Maven3Builder.call(Maven3Builder.java:64)
	at hudson.remoting.UserRequest.perform(UserRequest.java:118)
	at hudson.remoting.UserRequest.perform(UserRequest.java:48)
	at hudson.remoting.Request$2.run(Request.java:326)
	at hudson.remoting.InterceptingExecutorService$1.call(InterceptingExecutorService.java:72)
	at java.util.concurrent.FutureTask$Sync.innerRun(FutureTask.java:303)
	at java.util.concurrent.FutureTask.run(FutureTask.java:138)
	at java.util.concurrent.ThreadPoolExecutor$Worker.runTask(ThreadPoolExecutor.java:895)
	at java.util.concurrent.ThreadPoolExecutor$Worker.run(ThreadPoolExecutor.java:918)
	at java.lang.Thread.run(Thread.java:662)
Caused by: org.apache.maven.plugin.MojoExecutionException: Failed to deploy artifacts: Could
not transfer artifact org.apache.jclouds.cli:jclouds-cli:pom:1.6.1-incubating from/to apache.releases.https
(https://repository.apache.org/service/local/staging/deploy/maven2): Failed to transfer file:
https://repository.apache.org/service/local/staging/deploy/maven2/org/apache/jclouds/cli/jclouds-cli/1.6.1-incubating/jclouds-cli-1.6.1-incubating.pom.
Return code is: 401
	at org.apache.maven.plugin.deploy.DeployMojo.execute(DeployMojo.java:193)
	at org.apache.maven.plugin.DefaultBuildPluginManager.executeMojo(DefaultBuildPluginManager.java:101)
	at org.apache.maven.lifecycle.internal.MojoExecutor.execute(MojoExecutor.java:209)
	... 27 more
Caused by: org.apache.maven.artifact.deployer.ArtifactDeploymentException: Failed to deploy
artifacts: Could not transfer artifact org.apache.jclouds.cli:jclouds-cli:pom:1.6.1-incubating
from/to apache.releases.https (https://repository.apache.org/service/local/staging/deploy/maven2):
Failed to transfer file: https://repository.apache.org/service/local/staging/deploy/maven2/org/apache/jclouds/cli/jclouds-cli/1.6.1-incubating/jclouds-cli-1.6.1-incubating.pom.
Return code is: 401
	at org.apache.maven.artifact.deployer.DefaultArtifactDeployer.deploy(DefaultArtifactDeployer.java:141)
	at org.apache.maven.plugin.deploy.AbstractDeployMojo.deploy(AbstractDeployMojo.java:167)
	at org.apache.maven.plugin.deploy.DeployMojo.execute(DeployMojo.java:149)
	... 29 more
Caused by: org.sonatype.aether.deployment.DeploymentException: Failed to deploy artifacts:
Could not transfer artifact org.apache.jclouds.cli:jclouds-cli:pom:1.6.1-incubating from/to
apache.releases.https (https://repository.apache.org/service/local/staging/deploy/maven2):
Failed to transfer file: https://repository.apache.org/service/local/staging/deploy/maven2/org/apache/jclouds/cli/jclouds-cli/1.6.1-incubating/jclouds-cli-1.6.1-incubating.pom.
Return code is: 401
	at org.sonatype.aether.impl.internal.DefaultDeployer.deploy(DefaultDeployer.java:284)
	at org.sonatype.aether.impl.internal.DefaultDeployer.deploy(DefaultDeployer.java:215)
	at org.sonatype.aether.impl.internal.DefaultRepositorySystem.deploy(DefaultRepositorySystem.java:480)
	at org.apache.maven.artifact.deployer.DefaultArtifactDeployer.deploy(DefaultArtifactDeployer.java:137)
	... 31 more
Caused by: org.sonatype.aether.transfer.ArtifactTransferException: Could not transfer artifact
org.apache.jclouds.cli:jclouds-cli:pom:1.6.1-incubating from/to apache.releases.https (https://repository.apache.org/service/local/staging/deploy/maven2):
Failed to transfer file: https://repository.apache.org/service/local/staging/deploy/maven2/org/apache/jclouds/cli/jclouds-cli/1.6.1-incubating/jclouds-cli-1.6.1-incubating.pom.
Return code is: 401
	at org.sonatype.aether.connector.wagon.WagonRepositoryConnector$4.wrap(WagonRepositoryConnector.java:949)
	at org.sonatype.aether.connector.wagon.WagonRepositoryConnector$4.wrap(WagonRepositoryConnector.java:940)
	at org.sonatype.aether.connector.wagon.WagonRepositoryConnector$PutTask.flush(WagonRepositoryConnector.java:864)
	at org.sonatype.aether.connector.wagon.WagonRepositoryConnector.put(WagonRepositoryConnector.java:466)
	at org.sonatype.aether.impl.internal.DefaultDeployer.deploy(DefaultDeployer.java:278)
	... 34 more
Caused by: org.apache.maven.wagon.TransferFailedException: Failed to transfer file: https://repository.apache.org/service/local/staging/deploy/maven2/org/apache/jclouds/cli/jclouds-cli/1.6.1-incubating/jclouds-cli-1.6.1-incubating.pom.
Return code is: 401
	at org.apache.maven.wagon.providers.http.LightweightHttpWagon.finishPutTransfer(LightweightHttpWagon.java:205)
	at org.apache.maven.wagon.AbstractWagon.putTransfer(AbstractWagon.java:413)
	at org.apache.maven.wagon.AbstractWagon.transfer(AbstractWagon.java:392)
	at org.apache.maven.wagon.AbstractWagon.putTransfer(AbstractWagon.java:365)
	at org.apache.maven.wagon.StreamWagon.put(StreamWagon.java:163)
	at org.sonatype.aether.connector.wagon.WagonRepositoryConnector$PutTask.run(WagonRepositoryConnector.java:825)
	at org.sonatype.aether.connector.wagon.WagonRepositoryConnector.put(WagonRepositoryConnector.java:465)
	... 35 more
channel stopped

Mime
View raw message