jclouds-dev mailing list archives

Site index · List index
Message view « Date » · « Thread »
Top « Date » · « Thread »
From jenkins-no-re...@cloudbees.com
Subject Build failed in Jenkins: jclouds-labs #144
Date Mon, 17 Jun 2013 02:58:49 GMT
See <https://jclouds.ci.cloudbees.com/job/jclouds-labs/144/changes>

Changes:

[Andrew Bayer] Cleaning up lurking copyright issues/NOTICE txt

------------------------------------------
[...truncated 6604 lines...]
Downloaded: http://repository.apache.org/snapshots/org/apache/jclouds/labs/representations/representations-core/1.7.0-SNAPSHOT/maven-metadata.xml
(2 KB at 7.3 KB/sec)
Downloaded: https://repository.apache.org/content/repositories/snapshots/org/apache/jclouds/labs/representations/representations-core/1.7.0-SNAPSHOT/maven-metadata.xml
(2 KB at 2.6 KB/sec)
Downloading: https://repository-jclouds.forge.cloudbees.com/snapshot/org/apache/jclouds/labs/management/management-core/1.7.0-SNAPSHOT/maven-metadata.xml
Downloading: https://oss.sonatype.org/content/repositories/snapshots/org/apache/jclouds/labs/management/management-core/1.7.0-SNAPSHOT/maven-metadata.xml
Downloading: https://repository.apache.org/content/repositories/snapshots/org/apache/jclouds/labs/management/management-core/1.7.0-SNAPSHOT/maven-metadata.xml
Downloading: http://repository.apache.org/snapshots/org/apache/jclouds/labs/management/management-core/1.7.0-SNAPSHOT/maven-metadata.xml
Downloaded: https://repository-jclouds.forge.cloudbees.com/snapshot/org/apache/jclouds/labs/management/management-core/1.7.0-SNAPSHOT/maven-metadata.xml
(2 KB at 128.3 KB/sec)
Downloaded: http://repository.apache.org/snapshots/org/apache/jclouds/labs/management/management-core/1.7.0-SNAPSHOT/maven-metadata.xml
(2 KB at 7.1 KB/sec)
Downloaded: https://repository.apache.org/content/repositories/snapshots/org/apache/jclouds/labs/management/management-core/1.7.0-SNAPSHOT/maven-metadata.xml
(2 KB at 1.9 KB/sec)
mojoStarted org.apache.maven.plugins:maven-javadoc-plugin:2.9(javadoc)
[INFO] 
[INFO] --- maven-javadoc-plugin:2.9:aggregate-jar (javadoc) @ dmtf ---
mojoSucceeded org.apache.maven.plugins:maven-javadoc-plugin:2.9(javadoc)
mojoStarted org.apache.maven.plugins:maven-javadoc-plugin:2.9(javadoc)
[INFO] 
[INFO] --- maven-javadoc-plugin:2.9:jar (javadoc) @ dmtf ---
[INFO] 
10 warnings
[WARNING] Javadoc Warnings
[WARNING] <https://jclouds.ci.cloudbees.com/job/jclouds-labs/ws/dmtf/src/main/java/org/jclouds/dmtf/cim/CimReference.java>:70:
warning - Tag @link: reference not found: Element
[WARNING] <https://jclouds.ci.cloudbees.com/job/jclouds-labs/ws/dmtf/src/main/java/org/jclouds/dmtf/cim/ResourceAllocationSettingData.java>:137:
warning - Tag @see: can't find getInstanceId() in org.jclouds.dmtf.cim.ResourceAllocationSettingData
[WARNING] <https://jclouds.ci.cloudbees.com/job/jclouds-labs/ws/dmtf/src/main/java/org/jclouds/dmtf/cim/VirtualSystemSettingData.java>:86:
warning - Missing closing '}' character for inline tag: "{@link ConcreteComponent).
[WARNING] <p>
[WARNING] Virtual system configurations may for example be used to reflect configurations
of:
[WARNING] <ul>
[WARNING] <li>virtual systems that are defined at a virtualization platform
[WARNING] <li>virtual systems that are currently active
[WARNING] <li>input requests to create new virtual systems
[WARNING] <li>input requests to modify existing virtual systems
[WARNING] <li>snapshots of virtual systems
[WARNING] </ul>"
[WARNING] <https://jclouds.ci.cloudbees.com/job/jclouds-labs/ws/dmtf/src/main/java/org/jclouds/dmtf/ovf/DiskSection.java>:106:
warning - @return tag has no arguments.
[WARNING] <https://jclouds.ci.cloudbees.com/job/jclouds-labs/ws/dmtf/src/main/java/org/jclouds/dmtf/ovf/OperatingSystemSection.java>:115:
warning - Tag @see: reference not found: org.jclouds.vcloud.director.v1_5.domain.cim.OSType#getCode()
[WARNING] <https://jclouds.ci.cloudbees.com/job/jclouds-labs/ws/dmtf/src/main/java/org/jclouds/dmtf/ovf/ProductSection.java>:102:
warning - Tag @see: can't find geFullVersion() in org.jclouds.dmtf.ovf.ProductSection
[WARNING] <https://jclouds.ci.cloudbees.com/job/jclouds-labs/ws/dmtf/src/main/java/org/jclouds/dmtf/ovf/StartupSection.java>:70:
warning - Tag @see: can't find getItem() in org.jclouds.dmtf.ovf.StartupSection
[WARNING] <https://jclouds.ci.cloudbees.com/job/jclouds-labs/ws/dmtf/src/main/java/org/jclouds/dmtf/ovf/StartupSection.java>:62:
warning - Tag @see: can't find getItem() in org.jclouds.dmtf.ovf.StartupSection
[WARNING] <https://jclouds.ci.cloudbees.com/job/jclouds-labs/ws/dmtf/src/main/java/org/jclouds/dmtf/ovf/VirtualHardwareSection.java>:166:
warning - @return tag has no arguments.
[WARNING] <https://jclouds.ci.cloudbees.com/job/jclouds-labs/ws/dmtf/src/main/java/org/jclouds/dmtf/CIMPredicates.java>:42:
warning - @param argument "type" is not a parameter name.
[INFO] Building jar: <https://jclouds.ci.cloudbees.com/job/jclouds-labs/ws/dmtf/target/dmtf-1.7.0-SNAPSHOT-javadoc.jar>
mojoSucceeded org.apache.maven.plugins:maven-javadoc-plugin:2.9(javadoc)
mojoStarted org.apache.maven.plugins:maven-source-plugin:2.2(attach-sources)
[INFO] 
[INFO] --- maven-source-plugin:2.2:jar-no-fork (attach-sources) @ dmtf ---
[INFO] Building jar: <https://jclouds.ci.cloudbees.com/job/jclouds-labs/ws/dmtf/target/dmtf-1.7.0-SNAPSHOT-sources.jar>
mojoSucceeded org.apache.maven.plugins:maven-source-plugin:2.2(attach-sources)
mojoStarted org.apache.maven.plugins:maven-surefire-plugin:2.12.4(integration)
[INFO] 
[INFO] --- maven-surefire-plugin:2.12.4:test (integration) @ dmtf ---
mojoSucceeded org.apache.maven.plugins:maven-surefire-plugin:2.12.4(integration)
[JENKINS] Recording test results[INFO] Checking compile classpath

mojoStarted com.ning.maven.plugins:maven-duplicate-finder-plugin:1.0.3(default)
[INFO] 
[INFO] --- maven-duplicate-finder-plugin:1.0.3:check (default) @ dmtf ---
[Unloading class GregorSamsa$1]
[Unloading class GregorSamsa$1]
[Unloading class GregorSamsa$2]
[Unloading class GregorSamsa]
[Unloading class GregorSamsa$1]
[Unloading class GregorSamsa$1]
[Unloading class GregorSamsa]
[Unloading class GregorSamsa$0]
[Unloading class GregorSamsa$0]
[Unloading class GregorSamsa]
[Unloading class GregorSamsa]
[Unloading class GregorSamsa]
[Unloading class GregorSamsa]
[Unloading class GregorSamsa$2]
[Unloading class GregorSamsa$1]
[Unloading class GregorSamsa$0]
[Unloading class GregorSamsa$0]
[Unloading class GregorSamsa$0]
[Unloading class GregorSamsa$0]
[Unloading class GregorSamsa$0]
[Unloading class GregorSamsa]
[Unloading class GregorSamsa$2]
[Unloading class GregorSamsa$0]
[Unloading class GregorSamsa$0]
[Unloading class GregorSamsa]
[Unloading class GregorSamsa]
[INFO] Checking runtime classpath
[INFO] Checking test classpath
mojoSucceeded com.ning.maven.plugins:maven-duplicate-finder-plugin:1.0.3(default)
mojoStarted org.apache.maven.plugins:maven-install-plugin:2.4(default-install)[INFO] Installing
<https://jclouds.ci.cloudbees.com/job/jclouds-labs/ws/dmtf/target/dmtf-1.7.0-SNAPSHOT.jar>
to <https://jclouds.ci.cloudbees.com/job/jclouds-labs/ws/.repository/org/apache/jclouds/labs/dmtf/1.7.0-SNAPSHOT/dmtf-1.7.0-SNAPSHOT.jar>
[INFO] Installing <https://jclouds.ci.cloudbees.com/job/jclouds-labs/ws/dmtf/pom.xml>
to <https://jclouds.ci.cloudbees.com/job/jclouds-labs/ws/.repository/org/apache/jclouds/labs/dmtf/1.7.0-SNAPSHOT/dmtf-1.7.0-SNAPSHOT.pom>
[INFO] Installing <https://jclouds.ci.cloudbees.com/job/jclouds-labs/ws/dmtf/target/dmtf-1.7.0-SNAPSHOT-tests.jar>
to <https://jclouds.ci.cloudbees.com/job/jclouds-labs/ws/.repository/org/apache/jclouds/labs/dmtf/1.7.0-SNAPSHOT/dmtf-1.7.0-SNAPSHOT-tests.jar>
[INFO] Installing <https://jclouds.ci.cloudbees.com/job/jclouds-labs/ws/dmtf/target/dmtf-1.7.0-SNAPSHOT-javadoc.jar>
to <https://jclouds.ci.cloudbees.com/job/jclouds-labs/ws/.repository/org/apache/jclouds/labs/dmtf/1.7.0-SNAPSHOT/dmtf-1.7.0-SNAPSHOT-javadoc.jar>

[INFO] 
[INFO] --- maven-install-plugin:2.4:install (default-install) @ dmtf ---
[INFO] Installing <https://jclouds.ci.cloudbees.com/job/jclouds-labs/ws/dmtf/target/dmtf-1.7.0-SNAPSHOT-sources.jar>
to <https://jclouds.ci.cloudbees.com/job/jclouds-labs/ws/.repository/org/apache/jclouds/labs/dmtf/1.7.0-SNAPSHOT/dmtf-1.7.0-SNAPSHOT-sources.jar>
mojoSucceeded org.apache.maven.plugins:maven-install-plugin:2.4(default-install)
mojoStarted org.apache.felix:maven-bundle-plugin:2.3.7(default-install)[INFO] Local OBR update
disabled (enable with -DobrRepository)

[INFO] 
[INFO] --- maven-bundle-plugin:2.3.7:install (default-install) @ dmtf ---
mojoSucceeded org.apache.felix:maven-bundle-plugin:2.3.7(default-install)
Downloading: https://repository.apache.org/content/repositories/snapshots/org/apache/jclouds/labs/dmtf/1.7.0-SNAPSHOT/maven-metadata.xml
mojoStarted org.apache.maven.plugins:maven-deploy-plugin:2.7(default-deploy)
[INFO] 
[INFO] --- maven-deploy-plugin:2.7:deploy (default-deploy) @ dmtf ---
mojoFailed org.apache.maven.plugins:maven-deploy-plugin:2.7(default-deploy)[WARNING] Could
not transfer metadata org.apache.jclouds.labs:dmtf:1.7.0-SNAPSHOT/maven-metadata.xml from/to
apache.snapshots.https (https://repository.apache.org/content/repositories/snapshots): Error
transferring file: Server returned HTTP response code: 502 for URL: https://repository.apache.org/content/repositories/snapshots/org/apache/jclouds/labs/dmtf/1.7.0-SNAPSHOT/maven-metadata.xml

projectFailed org.apache.jclouds.labs:dmtf:1.7.0-SNAPSHOT
sessionEnded
[INFO] ------------------------------------------------------------------------
[INFO] Reactor Summary:
[INFO] 
[INFO] Apache jclouds labs ............................... SUCCESS [3:29.582s]
[INFO] jcloud virtualbox api ............................. SUCCESS [1:50.598s]
[INFO] jclouds dmtf domain objects ....................... FAILURE [44.676s]
[INFO] jclouds vcloud-director api ....................... SKIPPED
[INFO] jcloud cdmi api ................................... SKIPPED
[INFO] jcloud joyent-cloudapi api ........................ SKIPPED
[INFO] jcloud joyentcloud provider ....................... SKIPPED
[INFO] jclouds Fujitsu Global Cloud Platform ............. SKIPPED
[INFO] jclouds Fujitsu Global Cloud Platform AU provider . SKIPPED
[INFO] jclouds Fujitsu Global Cloud Platform DE provider . SKIPPED
[INFO] jclouds Abiquo api ................................ SKIPPED
[INFO] jclouds :: represetations ......................... SKIPPED
[INFO] jclouds :: representations :: core ................ SKIPPED
[INFO] jclouds :: representations :: codec ............... SKIPPED
[INFO] jclouds :: management ............................. SKIPPED
[INFO] jclouds :: management :: core ..................... SKIPPED
[INFO] jclouds :: management :: compute .................. SKIPPED
[INFO] jclouds :: management :: blobstore ................ SKIPPED
[INFO] ------------------------------------------------------------------------
[INFO] BUILD FAILURE
[INFO] ------------------------------------------------------------------------
[INFO] Total time: 6:22.267s
[INFO] Finished at: Sun Jun 16 22:58:02 EDT 2013
[INFO] Final Memory: 35M/193M
[INFO] ------------------------------------------------------------------------
Projects to build: [MavenProject: org.apache.jclouds.labs:jclouds-labs:1.7.0-SNAPSHOT @ <https://jclouds.ci.cloudbees.com/job/jclouds-labs/ws/pom.xml,>
MavenProject: org.apache.jclouds.labs:virtualbox:1.7.0-SNAPSHOT @ <https://jclouds.ci.cloudbees.com/job/jclouds-labs/ws/virtualbox/pom.xml,>
MavenProject: org.apache.jclouds.labs:dmtf:1.7.0-SNAPSHOT @ <https://jclouds.ci.cloudbees.com/job/jclouds-labs/ws/dmtf/pom.xml,>
MavenProject: org.apache.jclouds.labs:vcloud-director:1.7.0-SNAPSHOT @ <https://jclouds.ci.cloudbees.com/job/jclouds-labs/ws/vcloud-director/pom.xml,>
MavenProject: org.apache.jclouds.labs:cdmi:1.7.0-SNAPSHOT @ <https://jclouds.ci.cloudbees.com/job/jclouds-labs/ws/cdmi/pom.xml,>
MavenProject: org.apache.jclouds.labs:joyent-cloudapi:1.7.0-SNAPSHOT @ <https://jclouds.ci.cloudbees.com/job/jclouds-labs/ws/joyent-cloudapi/pom.xml,>
MavenProject: org.apache.jclouds.labs:joyentcloud:1.7.0-SNAPSHOT @ <https://jclouds.ci.cloudbees.com/job/jclouds-labs/ws/joyentcloud/pom.xml,>
MavenProject: org.apache.jclouds.labs:fgcp:1.7.0-SNAPSHOT @ <https://jclouds.ci.cloudbees.com/job/jclouds-labs/ws/fgcp/pom.xml,>
MavenProject: org.apache.jclouds.labs:fgcp-au:1.7.0-SNAPSHOT @ <https://jclouds.ci.cloudbees.com/job/jclouds-labs/ws/fgcp-au/pom.xml,>
MavenProject: org.apache.jclouds.labs:fgcp-de:1.7.0-SNAPSHOT @ <https://jclouds.ci.cloudbees.com/job/jclouds-labs/ws/fgcp-de/pom.xml,>
MavenProject: org.apache.jclouds.labs:abiquo:1.7.0-SNAPSHOT @ <https://jclouds.ci.cloudbees.com/job/jclouds-labs/ws/abiquo/pom.xml,>
MavenProject: org.apache.jclouds.labs:jclouds-represetations:1.7.0-SNAPSHOT @ <https://jclouds.ci.cloudbees.com/job/jclouds-labs/ws/jclouds-representations/pom.xml,>
MavenProject: org.apache.jclouds.labs.representations:representations-core:1.7.0-SNAPSHOT
@ <https://jclouds.ci.cloudbees.com/job/jclouds-labs/ws/jclouds-representations/representations-core/pom.xml,>
MavenProject: org.apache.jclouds.labs.representations:representations-codec:1.7.0-SNAPSHOT
@ <https://jclouds.ci.cloudbees.com/job/jclouds-labs/ws/jclouds-representations/representations-codec/pom.xml,>
MavenProject: org.apache.jclouds.labs:jclouds-management:1.7.0-SNAPSHOT @ <https://jclouds.ci.cloudbees.com/job/jclouds-labs/ws/jclouds-management/pom.xml,>
MavenProject: org.apache.jclouds.labs.management:management-core:1.7.0-SNAPSHOT @ <https://jclouds.ci.cloudbees.com/job/jclouds-labs/ws/jclouds-management/management-core/pom.xml,>
MavenProject: org.apache.jclouds.labs.management:management-compute:1.7.0-SNAPSHOT @ <https://jclouds.ci.cloudbees.com/job/jclouds-labs/ws/jclouds-management/management-compute/pom.xml,>
MavenProject: org.apache.jclouds.labs.management:management-blobstore:1.7.0-SNAPSHOT @ <https://jclouds.ci.cloudbees.com/job/jclouds-labs/ws/jclouds-management/management-blobstore/pom.xml]>
[JENKINS] Archiving <https://jclouds.ci.cloudbees.com/job/jclouds-labs/ws/fgcp-au/pom.xml>
to /home/jclouds/hudson_home/jobs/jclouds-labs/modules/org.apache.jclouds.labs$fgcp-au/builds/2013-06-16_22-51-30/archive/org.apache.jclouds.labs/fgcp-au/1.7.0-SNAPSHOT/fgcp-au-1.7.0-SNAPSHOT.pom
[JENKINS] Archiving <https://jclouds.ci.cloudbees.com/job/jclouds-labs/ws/abiquo/pom.xml>
to /home/jclouds/hudson_home/jobs/jclouds-labs/modules/org.apache.jclouds.labs$abiquo/builds/2013-06-16_22-51-30/archive/org.apache.jclouds.labs/abiquo/1.7.0-SNAPSHOT/abiquo-1.7.0-SNAPSHOT.pom
[JENKINS] Archiving <https://jclouds.ci.cloudbees.com/job/jclouds-labs/ws/jclouds-management/management-compute/pom.xml>
to /home/jclouds/hudson_home/jobs/jclouds-labs/modules/org.apache.jclouds.labs.management$management-compute/builds/2013-06-16_22-51-30/archive/org.apache.jclouds.labs.management/management-compute/1.7.0-SNAPSHOT/management-compute-1.7.0-SNAPSHOT.pom
[JENKINS] Archiving <https://jclouds.ci.cloudbees.com/job/jclouds-labs/ws/fgcp-de/pom.xml>
to /home/jclouds/hudson_home/jobs/jclouds-labs/modules/org.apache.jclouds.labs$fgcp-de/builds/2013-06-16_22-51-30/archive/org.apache.jclouds.labs/fgcp-de/1.7.0-SNAPSHOT/fgcp-de-1.7.0-SNAPSHOT.pom
[JENKINS] Archiving <https://jclouds.ci.cloudbees.com/job/jclouds-labs/ws/dmtf/pom.xml>
to /home/jclouds/hudson_home/jobs/jclouds-labs/modules/org.apache.jclouds.labs$dmtf/builds/2013-06-16_22-51-30/archive/org.apache.jclouds.labs/dmtf/1.7.0-SNAPSHOT/dmtf-1.7.0-SNAPSHOT.pom
[JENKINS] Archiving <https://jclouds.ci.cloudbees.com/job/jclouds-labs/ws/dmtf/target/dmtf-1.7.0-SNAPSHOT.jar>
to /home/jclouds/hudson_home/jobs/jclouds-labs/modules/org.apache.jclouds.labs$dmtf/builds/2013-06-16_22-51-30/archive/org.apache.jclouds.labs/dmtf/1.7.0-SNAPSHOT/dmtf-1.7.0-SNAPSHOT.jar
[JENKINS] Archiving <https://jclouds.ci.cloudbees.com/job/jclouds-labs/ws/dmtf/target/dmtf-1.7.0-SNAPSHOT-tests.jar>
to /home/jclouds/hudson_home/jobs/jclouds-labs/modules/org.apache.jclouds.labs$dmtf/builds/2013-06-16_22-51-30/archive/org.apache.jclouds.labs/dmtf/1.7.0-SNAPSHOT/dmtf-1.7.0-SNAPSHOT-tests.jar
[JENKINS] Archiving <https://jclouds.ci.cloudbees.com/job/jclouds-labs/ws/dmtf/target/dmtf-1.7.0-SNAPSHOT-javadoc.jar>
to /home/jclouds/hudson_home/jobs/jclouds-labs/modules/org.apache.jclouds.labs$dmtf/builds/2013-06-16_22-51-30/archive/org.apache.jclouds.labs/dmtf/1.7.0-SNAPSHOT/dmtf-1.7.0-SNAPSHOT-javadoc.jar
[JENKINS] Archiving <https://jclouds.ci.cloudbees.com/job/jclouds-labs/ws/dmtf/target/dmtf-1.7.0-SNAPSHOT-sources.jar>
to /home/jclouds/hudson_home/jobs/jclouds-labs/modules/org.apache.jclouds.labs$dmtf/builds/2013-06-16_22-51-30/archive/org.apache.jclouds.labs/dmtf/1.7.0-SNAPSHOT/dmtf-1.7.0-SNAPSHOT-sources.jar
[JENKINS] Archiving <https://jclouds.ci.cloudbees.com/job/jclouds-labs/ws/joyentcloud/pom.xml>
to /home/jclouds/hudson_home/jobs/jclouds-labs/modules/org.apache.jclouds.labs$joyentcloud/builds/2013-06-16_22-51-30/archive/org.apache.jclouds.labs/joyentcloud/1.7.0-SNAPSHOT/joyentcloud-1.7.0-SNAPSHOT.pom
[JENKINS] Archiving <https://jclouds.ci.cloudbees.com/job/jclouds-labs/ws/jclouds-representations/pom.xml>
to /home/jclouds/hudson_home/jobs/jclouds-labs/modules/org.apache.jclouds.labs$jclouds-represetations/builds/2013-06-16_22-51-30/archive/org.apache.jclouds.labs/jclouds-represetations/1.7.0-SNAPSHOT/jclouds-represetations-1.7.0-SNAPSHOT.pom
[JENKINS] Archiving <https://jclouds.ci.cloudbees.com/job/jclouds-labs/ws/jclouds-representations/representations-core/pom.xml>
to /home/jclouds/hudson_home/jobs/jclouds-labs/modules/org.apache.jclouds.labs.representations$representations-core/builds/2013-06-16_22-51-30/archive/org.apache.jclouds.labs.representations/representations-core/1.7.0-SNAPSHOT/representations-core-1.7.0-SNAPSHOT.pom
[JENKINS] Archiving <https://jclouds.ci.cloudbees.com/job/jclouds-labs/ws/jclouds-management/management-core/pom.xml>
to /home/jclouds/hudson_home/jobs/jclouds-labs/modules/org.apache.jclouds.labs.management$management-core/builds/2013-06-16_22-51-30/archive/org.apache.jclouds.labs.management/management-core/1.7.0-SNAPSHOT/management-core-1.7.0-SNAPSHOT.pom
[JENKINS] Archiving <https://jclouds.ci.cloudbees.com/job/jclouds-labs/ws/joyent-cloudapi/pom.xml>
to /home/jclouds/hudson_home/jobs/jclouds-labs/modules/org.apache.jclouds.labs$joyent-cloudapi/builds/2013-06-16_22-51-30/archive/org.apache.jclouds.labs/joyent-cloudapi/1.7.0-SNAPSHOT/joyent-cloudapi-1.7.0-SNAPSHOT.pom
[JENKINS] Archiving <https://jclouds.ci.cloudbees.com/job/jclouds-labs/ws/fgcp/pom.xml>
to /home/jclouds/hudson_home/jobs/jclouds-labs/modules/org.apache.jclouds.labs$fgcp/builds/2013-06-16_22-51-30/archive/org.apache.jclouds.labs/fgcp/1.7.0-SNAPSHOT/fgcp-1.7.0-SNAPSHOT.pom
[JENKINS] Archiving <https://jclouds.ci.cloudbees.com/job/jclouds-labs/ws/jclouds-management/pom.xml>
to /home/jclouds/hudson_home/jobs/jclouds-labs/modules/org.apache.jclouds.labs$jclouds-management/builds/2013-06-16_22-51-30/archive/org.apache.jclouds.labs/jclouds-management/1.7.0-SNAPSHOT/jclouds-management-1.7.0-SNAPSHOT.pom
[JENKINS] Archiving <https://jclouds.ci.cloudbees.com/job/jclouds-labs/ws/jclouds-management/management-blobstore/pom.xml>
to /home/jclouds/hudson_home/jobs/jclouds-labs/modules/org.apache.jclouds.labs.management$management-blobstore/builds/2013-06-16_22-51-30/archive/org.apache.jclouds.labs.management/management-blobstore/1.7.0-SNAPSHOT/management-blobstore-1.7.0-SNAPSHOT.pom
[JENKINS] Archiving <https://jclouds.ci.cloudbees.com/job/jclouds-labs/ws/jclouds-representations/representations-codec/pom.xml>
to /home/jclouds/hudson_home/jobs/jclouds-labs/modules/org.apache.jclouds.labs.representations$representations-codec/builds/2013-06-16_22-51-30/archive/org.apache.jclouds.labs.representations/representations-codec/1.7.0-SNAPSHOT/representations-codec-1.7.0-SNAPSHOT.pom
[JENKINS] Archiving <https://jclouds.ci.cloudbees.com/job/jclouds-labs/ws/virtualbox/pom.xml>
to /home/jclouds/hudson_home/jobs/jclouds-labs/modules/org.apache.jclouds.labs$virtualbox/builds/2013-06-16_22-51-29/archive/org.apache.jclouds.labs/virtualbox/1.7.0-SNAPSHOT/virtualbox-1.7.0-SNAPSHOT.pom
[JENKINS] Archiving <https://jclouds.ci.cloudbees.com/job/jclouds-labs/ws/virtualbox/target/virtualbox-1.7.0-SNAPSHOT.jar>
to /home/jclouds/hudson_home/jobs/jclouds-labs/modules/org.apache.jclouds.labs$virtualbox/builds/2013-06-16_22-51-29/archive/org.apache.jclouds.labs/virtualbox/1.7.0-20130617.025709-32/virtualbox-1.7.0-20130617.025709-32.jar
[JENKINS] Archiving <https://jclouds.ci.cloudbees.com/job/jclouds-labs/ws/virtualbox/target/virtualbox-1.7.0-SNAPSHOT-tests.jar>
to /home/jclouds/hudson_home/jobs/jclouds-labs/modules/org.apache.jclouds.labs$virtualbox/builds/2013-06-16_22-51-29/archive/org.apache.jclouds.labs/virtualbox/1.7.0-20130617.025709-32/virtualbox-1.7.0-20130617.025709-32-tests.jar
[JENKINS] Archiving <https://jclouds.ci.cloudbees.com/job/jclouds-labs/ws/virtualbox/target/virtualbox-1.7.0-SNAPSHOT-javadoc.jar>
to /home/jclouds/hudson_home/jobs/jclouds-labs/modules/org.apache.jclouds.labs$virtualbox/builds/2013-06-16_22-51-29/archive/org.apache.jclouds.labs/virtualbox/1.7.0-20130617.025709-32/virtualbox-1.7.0-20130617.025709-32-javadoc.jar
[JENKINS] Archiving <https://jclouds.ci.cloudbees.com/job/jclouds-labs/ws/virtualbox/target/virtualbox-1.7.0-SNAPSHOT-sources.jar>
to /home/jclouds/hudson_home/jobs/jclouds-labs/modules/org.apache.jclouds.labs$virtualbox/builds/2013-06-16_22-51-29/archive/org.apache.jclouds.labs/virtualbox/1.7.0-20130617.025709-32/virtualbox-1.7.0-20130617.025709-32-sources.jar
[JENKINS] Archiving <https://jclouds.ci.cloudbees.com/job/jclouds-labs/ws/cdmi/pom.xml>
to /home/jclouds/hudson_home/jobs/jclouds-labs/modules/org.apache.jclouds.labs$cdmi/builds/2013-06-16_22-51-30/archive/org.apache.jclouds.labs/cdmi/1.7.0-SNAPSHOT/cdmi-1.7.0-SNAPSHOT.pom
[JENKINS] Archiving <https://jclouds.ci.cloudbees.com/job/jclouds-labs/ws/vcloud-director/pom.xml>
to /home/jclouds/hudson_home/jobs/jclouds-labs/modules/org.apache.jclouds.labs$vcloud-director/builds/2013-06-16_22-51-30/archive/org.apache.jclouds.labs/vcloud-director/1.7.0-SNAPSHOT/vcloud-director-1.7.0-SNAPSHOT.pom
[JENKINS] Archiving <https://jclouds.ci.cloudbees.com/job/jclouds-labs/ws/pom.xml> to
/home/jclouds/hudson_home/jobs/jclouds-labs/modules/org.apache.jclouds.labs$jclouds-labs/builds/2013-06-16_22-51-29/archive/org.apache.jclouds.labs/jclouds-labs/1.7.0-SNAPSHOT/jclouds-labs-1.7.0-SNAPSHOT.pom
[JENKINS] Archiving <https://jclouds.ci.cloudbees.com/job/jclouds-labs/ws/target/jclouds-labs-1.7.0-SNAPSHOT-tests.jar>
to /home/jclouds/hudson_home/jobs/jclouds-labs/modules/org.apache.jclouds.labs$jclouds-labs/builds/2013-06-16_22-51-29/archive/org.apache.jclouds.labs/jclouds-labs/1.7.0-20130617.025518-32/jclouds-labs-1.7.0-20130617.025518-32-tests.jar
[JENKINS] Archiving <https://jclouds.ci.cloudbees.com/job/jclouds-labs/ws/target/jclouds-labs-1.7.0-SNAPSHOT-javadoc.jar>
to /home/jclouds/hudson_home/jobs/jclouds-labs/modules/org.apache.jclouds.labs$jclouds-labs/builds/2013-06-16_22-51-29/archive/org.apache.jclouds.labs/jclouds-labs/1.7.0-20130617.025518-32/jclouds-labs-1.7.0-20130617.025518-32-javadoc.jar
Waiting for Jenkins to finish collecting data
mavenExecutionResult exceptions not empty
message : Failed to execute goal org.apache.maven.plugins:maven-deploy-plugin:2.7:deploy (default-deploy)
on project dmtf: Failed to retrieve remote metadata org.apache.jclouds.labs:dmtf:1.7.0-SNAPSHOT/maven-metadata.xml:
Could not transfer metadata org.apache.jclouds.labs:dmtf:1.7.0-SNAPSHOT/maven-metadata.xml
from/to apache.snapshots.https (https://repository.apache.org/content/repositories/snapshots):
Error transferring file: Server returned HTTP response code: 502 for URL: https://repository.apache.org/content/repositories/snapshots/org/apache/jclouds/labs/dmtf/1.7.0-SNAPSHOT/maven-metadata.xml
cause : Failed to retrieve remote metadata org.apache.jclouds.labs:dmtf:1.7.0-SNAPSHOT/maven-metadata.xml:
Could not transfer metadata org.apache.jclouds.labs:dmtf:1.7.0-SNAPSHOT/maven-metadata.xml
from/to apache.snapshots.https (https://repository.apache.org/content/repositories/snapshots):
Error transferring file: Server returned HTTP response code: 502 for URL: https://repository.apache.org/content/repositories/snapshots/org/apache/jclouds/labs/dmtf/1.7.0-SNAPSHOT/maven-metadata.xml
Stack trace : 
org.apache.maven.lifecycle.LifecycleExecutionException: Failed to execute goal org.apache.maven.plugins:maven-deploy-plugin:2.7:deploy
(default-deploy) on project dmtf: Failed to retrieve remote metadata org.apache.jclouds.labs:dmtf:1.7.0-SNAPSHOT/maven-metadata.xml:
Could not transfer metadata org.apache.jclouds.labs:dmtf:1.7.0-SNAPSHOT/maven-metadata.xml
from/to apache.snapshots.https (https://repository.apache.org/content/repositories/snapshots):
Error transferring file: Server returned HTTP response code: 502 for URL: https://repository.apache.org/content/repositories/snapshots/org/apache/jclouds/labs/dmtf/1.7.0-SNAPSHOT/maven-metadata.xml
	at org.apache.maven.lifecycle.internal.MojoExecutor.execute(MojoExecutor.java:217)
	at org.apache.maven.lifecycle.internal.MojoExecutor.execute(MojoExecutor.java:153)
	at org.apache.maven.lifecycle.internal.MojoExecutor.execute(MojoExecutor.java:145)
	at org.apache.maven.lifecycle.internal.LifecycleModuleBuilder.buildProject(LifecycleModuleBuilder.java:84)
	at org.apache.maven.lifecycle.internal.LifecycleModuleBuilder.buildProject(LifecycleModuleBuilder.java:59)
	at org.apache.maven.lifecycle.internal.LifecycleStarter.singleThreadedBuild(LifecycleStarter.java:183)
	at org.apache.maven.lifecycle.internal.LifecycleStarter.execute(LifecycleStarter.java:161)
	at org.apache.maven.DefaultMaven.doExecute(DefaultMaven.java:319)
	at org.apache.maven.DefaultMaven.execute(DefaultMaven.java:156)
	at org.jvnet.hudson.maven3.launcher.Maven3Launcher.main(Maven3Launcher.java:79)
	at sun.reflect.NativeMethodAccessorImpl.invoke0(Native Method)
	at sun.reflect.NativeMethodAccessorImpl.invoke(NativeMethodAccessorImpl.java:39)
	at sun.reflect.DelegatingMethodAccessorImpl.invoke(DelegatingMethodAccessorImpl.java:25)
	at java.lang.reflect.Method.invoke(Method.java:597)
	at org.codehaus.plexus.classworlds.launcher.Launcher.launchStandard(Launcher.java:329)
	at org.codehaus.plexus.classworlds.launcher.Launcher.launch(Launcher.java:239)
	at org.jvnet.hudson.maven3.agent.Maven3Main.launch(Maven3Main.java:158)
	at hudson.maven.Maven3Builder.call(Maven3Builder.java:98)
	at hudson.maven.Maven3Builder.call(Maven3Builder.java:64)
	at hudson.remoting.UserRequest.perform(UserRequest.java:118)
	at hudson.remoting.UserRequest.perform(UserRequest.java:48)
	at hudson.remoting.Request$2.run(Request.java:326)
	at hudson.remoting.InterceptingExecutorService$1.call(InterceptingExecutorService.java:72)
	at java.util.concurrent.FutureTask$Sync.innerRun(FutureTask.java:303)
	at java.util.concurrent.FutureTask.run(FutureTask.java:138)
	at java.util.concurrent.ThreadPoolExecutor$Worker.runTask(ThreadPoolExecutor.java:895)
	at java.util.concurrent.ThreadPoolExecutor$Worker.run(ThreadPoolExecutor.java:918)
	at java.lang.Thread.run(Thread.java:662)
Caused by: org.apache.maven.plugin.MojoExecutionException: Failed to retrieve remote metadata
org.apache.jclouds.labs:dmtf:1.7.0-SNAPSHOT/maven-metadata.xml: Could not transfer metadata
org.apache.jclouds.labs:dmtf:1.7.0-SNAPSHOT/maven-metadata.xml from/to apache.snapshots.https
(https://repository.apache.org/content/repositories/snapshots): Error transferring file: Server
returned HTTP response code: 502 for URL: https://repository.apache.org/content/repositories/snapshots/org/apache/jclouds/labs/dmtf/1.7.0-SNAPSHOT/maven-metadata.xml
	at org.apache.maven.plugin.deploy.DeployMojo.execute(DeployMojo.java:193)
	at org.apache.maven.plugin.DefaultBuildPluginManager.executeMojo(DefaultBuildPluginManager.java:101)
	at org.apache.maven.lifecycle.internal.MojoExecutor.execute(MojoExecutor.java:209)
	... 27 more
Caused by: org.apache.maven.artifact.deployer.ArtifactDeploymentException: Failed to retrieve
remote metadata org.apache.jclouds.labs:dmtf:1.7.0-SNAPSHOT/maven-metadata.xml: Could not
transfer metadata org.apache.jclouds.labs:dmtf:1.7.0-SNAPSHOT/maven-metadata.xml from/to apache.snapshots.https
(https://repository.apache.org/content/repositories/snapshots): Error transferring file: Server
returned HTTP response code: 502 for URL: https://repository.apache.org/content/repositories/snapshots/org/apache/jclouds/labs/dmtf/1.7.0-SNAPSHOT/maven-metadata.xml
	at org.apache.maven.artifact.deployer.DefaultArtifactDeployer.deploy(DefaultArtifactDeployer.java:141)
	at org.apache.maven.plugin.deploy.AbstractDeployMojo.deploy(AbstractDeployMojo.java:167)
	at org.apache.maven.plugin.deploy.DeployMojo.execute(DeployMojo.java:157)
	... 29 more
Caused by: org.sonatype.aether.deployment.DeploymentException: Failed to retrieve remote metadata
org.apache.jclouds.labs:dmtf:1.7.0-SNAPSHOT/maven-metadata.xml: Could not transfer metadata
org.apache.jclouds.labs:dmtf:1.7.0-SNAPSHOT/maven-metadata.xml from/to apache.snapshots.https
(https://repository.apache.org/content/repositories/snapshots): Error transferring file: Server
returned HTTP response code: 502 for URL: https://repository.apache.org/content/repositories/snapshots/org/apache/jclouds/labs/dmtf/1.7.0-SNAPSHOT/maven-metadata.xml
	at org.sonatype.aether.impl.internal.DefaultDeployer.upload(DefaultDeployer.java:407)
	at org.sonatype.aether.impl.internal.DefaultDeployer.deploy(DefaultDeployer.java:260)
	at org.sonatype.aether.impl.internal.DefaultDeployer.deploy(DefaultDeployer.java:215)
	at org.sonatype.aether.impl.internal.DefaultRepositorySystem.deploy(DefaultRepositorySystem.java:480)
	at org.apache.maven.artifact.deployer.DefaultArtifactDeployer.deploy(DefaultArtifactDeployer.java:137)
	... 31 more
Caused by: org.sonatype.aether.transfer.MetadataTransferException: Could not transfer metadata
org.apache.jclouds.labs:dmtf:1.7.0-SNAPSHOT/maven-metadata.xml from/to apache.snapshots.https
(https://repository.apache.org/content/repositories/snapshots): Error transferring file: Server
returned HTTP response code: 502 for URL: https://repository.apache.org/content/repositories/snapshots/org/apache/jclouds/labs/dmtf/1.7.0-SNAPSHOT/maven-metadata.xml
	at org.sonatype.aether.connector.wagon.WagonRepositoryConnector$3.wrap(WagonRepositoryConnector.java:932)
	at org.sonatype.aether.connector.wagon.WagonRepositoryConnector$3.wrap(WagonRepositoryConnector.java:923)
	at org.sonatype.aether.connector.wagon.WagonRepositoryConnector$GetTask.flush(WagonRepositoryConnector.java:695)
	at org.sonatype.aether.connector.wagon.WagonRepositoryConnector$GetTask.flush(WagonRepositoryConnector.java:689)
	at org.sonatype.aether.connector.wagon.WagonRepositoryConnector.get(WagonRepositoryConnector.java:445)
	at org.sonatype.aether.impl.internal.DefaultDeployer.upload(DefaultDeployer.java:379)
	... 35 more
Caused by: org.apache.maven.wagon.TransferFailedException: Error transferring file: Server
returned HTTP response code: 502 for URL: https://repository.apache.org/content/repositories/snapshots/org/apache/jclouds/labs/dmtf/1.7.0-SNAPSHOT/maven-metadata.xml
	at org.apache.maven.wagon.providers.http.LightweightHttpWagon.fillInputData(LightweightHttpWagon.java:143)
	at org.apache.maven.wagon.StreamWagon.getInputStream(StreamWagon.java:116)
	at org.apache.maven.wagon.StreamWagon.getIfNewer(StreamWagon.java:88)
	at org.apache.maven.wagon.StreamWagon.get(StreamWagon.java:61)
	at org.sonatype.aether.connector.wagon.WagonRepositoryConnector$GetTask.run(WagonRepositoryConnector.java:608)
	at org.sonatype.aether.util.concurrency.RunnableErrorForwarder$1.run(RunnableErrorForwarder.java:64)
	... 3 more
Caused by: java.io.IOException: Server returned HTTP response code: 502 for URL: https://repository.apache.org/content/repositories/snapshots/org/apache/jclouds/labs/dmtf/1.7.0-SNAPSHOT/maven-metadata.xml
	at sun.reflect.NativeConstructorAccessorImpl.newInstance0(Native Method)
	at sun.reflect.NativeConstructorAccessorImpl.newInstance(NativeConstructorAccessorImpl.java:39)
	at sun.reflect.DelegatingConstructorAccessorImpl.newInstance(DelegatingConstructorAccessorImpl.java:27)
	at java.lang.reflect.Constructor.newInstance(Constructor.java:513)
	at sun.net.www.protocol.http.HttpURLConnection$6.run(HttpURLConnection.java:1514)
	at java.security.AccessController.doPrivileged(Native Method)
	at sun.net.www.protocol.http.HttpURLConnection.getChainedException(HttpURLConnection.java:1508)
	at sun.net.www.protocol.http.HttpURLConnection.getInputStream(HttpURLConnection.java:1162)
	at sun.net.www.protocol.https.HttpsURLConnectionImpl.getInputStream(HttpsURLConnectionImpl.java:234)
	at org.apache.maven.wagon.providers.http.LightweightHttpWagon.fillInputData(LightweightHttpWagon.java:122)
	... 8 more
Caused by: java.io.IOException: Server returned HTTP response code: 502 for URL: https://repository.apache.org/content/repositories/snapshots/org/apache/jclouds/labs/dmtf/1.7.0-SNAPSHOT/maven-metadata.xml
	at sun.net.www.protocol.http.HttpURLConnection.getInputStream(HttpURLConnection.java:1459)
	at java.net.HttpURLConnection.getResponseCode(HttpURLConnection.java:379)
	at sun.net.www.protocol.https.HttpsURLConnectionImpl.getResponseCode(HttpsURLConnectionImpl.java:318)
	at org.apache.maven.wagon.providers.http.LightweightHttpWagon.fillInputData(LightweightHttpWagon.java:115)
	... 8 more
Sending e-mails to: dev@jclouds.incubator.apache.org
channel stopped

Mime
View raw message