jclouds-dev mailing list archives

Site index · List index
Message view « Date » · « Thread »
Top « Date » · « Thread »
From jenkins-no-re...@cloudbees.com
Subject Build failed in Jenkins: jclouds-karaf-1.6.x-branch #52
Date Mon, 17 Jun 2013 02:53:03 GMT
See <https://jclouds.ci.cloudbees.com/job/jclouds-karaf-1.6.x-branch/52/changes>

Changes:

[Andrew Bayer] Cleaning up lurking copyright issues/NOTICE txt

------------------------------------------
Started by an SCM change
Building remotely on s-054d4fb7 in workspace <https://jclouds.ci.cloudbees.com/job/jclouds-karaf-1.6.x-branch/ws/>
Checkout:jclouds-karaf-1.6.x-branch / <https://jclouds.ci.cloudbees.com/job/jclouds-karaf-1.6.x-branch/ws/>
- hudson.remoting.Channel@316e0252:s-054d4fb7
Using strategy: Default
Last Built Revision: Revision 4b515ee6bf7b2bcc25747b75f7ccd87e4768f66a (origin/1.6.x)
Cloning the remote Git repository
Cloning repository https://git-wip-us.apache.org/repos/asf/incubator-jclouds-karaf.git
git --version
git version 1.7.11.7
Fetching upstream changes from origin
Commencing build of Revision 8458b147ebdc740312fbfc0ac21b95f960e9603f (origin/1.6.x)
Checking out Revision 8458b147ebdc740312fbfc0ac21b95f960e9603f (origin/1.6.x)
Parsing POMs
Modules changed, recalculating dependency graph
[jclouds-karaf-1.6.x-branch] $ /opt/jdk/jdk1.6.latest/bin/java -Xmx512m -Xloggc:gc.log -XX:MaxPermSize=128m
-XX:+UseParallelOldGC -cp /scratch/jenkins/maven3-agent.jar:/opt/maven/apache-maven-3.0.3/boot/plexus-classworlds-2.4.jar
org.jvnet.hudson.maven3.agent.Maven3Main /opt/maven/apache-maven-3.0.3 /scratch/jenkins/slave.jar
/scratch/jenkins/maven3-interceptor.jar 53393
<===[JENKINS REMOTING CAPACITY]===>   channel started
log4j:WARN No appenders could be found for logger (org.apache.commons.beanutils.converters.BooleanConverter).
log4j:WARN Please initialize the log4j system properly.
Executing Maven:  -B -f <https://jclouds.ci.cloudbees.com/job/jclouds-karaf-1.6.x-branch/ws/pom.xml>
-s /private/jclouds/settings.xml clean deploy -e -Pdoc -Psrc
[INFO] Error stacktraces are turned on.
[INFO] Scanning for projects...
[WARNING] 
[WARNING] Some problems were encountered while building the effective model for org.apache.jclouds.karaf:commands:bundle:1.6.1-incubating
[WARNING] 'dependencies.dependency.(groupId:artifactId:type:classifier)' must be unique: org.apache.jclouds.driver:jclouds-log4j:jar
-> duplicate declaration of version (?) @ line 133, column 17
[WARNING] 
[WARNING] It is highly recommended to fix these problems because they threaten the stability
of your build.
[WARNING] 
[WARNING] For this reason, future Maven versions might no longer support building such malformed
projects.
[WARNING] 
[INFO] ------------------------------------------------------------------------
[INFO] Reactor Build Order:
[INFO] 
[INFO] Apache jclouds :: Karaf
[INFO] JClouds :: Karaf :: Core
[INFO] JClouds :: Karaf :: Utils
[INFO] JClouds :: Karaf :: Recipe
[INFO] JClouds :: Karaf :: Cache
[INFO] JClouds :: Karaf :: Services
[INFO] JClouds :: Karaf :: Commands
[INFO] JClouds :: Karaf :: URL Handler
[INFO] JClouds :: Karaf :: Chef
[INFO] JClouds :: Karaf :: Chef :: Core
[INFO] JClouds :: Karaf :: Chef :: Services
[INFO] JClouds :: Karaf :: Chef :: Commands
[INFO] JClouds :: Karaf :: Chef :: Cache
[INFO] JClouds :: Karaf :: Feature
[INFO] JClouds :: Karaf :: Integration Tests
Projects to build: [MavenProject: org.apache.jclouds:jclouds-karaf:1.6.1-incubating @ <https://jclouds.ci.cloudbees.com/job/jclouds-karaf-1.6.x-branch/ws/pom.xml,>
MavenProject: org.apache.jclouds.karaf:core:1.6.1-incubating @ <https://jclouds.ci.cloudbees.com/job/jclouds-karaf-1.6.x-branch/ws/core/pom.xml,>
MavenProject: org.apache.jclouds.karaf:utils:1.6.1-incubating @ <https://jclouds.ci.cloudbees.com/job/jclouds-karaf-1.6.x-branch/ws/utils/pom.xml,>
MavenProject: org.apache.jclouds.karaf:recipe:1.6.1-incubating @ <https://jclouds.ci.cloudbees.com/job/jclouds-karaf-1.6.x-branch/ws/recipe/pom.xml,>
MavenProject: org.apache.jclouds.karaf:cache:1.6.1-incubating @ <https://jclouds.ci.cloudbees.com/job/jclouds-karaf-1.6.x-branch/ws/cache/pom.xml,>
MavenProject: org.apache.jclouds.karaf:services:1.6.1-incubating @ <https://jclouds.ci.cloudbees.com/job/jclouds-karaf-1.6.x-branch/ws/services/pom.xml,>
MavenProject: org.apache.jclouds.karaf:commands:1.6.1-incubating @ <https://jclouds.ci.cloudbees.com/job/jclouds-karaf-1.6.x-branch/ws/commands/pom.xml,>
MavenProject: org.apache.jclouds.karaf:urlhandler:1.6.1-incubating @ <https://jclouds.ci.cloudbees.com/job/jclouds-karaf-1.6.x-branch/ws/urlhandler/pom.xml,>
MavenProject: org.apache.jclouds.karaf:chef:1.6.1-incubating @ <https://jclouds.ci.cloudbees.com/job/jclouds-karaf-1.6.x-branch/ws/chef/pom.xml,>
MavenProject: org.apache.jclouds.karaf.chef:core:1.6.1-incubating @ <https://jclouds.ci.cloudbees.com/job/jclouds-karaf-1.6.x-branch/ws/chef/core/pom.xml,>
MavenProject: org.apache.jclouds.karaf.chef:services:1.6.1-incubating @ <https://jclouds.ci.cloudbees.com/job/jclouds-karaf-1.6.x-branch/ws/chef/services/pom.xml,>
MavenProject: org.apache.jclouds.karaf.chef:commands:1.6.1-incubating @ <https://jclouds.ci.cloudbees.com/job/jclouds-karaf-1.6.x-branch/ws/chef/commands/pom.xml,>
MavenProject: org.apache.jclouds.karaf.chef:cache:1.6.1-incubating @ <https://jclouds.ci.cloudbees.com/job/jclouds-karaf-1.6.x-branch/ws/chef/cache/pom.xml,>
MavenProject: org.apache.jclouds.karaf:jclouds-karaf:1.6.1-incubating @ <https://jclouds.ci.cloudbees.com/job/jclouds-karaf-1.6.x-branch/ws/feature/pom.xml,>
MavenProject: org.apache.jclouds.karaf:itests:1.6.1-incubating @ <https://jclouds.ci.cloudbees.com/job/jclouds-karaf-1.6.x-branch/ws/itests/pom.xml]>
projectStarted org.apache.jclouds:jclouds-karaf:1.6.1-incubating
[INFO]                                                                         
[INFO] ------------------------------------------------------------------------
[INFO] Building Apache jclouds :: Karaf 1.6.1-incubating
[INFO] ------------------------------------------------------------------------
mojoStarted org.apache.maven.plugins:maven-clean-plugin:2.5(default-clean)
[INFO] 
[INFO] --- maven-clean-plugin:2.5:clean (default-clean) @ jclouds-karaf ---
mojoSucceeded org.apache.maven.plugins:maven-clean-plugin:2.5(default-clean)
mojoStarted org.apache.maven.plugins:maven-remote-resources-plugin:1.4(default)
[INFO] 
[INFO] --- maven-remote-resources-plugin:1.4:process (default) @ jclouds-karaf ---
mojoSucceeded org.apache.maven.plugins:maven-remote-resources-plugin:1.4(default)
mojoStarted org.apache.felix:maven-bundle-plugin:2.1.0(bundle-manifest)
[INFO] 
[INFO] --- maven-bundle-plugin:2.1.0:manifest (bundle-manifest) @ jclouds-karaf ---
[WARNING] Ignoring project type pom - supportedProjectTypes = [jar, war, bundle]
mojoSucceeded org.apache.felix:maven-bundle-plugin:2.1.0(bundle-manifest)
mojoStarted org.apache.maven.plugins:maven-site-plugin:3.2(attach-descriptor)
[INFO] 
[INFO] --- maven-site-plugin:3.2:attach-descriptor (attach-descriptor) @ jclouds-karaf ---
mojoSucceeded org.apache.maven.plugins:maven-site-plugin:3.2(attach-descriptor)
mojoStarted org.apache.rat:apache-rat-plugin:0.8(default)
[INFO] 
[INFO] --- apache-rat-plugin:0.8:check (default) @ jclouds-karaf ---
[INFO] Exclude: **/LICENSE.txt
[INFO] Exclude: **/header.txt
[INFO] Exclude: **/NOTICE.txt
[INFO] Exclude: **/DISCLAIMER
[INFO] Exclude: **/BUILD.txt
[INFO] Exclude: **/CHANGES.txt
[INFO] Exclude: **/README.md
[INFO] Exclude: **/README.txt
[INFO] Exclude: **/DEPENDENCIES
[INFO] Exclude: .git/**
[INFO] Exclude: **/.gitignore
[INFO] Exclude: **/*.json
[INFO] Exclude: **/*.log*
[INFO] Exclude: **/TODO
[INFO] Exclude: .mailmap
[INFO] Exclude: .idea/**
[INFO] Exclude: **/*.iml
[INFO] Exclude: **/.project
[INFO] Exclude: **/.classpath
[INFO] Exclude: **/.settings/**
[INFO] Exclude: **/.checkstyle
[INFO] Exclude: **/target/**
[INFO] Exclude: .repository/**
[INFO] Exclude: **/src/main/resources/**/*.txt
mojoSucceeded org.apache.rat:apache-rat-plugin:0.8(default)
mojoStarted org.apache.maven.plugins:maven-install-plugin:2.3.1(default-install)
[INFO] 
[INFO] --- maven-install-plugin:2.3.1:install (default-install) @ jclouds-karaf ---
[INFO] Installing <https://jclouds.ci.cloudbees.com/job/jclouds-karaf-1.6.x-branch/ws/pom.xml>
to /home/jenkins/.m2/repository/org/apache/jclouds/jclouds-karaf/1.6.1-incubating/jclouds-karaf-1.6.1-incubating.pom
mojoSucceeded org.apache.maven.plugins:maven-install-plugin:2.3.1(default-install)
mojoStarted org.apache.maven.plugins:maven-deploy-plugin:2.7(default-deploy)
[INFO] 
[INFO] --- maven-deploy-plugin:2.7:deploy (default-deploy) @ jclouds-karaf ---
Uploading: https://repository.apache.org/service/local/staging/deploy/maven2/org/apache/jclouds/jclouds-karaf/1.6.1-incubating/jclouds-karaf-1.6.1-incubating.pom
mojoFailed org.apache.maven.plugins:maven-deploy-plugin:2.7(default-deploy)
projectFailed org.apache.jclouds:jclouds-karaf:1.6.1-incubating
sessionEnded
[INFO] ------------------------------------------------------------------------
[INFO] Reactor Summary:
[INFO] 
[INFO] Apache jclouds :: Karaf ........................... FAILURE [19.916s]
[INFO] JClouds :: Karaf :: Core .......................... SKIPPED
[INFO] JClouds :: Karaf :: Utils ......................... SKIPPED
[INFO] JClouds :: Karaf :: Recipe ........................ SKIPPED
[INFO] JClouds :: Karaf :: Cache ......................... SKIPPED
[INFO] JClouds :: Karaf :: Services ...................... SKIPPED
[INFO] JClouds :: Karaf :: Commands ...................... SKIPPED
[INFO] JClouds :: Karaf :: URL Handler ................... SKIPPED
[INFO] JClouds :: Karaf :: Chef .......................... SKIPPED
[INFO] JClouds :: Karaf :: Chef :: Core .................. SKIPPED
[INFO] JClouds :: Karaf :: Chef :: Services .............. SKIPPED
[INFO] JClouds :: Karaf :: Chef :: Commands .............. SKIPPED
[INFO] JClouds :: Karaf :: Chef :: Cache ................. SKIPPED
[INFO] JClouds :: Karaf :: Feature ....................... SKIPPED
[INFO] JClouds :: Karaf :: Integration Tests ............. SKIPPED
[INFO] ------------------------------------------------------------------------
[INFO] BUILD FAILURE
[INFO] ------------------------------------------------------------------------
[INFO] Total time: 28.370s
[INFO] Finished at: Sun Jun 16 22:52:55 EDT 2013
[Unloading class GregorSamsa]
[Unloading class GregorSamsa$1]
[Unloading class GregorSamsa$2]
[Unloading class GregorSamsa$0]
[INFO] Final Memory: 17M/124M
[INFO] ------------------------------------------------------------------------
Projects to build: [MavenProject: org.apache.jclouds:jclouds-karaf:1.6.1-incubating @ <https://jclouds.ci.cloudbees.com/job/jclouds-karaf-1.6.x-branch/ws/pom.xml,>
MavenProject: org.apache.jclouds.karaf:core:1.6.1-incubating @ <https://jclouds.ci.cloudbees.com/job/jclouds-karaf-1.6.x-branch/ws/core/pom.xml,>
MavenProject: org.apache.jclouds.karaf:utils:1.6.1-incubating @ <https://jclouds.ci.cloudbees.com/job/jclouds-karaf-1.6.x-branch/ws/utils/pom.xml,>
MavenProject: org.apache.jclouds.karaf:recipe:1.6.1-incubating @ <https://jclouds.ci.cloudbees.com/job/jclouds-karaf-1.6.x-branch/ws/recipe/pom.xml,>
MavenProject: org.apache.jclouds.karaf:cache:1.6.1-incubating @ <https://jclouds.ci.cloudbees.com/job/jclouds-karaf-1.6.x-branch/ws/cache/pom.xml,>
MavenProject: org.apache.jclouds.karaf:services:1.6.1-incubating @ <https://jclouds.ci.cloudbees.com/job/jclouds-karaf-1.6.x-branch/ws/services/pom.xml,>
MavenProject: org.apache.jclouds.karaf:commands:1.6.1-incubating @ <https://jclouds.ci.cloudbees.com/job/jclouds-karaf-1.6.x-branch/ws/commands/pom.xml,>
MavenProject: org.apache.jclouds.karaf:urlhandler:1.6.1-incubating @ <https://jclouds.ci.cloudbees.com/job/jclouds-karaf-1.6.x-branch/ws/urlhandler/pom.xml,>
MavenProject: org.apache.jclouds.karaf:chef:1.6.1-incubating @ <https://jclouds.ci.cloudbees.com/job/jclouds-karaf-1.6.x-branch/ws/chef/pom.xml,>
MavenProject: org.apache.jclouds.karaf.chef:core:1.6.1-incubating @ <https://jclouds.ci.cloudbees.com/job/jclouds-karaf-1.6.x-branch/ws/chef/core/pom.xml,>
MavenProject: org.apache.jclouds.karaf.chef:services:1.6.1-incubating @ <https://jclouds.ci.cloudbees.com/job/jclouds-karaf-1.6.x-branch/ws/chef/services/pom.xml,>
MavenProject: org.apache.jclouds.karaf.chef:commands:1.6.1-incubating @ <https://jclouds.ci.cloudbees.com/job/jclouds-karaf-1.6.x-branch/ws/chef/commands/pom.xml,>
MavenProject: org.apache.jclouds.karaf.chef:cache:1.6.1-incubating @ <https://jclouds.ci.cloudbees.com/job/jclouds-karaf-1.6.x-branch/ws/chef/cache/pom.xml,>
MavenProject: org.apache.jclouds.karaf:jclouds-karaf:1.6.1-incubating @ <https://jclouds.ci.cloudbees.com/job/jclouds-karaf-1.6.x-branch/ws/feature/pom.xml,>
MavenProject: org.apache.jclouds.karaf:itests:1.6.1-incubating @ <https://jclouds.ci.cloudbees.com/job/jclouds-karaf-1.6.x-branch/ws/itests/pom.xml]>
[JENKINS] Archiving <https://jclouds.ci.cloudbees.com/job/jclouds-karaf-1.6.x-branch/ws/utils/pom.xml>
to /home/jclouds/hudson_home/jobs/jclouds-karaf-1.6.x-branch/modules/org.apache.jclouds.karaf$utils/builds/2013-06-16_22-52-15/archive/org.apache.jclouds.karaf/utils/1.6.1-incubating/utils-1.6.1-incubating.pom
[JENKINS] Archiving <https://jclouds.ci.cloudbees.com/job/jclouds-karaf-1.6.x-branch/ws/cache/pom.xml>
to /home/jclouds/hudson_home/jobs/jclouds-karaf-1.6.x-branch/modules/org.apache.jclouds.karaf$cache/builds/2013-06-16_22-52-15/archive/org.apache.jclouds.karaf/cache/1.6.1-incubating/cache-1.6.1-incubating.pom
[JENKINS] Archiving <https://jclouds.ci.cloudbees.com/job/jclouds-karaf-1.6.x-branch/ws/chef/commands/pom.xml>
to /home/jclouds/hudson_home/jobs/jclouds-karaf-1.6.x-branch/modules/org.apache.jclouds.karaf.chef$commands/builds/2013-06-16_22-52-15/archive/org.apache.jclouds.karaf.chef/commands/1.6.1-incubating/commands-1.6.1-incubating.pom
[JENKINS] Archiving <https://jclouds.ci.cloudbees.com/job/jclouds-karaf-1.6.x-branch/ws/recipe/pom.xml>
to /home/jclouds/hudson_home/jobs/jclouds-karaf-1.6.x-branch/modules/org.apache.jclouds.karaf$recipe/builds/2013-06-16_22-52-15/archive/org.apache.jclouds.karaf/recipe/1.6.1-incubating/recipe-1.6.1-incubating.pom
[JENKINS] Archiving <https://jclouds.ci.cloudbees.com/job/jclouds-karaf-1.6.x-branch/ws/feature/pom.xml>
to /home/jclouds/hudson_home/jobs/jclouds-karaf-1.6.x-branch/modules/org.apache.jclouds.karaf$jclouds-karaf/builds/2013-06-16_22-52-15/archive/org.apache.jclouds.karaf/jclouds-karaf/1.6.1-incubating/jclouds-karaf-1.6.1-incubating.pom
[JENKINS] Archiving <https://jclouds.ci.cloudbees.com/job/jclouds-karaf-1.6.x-branch/ws/commands/pom.xml>
to /home/jclouds/hudson_home/jobs/jclouds-karaf-1.6.x-branch/modules/org.apache.jclouds.karaf$commands/builds/2013-06-16_22-52-15/archive/org.apache.jclouds.karaf/commands/1.6.1-incubating/commands-1.6.1-incubating.pom
[JENKINS] Archiving <https://jclouds.ci.cloudbees.com/job/jclouds-karaf-1.6.x-branch/ws/itests/pom.xml>
to /home/jclouds/hudson_home/jobs/jclouds-karaf-1.6.x-branch/modules/org.apache.jclouds.karaf$itests/builds/2013-06-16_22-52-15/archive/org.apache.jclouds.karaf/itests/1.6.1-incubating/itests-1.6.1-incubating.pom
[JENKINS] Archiving <https://jclouds.ci.cloudbees.com/job/jclouds-karaf-1.6.x-branch/ws/urlhandler/pom.xml>
to /home/jclouds/hudson_home/jobs/jclouds-karaf-1.6.x-branch/modules/org.apache.jclouds.karaf$urlhandler/builds/2013-06-16_22-52-15/archive/org.apache.jclouds.karaf/urlhandler/1.6.1-incubating/urlhandler-1.6.1-incubating.pom
[JENKINS] Archiving <https://jclouds.ci.cloudbees.com/job/jclouds-karaf-1.6.x-branch/ws/services/pom.xml>
to /home/jclouds/hudson_home/jobs/jclouds-karaf-1.6.x-branch/modules/org.apache.jclouds.karaf$services/builds/2013-06-16_22-52-15/archive/org.apache.jclouds.karaf/services/1.6.1-incubating/services-1.6.1-incubating.pom
[JENKINS] Archiving <https://jclouds.ci.cloudbees.com/job/jclouds-karaf-1.6.x-branch/ws/chef/core/pom.xml>
to /home/jclouds/hudson_home/jobs/jclouds-karaf-1.6.x-branch/modules/org.apache.jclouds.karaf.chef$core/builds/2013-06-16_22-52-15/archive/org.apache.jclouds.karaf.chef/core/1.6.1-incubating/core-1.6.1-incubating.pom
[JENKINS] Archiving <https://jclouds.ci.cloudbees.com/job/jclouds-karaf-1.6.x-branch/ws/chef/services/pom.xml>
to /home/jclouds/hudson_home/jobs/jclouds-karaf-1.6.x-branch/modules/org.apache.jclouds.karaf.chef$services/builds/2013-06-16_22-52-15/archive/org.apache.jclouds.karaf.chef/services/1.6.1-incubating/services-1.6.1-incubating.pom
[JENKINS] Archiving <https://jclouds.ci.cloudbees.com/job/jclouds-karaf-1.6.x-branch/ws/chef/pom.xml>
to /home/jclouds/hudson_home/jobs/jclouds-karaf-1.6.x-branch/modules/org.apache.jclouds.karaf$chef/builds/2013-06-16_22-52-15/archive/org.apache.jclouds.karaf/chef/1.6.1-incubating/chef-1.6.1-incubating.pom
[JENKINS] Archiving <https://jclouds.ci.cloudbees.com/job/jclouds-karaf-1.6.x-branch/ws/pom.xml>
to /home/jclouds/hudson_home/jobs/jclouds-karaf-1.6.x-branch/modules/org.apache.jclouds$jclouds-karaf/builds/2013-06-16_22-52-15/archive/org.apache.jclouds/jclouds-karaf/1.6.1-incubating/jclouds-karaf-1.6.1-incubating.pom
[JENKINS] Archiving <https://jclouds.ci.cloudbees.com/job/jclouds-karaf-1.6.x-branch/ws/core/pom.xml>
to /home/jclouds/hudson_home/jobs/jclouds-karaf-1.6.x-branch/modules/org.apache.jclouds.karaf$core/builds/2013-06-16_22-52-15/archive/org.apache.jclouds.karaf/core/1.6.1-incubating/core-1.6.1-incubating.pom
[JENKINS] Archiving <https://jclouds.ci.cloudbees.com/job/jclouds-karaf-1.6.x-branch/ws/chef/cache/pom.xml>
to /home/jclouds/hudson_home/jobs/jclouds-karaf-1.6.x-branch/modules/org.apache.jclouds.karaf.chef$cache/builds/2013-06-16_22-52-15/archive/org.apache.jclouds.karaf.chef/cache/1.6.1-incubating/cache-1.6.1-incubating.pom
[WARNING] The requested profile "doc" could not be activated because it does not exist.
[WARNING] The requested profile "src" could not be activated because it does not exist.
Waiting for Jenkins to finish collecting data
mavenExecutionResult exceptions not empty
message : Failed to execute goal org.apache.maven.plugins:maven-deploy-plugin:2.7:deploy (default-deploy)
on project jclouds-karaf: Failed to deploy artifacts: Could not transfer artifact org.apache.jclouds:jclouds-karaf:pom:1.6.1-incubating
from/to apache.releases.https (https://repository.apache.org/service/local/staging/deploy/maven2):
Failed to transfer file: https://repository.apache.org/service/local/staging/deploy/maven2/org/apache/jclouds/jclouds-karaf/1.6.1-incubating/jclouds-karaf-1.6.1-incubating.pom.
Return code is: 401
cause : Failed to deploy artifacts: Could not transfer artifact org.apache.jclouds:jclouds-karaf:pom:1.6.1-incubating
from/to apache.releases.https (https://repository.apache.org/service/local/staging/deploy/maven2):
Failed to transfer file: https://repository.apache.org/service/local/staging/deploy/maven2/org/apache/jclouds/jclouds-karaf/1.6.1-incubating/jclouds-karaf-1.6.1-incubating.pom.
Return code is: 401
Stack trace : 
org.apache.maven.lifecycle.LifecycleExecutionException: Failed to execute goal org.apache.maven.plugins:maven-deploy-plugin:2.7:deploy
(default-deploy) on project jclouds-karaf: Failed to deploy artifacts: Could not transfer
artifact org.apache.jclouds:jclouds-karaf:pom:1.6.1-incubating from/to apache.releases.https
(https://repository.apache.org/service/local/staging/deploy/maven2): Failed to transfer file:
https://repository.apache.org/service/local/staging/deploy/maven2/org/apache/jclouds/jclouds-karaf/1.6.1-incubating/jclouds-karaf-1.6.1-incubating.pom.
Return code is: 401
	at org.apache.maven.lifecycle.internal.MojoExecutor.execute(MojoExecutor.java:217)
	at org.apache.maven.lifecycle.internal.MojoExecutor.execute(MojoExecutor.java:153)
	at org.apache.maven.lifecycle.internal.MojoExecutor.execute(MojoExecutor.java:145)
	at org.apache.maven.lifecycle.internal.LifecycleModuleBuilder.buildProject(LifecycleModuleBuilder.java:84)
	at org.apache.maven.lifecycle.internal.LifecycleModuleBuilder.buildProject(LifecycleModuleBuilder.java:59)
	at org.apache.maven.lifecycle.internal.LifecycleStarter.singleThreadedBuild(LifecycleStarter.java:183)
	at org.apache.maven.lifecycle.internal.LifecycleStarter.execute(LifecycleStarter.java:161)
	at org.apache.maven.DefaultMaven.doExecute(DefaultMaven.java:319)
	at org.apache.maven.DefaultMaven.execute(DefaultMaven.java:156)
	at org.jvnet.hudson.maven3.launcher.Maven3Launcher.main(Maven3Launcher.java:79)
	at sun.reflect.NativeMethodAccessorImpl.invoke0(Native Method)
	at sun.reflect.NativeMethodAccessorImpl.invoke(NativeMethodAccessorImpl.java:39)
	at sun.reflect.DelegatingMethodAccessorImpl.invoke(DelegatingMethodAccessorImpl.java:25)
	at java.lang.reflect.Method.invoke(Method.java:597)
	at org.codehaus.plexus.classworlds.launcher.Launcher.launchStandard(Launcher.java:329)
	at org.codehaus.plexus.classworlds.launcher.Launcher.launch(Launcher.java:239)
	at org.jvnet.hudson.maven3.agent.Maven3Main.launch(Maven3Main.java:158)
	at hudson.maven.Maven3Builder.call(Maven3Builder.java:98)
	at hudson.maven.Maven3Builder.call(Maven3Builder.java:64)
	at hudson.remoting.UserRequest.perform(UserRequest.java:118)
	at hudson.remoting.UserRequest.perform(UserRequest.java:48)
	at hudson.remoting.Request$2.run(Request.java:326)
	at hudson.remoting.InterceptingExecutorService$1.call(InterceptingExecutorService.java:72)
	at java.util.concurrent.FutureTask$Sync.innerRun(FutureTask.java:303)
	at java.util.concurrent.FutureTask.run(FutureTask.java:138)
	at java.util.concurrent.ThreadPoolExecutor$Worker.runTask(ThreadPoolExecutor.java:895)
	at java.util.concurrent.ThreadPoolExecutor$Worker.run(ThreadPoolExecutor.java:918)
	at java.lang.Thread.run(Thread.java:662)
Caused by: org.apache.maven.plugin.MojoExecutionException: Failed to deploy artifacts: Could
not transfer artifact org.apache.jclouds:jclouds-karaf:pom:1.6.1-incubating from/to apache.releases.https
(https://repository.apache.org/service/local/staging/deploy/maven2): Failed to transfer file:
https://repository.apache.org/service/local/staging/deploy/maven2/org/apache/jclouds/jclouds-karaf/1.6.1-incubating/jclouds-karaf-1.6.1-incubating.pom.
Return code is: 401
	at org.apache.maven.plugin.deploy.DeployMojo.execute(DeployMojo.java:193)
	at org.apache.maven.plugin.DefaultBuildPluginManager.executeMojo(DefaultBuildPluginManager.java:101)
	at org.apache.maven.lifecycle.internal.MojoExecutor.execute(MojoExecutor.java:209)
	... 27 more
Caused by: org.apache.maven.artifact.deployer.ArtifactDeploymentException: Failed to deploy
artifacts: Could not transfer artifact org.apache.jclouds:jclouds-karaf:pom:1.6.1-incubating
from/to apache.releases.https (https://repository.apache.org/service/local/staging/deploy/maven2):
Failed to transfer file: https://repository.apache.org/service/local/staging/deploy/maven2/org/apache/jclouds/jclouds-karaf/1.6.1-incubating/jclouds-karaf-1.6.1-incubating.pom.
Return code is: 401
	at org.apache.maven.artifact.deployer.DefaultArtifactDeployer.deploy(DefaultArtifactDeployer.java:141)
	at org.apache.maven.plugin.deploy.AbstractDeployMojo.deploy(AbstractDeployMojo.java:167)
	at org.apache.maven.plugin.deploy.DeployMojo.execute(DeployMojo.java:149)
	... 29 more
Caused by: org.sonatype.aether.deployment.DeploymentException: Failed to deploy artifacts:
Could not transfer artifact org.apache.jclouds:jclouds-karaf:pom:1.6.1-incubating from/to
apache.releases.https (https://repository.apache.org/service/local/staging/deploy/maven2):
Failed to transfer file: https://repository.apache.org/service/local/staging/deploy/maven2/org/apache/jclouds/jclouds-karaf/1.6.1-incubating/jclouds-karaf-1.6.1-incubating.pom.
Return code is: 401
	at org.sonatype.aether.impl.internal.DefaultDeployer.deploy(DefaultDeployer.java:284)
	at org.sonatype.aether.impl.internal.DefaultDeployer.deploy(DefaultDeployer.java:215)
	at org.sonatype.aether.impl.internal.DefaultRepositorySystem.deploy(DefaultRepositorySystem.java:480)
	at org.apache.maven.artifact.deployer.DefaultArtifactDeployer.deploy(DefaultArtifactDeployer.java:137)
	... 31 more
Caused by: org.sonatype.aether.transfer.ArtifactTransferException: Could not transfer artifact
org.apache.jclouds:jclouds-karaf:pom:1.6.1-incubating from/to apache.releases.https (https://repository.apache.org/service/local/staging/deploy/maven2):
Failed to transfer file: https://repository.apache.org/service/local/staging/deploy/maven2/org/apache/jclouds/jclouds-karaf/1.6.1-incubating/jclouds-karaf-1.6.1-incubating.pom.
Return code is: 401
	at org.sonatype.aether.connector.wagon.WagonRepositoryConnector$4.wrap(WagonRepositoryConnector.java:949)
	at org.sonatype.aether.connector.wagon.WagonRepositoryConnector$4.wrap(WagonRepositoryConnector.java:940)
	at org.sonatype.aether.connector.wagon.WagonRepositoryConnector$PutTask.flush(WagonRepositoryConnector.java:864)
	at org.sonatype.aether.connector.wagon.WagonRepositoryConnector.put(WagonRepositoryConnector.java:466)
	at org.sonatype.aether.impl.internal.DefaultDeployer.deploy(DefaultDeployer.java:278)
	... 34 more
Caused by: org.apache.maven.wagon.TransferFailedException: Failed to transfer file: https://repository.apache.org/service/local/staging/deploy/maven2/org/apache/jclouds/jclouds-karaf/1.6.1-incubating/jclouds-karaf-1.6.1-incubating.pom.
Return code is: 401
	at org.apache.maven.wagon.providers.http.LightweightHttpWagon.finishPutTransfer(LightweightHttpWagon.java:205)
	at org.apache.maven.wagon.AbstractWagon.putTransfer(AbstractWagon.java:413)
	at org.apache.maven.wagon.AbstractWagon.transfer(AbstractWagon.java:392)
	at org.apache.maven.wagon.AbstractWagon.putTransfer(AbstractWagon.java:365)
	at org.apache.maven.wagon.StreamWagon.put(StreamWagon.java:163)
	at org.sonatype.aether.connector.wagon.WagonRepositoryConnector$PutTask.run(WagonRepositoryConnector.java:825)
	at org.sonatype.aether.connector.wagon.WagonRepositoryConnector.put(WagonRepositoryConnector.java:465)
	... 35 more
channel stopped

Mime
View raw message