jclouds-dev mailing list archives

Site index · List index
Message view « Date » · « Thread »
Top « Date » · « Thread »
From jenkins-no-re...@cloudbees.com
Subject Build failed in Jenkins: jclouds-labs-1.6.x-branch #25
Date Tue, 04 Jun 2013 15:56:43 GMT
See <https://jclouds.ci.cloudbees.com/job/jclouds-labs-1.6.x-branch/25/>

------------------------------------------
Started by an SCM change
Building remotely on s-f97ad562 in workspace <https://jclouds.ci.cloudbees.com/job/jclouds-labs-1.6.x-branch/ws/>
Checkout:jclouds-labs-1.6.x-branch / <https://jclouds.ci.cloudbees.com/job/jclouds-labs-1.6.x-branch/ws/>
- hudson.remoting.Channel@46a6c089:s-f97ad562
Using strategy: Default
Last Built Revision: Revision e9e0968a4e9a2fda1190e7b98328a5151ebbe52c (origin/1.6.x)
Cloning the remote Git repository
Cloning repository https://git-wip-us.apache.org/repos/asf/incubator-jclouds-labs.git
git --version
git version 1.7.11.7
Fetching upstream changes from origin
Commencing build of Revision e9e0968a4e9a2fda1190e7b98328a5151ebbe52c (origin/1.6.x)
Checking out Revision e9e0968a4e9a2fda1190e7b98328a5151ebbe52c (origin/1.6.x)
Parsing POMs
Failed to transfer Could not find artifact org.apache.jclouds:jclouds-project:pom:1.6.1-incubating
in central (http://repo.cloudbees.com/content/repositories/central)
Failed to transfer Could not find artifact org.apache.jclouds:jclouds-project:pom:1.6.1-incubating
in cloudbees-private-release-repository (https://repository-jclouds.forge.cloudbees.com/release)
ERROR: Failed to parse POMs
hudson.util.IOException2: remote file operation failed: <https://jclouds.ci.cloudbees.com/job/jclouds-labs-1.6.x-branch/ws/>
at hudson.remoting.Channel@46a6c089:s-f97ad562
	at hudson.FilePath.act(FilePath.java:877)
	at hudson.FilePath.act(FilePath.java:863)
	at hudson.maven.MavenModuleSetBuild$MavenModuleSetBuildExecution.parsePoms(MavenModuleSetBuild.java:910)
	at hudson.maven.MavenModuleSetBuild$MavenModuleSetBuildExecution.doRun(MavenModuleSetBuild.java:654)
	at hudson.model.AbstractBuild$AbstractBuildExecution.run(AbstractBuild.java:510)
	at hudson.model.Run.execute(Run.java:1505)
	at hudson.maven.MavenModuleSetBuild.run(MavenModuleSetBuild.java:477)
	at hudson.model.ResourceController.execute(ResourceController.java:88)
	at hudson.model.Executor.run(Executor.java:237)
Caused by: hudson.remoting.ProxyException: hudson.maven.MavenModuleSetBuild$MavenExecutionException:
org.apache.maven.project.ProjectBuildingException: Some problems were encountered while processing
the POMs:
[FATAL] Non-resolvable parent POM: Could not find artifact org.apache.jclouds:jclouds-project:pom:1.6.1-incubating
in central (http://repo.cloudbees.com/content/repositories/central) and 'parent.relativePath'
points at wrong local POM @ line 22, column 11

	at hudson.maven.MavenModuleSetBuild$PomParser.invoke(MavenModuleSetBuild.java:1277)
	at hudson.maven.MavenModuleSetBuild$PomParser.invoke(MavenModuleSetBuild.java:1045)
	at hudson.FilePath$FileCallableWrapper.call(FilePath.java:2275)
	at hudson.remoting.UserRequest.perform(UserRequest.java:118)
	at hudson.remoting.UserRequest.perform(UserRequest.java:48)
	at hudson.remoting.Request$2.run(Request.java:326)
	at hudson.remoting.InterceptingExecutorService$1.call(InterceptingExecutorService.java:72)
	at java.util.concurrent.FutureTask$Sync.innerRun(FutureTask.java:334)
	at java.util.concurrent.FutureTask.run(FutureTask.java:166)
	at java.util.concurrent.ThreadPoolExecutor.runWorker(ThreadPoolExecutor.java:1145)
	at java.util.concurrent.ThreadPoolExecutor$Worker.run(ThreadPoolExecutor.java:615)
	at java.lang.Thread.run(Thread.java:722)
Caused by: hudson.remoting.ProxyException: org.apache.maven.project.ProjectBuildingException:
Some problems were encountered while processing the POMs:
[FATAL] Non-resolvable parent POM: Could not find artifact org.apache.jclouds:jclouds-project:pom:1.6.1-incubating
in central (http://repo.cloudbees.com/content/repositories/central) and 'parent.relativePath'
points at wrong local POM @ line 22, column 11

	at org.apache.maven.project.DefaultProjectBuilder.build(DefaultProjectBuilder.java:363)
	at hudson.maven.MavenEmbedder.buildProjects(MavenEmbedder.java:361)
	at hudson.maven.MavenEmbedder.readProjects(MavenEmbedder.java:331)
	at hudson.maven.MavenModuleSetBuild$PomParser.invoke(MavenModuleSetBuild.java:1227)
	... 11 more

Mime
View raw message