jclouds-dev mailing list archives

Site index · List index
Message view « Date » · « Thread »
Top « Date » · « Thread »
From BuildHive <buildhive-git...@cloudbees.com>
Subject Build failed in Jenkins: jclouds » jclouds #150
Date Sun, 30 Jun 2013 17:27:49 GMT
See <https://buildhive.cloudbees.com/job/jclouds/job/jclouds/150/>

------------------------------------------
[...truncated 30066 lines...]
[pool-1-thread-1] Test testConvertHostHeaderToEndPoint(org.jclouds.gae.ConvertToJcloudsResponseTest)
succeeded: 0ms
Test suite progress: tests succeeded: 10, failed: 0, skipped: 0.
Starting test testConvertWithContent(org.jclouds.gae.ConvertToJcloudsResponseTest)
[pool-1-thread-1] Test testConvertWithContent(org.jclouds.gae.ConvertToJcloudsResponseTest)
succeeded: 484ms
Test suite progress: tests succeeded: 11, failed: 0, skipped: 0.
Starting test testConvertWithHeaders(org.jclouds.gae.ConvertToJcloudsResponseTest)
[pool-1-thread-1] Test testConvertWithHeaders(org.jclouds.gae.ConvertToJcloudsResponseTest)
succeeded: 1ms
Test suite progress: tests succeeded: 12, failed: 0, skipped: 0.
Starting test testSocketOpenThrowsUnsupported(org.jclouds.gae.GaeSocketOpenTest)
[pool-1-thread-1] Test testSocketOpenThrowsUnsupported(org.jclouds.gae.GaeSocketOpenTest)
succeeded: 3330ms
Test suite progress: tests succeeded: 13, failed: 0, skipped: 0.
Tests run: 13, Failures: 0, Errors: 0, Skipped: 0, Time elapsed: 6.677 sec

Results :

Tests run: 13, Failures: 0, Errors: 0, Skipped: 0

[JENKINS] Recording test results
[INFO] 
[INFO] --- maven-bundle-plugin:2.3.7:bundle (default-bundle) @ jclouds-gae ---
[INFO] 
[INFO] --- maven-site-plugin:3.1:attach-descriptor (attach-descriptor) @ jclouds-gae ---
[INFO] 
[INFO] --- apache-rat-plugin:0.9:check (default) @ jclouds-gae ---
[INFO] 51 implicit excludes (use -debug for more details).
[INFO] Exclude: **/src/test/resources/**/*.sh
[INFO] Exclude: **/src/test/resources/**/*.bat
[INFO] Exclude: **/src/test/resources/**/*.cmd
[INFO] Exclude: **/src/test/resources/**/*.txt
[INFO] Exclude: **/src/test/resources/**/*.gz
[INFO] Exclude: **/src/test/resources/**/*.xml
[INFO] Exclude: **/services/*LoggingModule
[INFO] Exclude: **/services/*ApiMetadata
[INFO] Exclude: **/services/*ProviderMetadata
[INFO] Exclude: **/LICENSE.txt
[INFO] Exclude: **/header.txt
[INFO] Exclude: **/NOTICE.txt
[INFO] Exclude: **/DISCLAIMER
[INFO] Exclude: **/BUILD.txt
[INFO] Exclude: **/CHANGES.txt
[INFO] Exclude: **/README.md
[INFO] Exclude: **/README.txt
[INFO] Exclude: **/DEPENDENCIES
[INFO] Exclude: **/*json
[INFO] Exclude: **/*readme
[INFO] Exclude: **/test
[INFO] Exclude: **/test.pub
[INFO] Exclude: **/target/**
[INFO] Exclude: **/test-output/**
[INFO] Exclude: **/bin/**
[INFO] Exclude: **/.settings/**
[INFO] Exclude: **/.classpath
[INFO] Exclude: **/.dir-locals.el
[INFO] Exclude: **/.project
[INFO] Exclude: **/.idea/**
[INFO] Exclude: **/*.iml
[INFO] Exclude: **/*.eml
[INFO] Exclude: **/*.ipr
[INFO] Exclude: **/*.iws
[INFO] Exclude: **/*.DS_STORE
[INFO] Exclude: **/TAGS
[INFO] Exclude: **/.metadata/**
[INFO] Exclude: **/atlassian-ide-plugin.xml
[INFO] Exclude: **/.DS_Store
[INFO] Exclude: .mailmap
[INFO] Exclude: .git/**
[INFO] Exclude: **/.gitignore
[INFO] Exclude: **/.gitattributes
[INFO] Exclude: .repository/**
[INFO] Exclude: gc.log
[INFO] 14 resources included (use -debug for more details)
[INFO] Rat check: Summary of files. Unapproved: 0 unknown: 0 generated: 0 approved: 13 licence.
[INFO] 
[INFO] --- maven-jar-plugin:2.4:test-jar (default) @ jclouds-gae ---
[INFO] Building jar: <https://buildhive.cloudbees.com/job/jclouds/job/jclouds/ws/drivers/gae/target/jclouds-gae-1.7.0-SNAPSHOT-tests.jar>
[INFO] 
[INFO] --- maven-surefire-plugin:2.12.4:test (integration) @ jclouds-gae ---
[INFO] Surefire report directory: <https://buildhive.cloudbees.com/job/jclouds/job/jclouds/ws/drivers/gae/target/surefire-reports>

-------------------------------------------------------
 T E S T S
-------------------------------------------------------
Error occurred during initialization of VM
Could not reserve enough space for object heap

Results :

Tests run: 0, Failures: 0, Errors: 0, Skipped: 0

[JENKINS] Recording test results
[JENKINS] Archiving <https://buildhive.cloudbees.com/job/jclouds/job/jclouds/ws/drivers/gae/pom.xml>
to /home/jenkins/jenkins_home/jobs/jclouds/jobs/jclouds/modules/org.apache.jclouds.driver$jclouds-gae/builds/2013-06-30_16-46-21/archive/org.apache.jclouds.driver/jclouds-gae/1.7.0-SNAPSHOT/jclouds-gae-1.7.0-SNAPSHOT.pom
[JENKINS] Archiving <https://buildhive.cloudbees.com/job/jclouds/job/jclouds/ws/drivers/gae/target/jclouds-gae-1.7.0-SNAPSHOT.jar>
to /home/jenkins/jenkins_home/jobs/jclouds/jobs/jclouds/modules/org.apache.jclouds.driver$jclouds-gae/builds/2013-06-30_16-46-21/archive/org.apache.jclouds.driver/jclouds-gae/1.7.0-SNAPSHOT/jclouds-gae-1.7.0-SNAPSHOT.jar
[JENKINS] Archiving <https://buildhive.cloudbees.com/job/jclouds/job/jclouds/ws/drivers/gae/target/jclouds-gae-1.7.0-SNAPSHOT-tests.jar>
to /home/jenkins/jenkins_home/jobs/jclouds/jobs/jclouds/modules/org.apache.jclouds.driver$jclouds-gae/builds/2013-06-30_16-46-21/archive/org.apache.jclouds.driver/jclouds-gae/1.7.0-SNAPSHOT/jclouds-gae-1.7.0-SNAPSHOT-tests.jar
[INFO] ------------------------------------------------------------------------
[INFO] Reactor Summary:
[INFO] 
[INFO] Apache jclouds (incubating)  Project .............. SUCCESS [25.321s]
[INFO] jclouds shared Maven resources .................... SUCCESS [8.431s]
[INFO] jclouds Components Core ........................... SUCCESS [4:18.105s]
[INFO] jclouds Azure Components Core ..................... SUCCESS [17.576s]
[INFO] jclouds OpenStack Components Core ................. SUCCESS [33.751s]
[INFO] jclouds script builder ............................ SUCCESS [16.723s]
[INFO] jclouds compute core .............................. SUCCESS [1:54.015s]
[INFO] jclouds Log4J Logging Module ...................... SUCCESS [28.657s]
[INFO] jclouds SLF4J Logging Module ...................... SUCCESS [7.487s]
[INFO] jclouds bouncycastle EncryptionService Module ..... SUCCESS [12.788s]
[INFO] jclouds sshj ssh client ........................... SUCCESS [11.286s]
[INFO] common Terremark components ....................... SUCCESS [29.160s]
[INFO] jclouds commons project ........................... SUCCESS [2.145s]
[INFO] jclouds loadbalancer core ......................... SUCCESS [8.072s]
[INFO] jcloud sts api .................................... SUCCESS [21.594s]
[INFO] jcloud cloudwatch api ............................. SUCCESS [32.471s]
[INFO] jclouds CloudSigma API ............................ SUCCESS [21.361s]
[INFO] jclouds cloudstack core ........................... SUCCESS [2:06.377s]
[INFO] jclouds blobstore core ............................ SUCCESS [1:45.161s]
[INFO] jcloud filesystem core ............................ SUCCESS [31.433s]
[INFO] jclouds bring your own node provider .............. SUCCESS [20.306s]
[INFO] jcloud s3 api ..................................... SUCCESS [54.286s]
[INFO] jcloud ec2 api .................................... SUCCESS [1:24.873s]
[INFO] jcloud sqs api .................................... SUCCESS [32.081s]
[INFO] jcloud vcloud api ................................. SUCCESS [43.309s]
[INFO] jclouds elasticstack core ......................... SUCCESS [18.233s]
[INFO] jclouds atmos components .......................... SUCCESS [21.338s]
[INFO] jcloud openstack-keystone api ..................... SUCCESS [37.024s]
[INFO] jcloud swift api .................................. SUCCESS [55.416s]
[INFO] jclouds openstack-cinder api ...................... SUCCESS [29.449s]
[INFO] jcloud openstack-nova api ......................... SUCCESS [1:50.881s]
[INFO] jclouds openstack-nova-ec2 api .................... SUCCESS [23.497s]
[INFO] jcloud cloudfiles api ............................. SUCCESS [29.636s]
[INFO] jcloud cloudservers api ........................... SUCCESS [28.793s]
[INFO] jcloud rackspace cloudidentity api ................ SUCCESS [8.278s]
[INFO] jclouds Rackspace Cloud Load Balancers API ........ SUCCESS [51.449s]
[INFO] jclouds Rackspace Next Generation Cloud Servers US provider  SUCCESS [15.859s]
[INFO] jclouds rackspace clouddns api .................... SUCCESS [35.332s]
[INFO] jclouds route53 api ............................... SUCCESS [26.825s]
[INFO] jclouds apis project .............................. SUCCESS [3.334s]
[INFO] jclouds GoGrid provider ........................... SUCCESS [27.419s]
[INFO] jclouds CloudSigma provider ....................... SUCCESS [10.720s]
[INFO] jclouds CloudSigma provider ....................... SUCCESS [10.346s]
[INFO] jclouds Azure Storage provider .................... SUCCESS [19.703s]
[INFO] jclouds Apache Http Components Client ............. SUCCESS [5.513s]
[INFO] jclouds joda DateService Module ................... SUCCESS [10.647s]
[INFO] jclouds netty payload module ...................... SUCCESS [5.592s]
[INFO] jclouds enterprise Module ......................... SUCCESS [5.984s]
[INFO] jclouds Amazon Simple Storage Service (S3) provider  SUCCESS [30.075s]
[INFO] jclouds Amazon Elastic Load Balancer provider ..... SUCCESS [7.436s]
[INFO] jclouds Amazon EC2 provider ....................... SUCCESS [1:03.498s]
[INFO] jclouds Amazon Simple Queue Service provider ...... SUCCESS [7.225s]
[INFO] jclouds ninefold storage provider ................. SUCCESS [14.394s]
[INFO] jclouds CloudOne Storage as a Service provider .... SUCCESS [13.900s]
[INFO] jclouds Bluelock vCloud Zone01 provider ........... SUCCESS [8.134s]
[INFO] jclouds Terremark Enterprise Cloud provider ....... SUCCESS [22.778s]
[INFO] jclouds Terremark vCloud Express provider ......... SUCCESS [17.771s]
[INFO] jclouds ElasticHosts Peer1 London provider ........ SUCCESS [7.950s]
[INFO] jclouds ElasticHosts Peer1 San Antonio provider ... SUCCESS [7.428s]
[INFO] jclouds ElasticHosts BlueSquare London provider ... SUCCESS [7.496s]
[INFO] jclouds ElasticHosts Peer1 Toronto provider ....... SUCCESS [7.625s]
[INFO] jclouds ElasticHosts Peer1 Los Angeles provider ... SUCCESS [8.134s]
[INFO] jclouds Open Hosting East1 provider ............... SUCCESS [9.459s]
[INFO] jclouds Serverlove Manchester provider ............ SUCCESS [8.157s]
[INFO] jclouds SkaliCloud Malaysia provider .............. SUCCESS [9.218s]
[INFO] jclouds Green House Data Element vCloud provider .. SUCCESS [8.054s]
[INFO] jclouds Go2Cloud Johannesburg1 provider ........... SUCCESS [8.228s]
[INFO] jclouds SoftLayer core ............................ SUCCESS [26.411s]
[INFO] jclouds Ninefold Compute provider ................. SUCCESS [8.585s]
[INFO] jclouds HP Cloud Compute provider ................. SUCCESS [15.683s]
[INFO] jclouds HP Cloud Object Storage ................... SUCCESS [21.331s]
[INFO] jclouds CloudServers US provider .................. SUCCESS [9.098s]
[INFO] jclouds CloudServers UK provider .................. SUCCESS [7.930s]
[INFO] jclouds CloudFiles US provider .................... SUCCESS [7.561s]
[INFO] jclouds CloudFiles UK provider .................... SUCCESS [8.932s]
[INFO] jclouds Rackspace Next Generation Cloud DNS US provider  SUCCESS [8.629s]
[INFO] jclouds Rackspace Next Generation Cloud DNS UK provider  SUCCESS [7.020s]
[INFO] jclouds Rackspace Cloud Load Balancers US provider  SUCCESS [7.715s]
[INFO] jclouds Rackspace Cloud Load Balancers UK provider  SUCCESS [8.490s]
[INFO] jclouds Rackspace Next Generation Cloud Servers provider  SUCCESS [15.115s]
[INFO] jclouds Rackspace Next Generation Cloud Block Storage US provider  SUCCESS [12.745s]
[INFO] jclouds Rackspace Next Generation Cloud Block Storage UK provider  SUCCESS [12.793s]
[INFO] jclouds GleSYS core ............................... SUCCESS [1:18.631s]
[INFO] jclouds Amazon Identity and Access Management (STS) provider  SUCCESS [7.149s]
[INFO] jclouds Amazon Route 53 provider .................. SUCCESS [6.843s]
[INFO] jcloud ultradns-ws provider ....................... SUCCESS [50.569s]
[INFO] jcloud dynect api ................................. SUCCESS [36.948s]
[INFO] jclouds providers project ......................... SUCCESS [4.352s]
[INFO] jclouds jsch ssh client ........................... SUCCESS [9.435s]
[INFO] jclouds example components for a standalone compute provider  SUCCESS [16.652s]
[INFO] jclouds skeletons project ......................... SUCCESS [1.752s]
[INFO] jclouds Google App Engine Components .............. FAILURE [12.767s]
[INFO] jclouds drivers project ........................... SKIPPED
[INFO] allcompute ........................................ SKIPPED
[INFO] allblobstore ...................................... SKIPPED
[INFO] allloadbalancer ................................... SKIPPED
[INFO] all ............................................... SKIPPED
[INFO] Apache jclouds .................................... SKIPPED
[INFO] ------------------------------------------------------------------------
[INFO] BUILD FAILURE
[INFO] ------------------------------------------------------------------------
[INFO] Total time: 41:09.957s
[INFO] Finished at: Sun Jun 30 17:27:46 UTC 2013
[INFO] Final Memory: 86M/254M
[INFO] ------------------------------------------------------------------------
mavenExecutionResult exceptions not empty
message : Failed to execute goal org.apache.maven.plugins:maven-surefire-plugin:2.12.4:test
(integration) on project jclouds-gae: Execution integration of goal org.apache.maven.plugins:maven-surefire-plugin:2.12.4:test
failed: The forked VM terminated without saying properly goodbye. VM crash or System.exit
called ?
cause : Execution integration of goal org.apache.maven.plugins:maven-surefire-plugin:2.12.4:test
failed: The forked VM terminated without saying properly goodbye. VM crash or System.exit
called ?
Stack trace : 
org.apache.maven.lifecycle.LifecycleExecutionException: Failed to execute goal org.apache.maven.plugins:maven-surefire-plugin:2.12.4:test
(integration) on project jclouds-gae: Execution integration of goal org.apache.maven.plugins:maven-surefire-plugin:2.12.4:test
failed: The forked VM terminated without saying properly goodbye. VM crash or System.exit
called ?
	at org.apache.maven.lifecycle.internal.MojoExecutor.execute(MojoExecutor.java:225)
	at org.apache.maven.lifecycle.internal.MojoExecutor.execute(MojoExecutor.java:153)
	at org.apache.maven.lifecycle.internal.MojoExecutor.execute(MojoExecutor.java:145)
	at org.apache.maven.lifecycle.internal.LifecycleModuleBuilder.buildProject(LifecycleModuleBuilder.java:84)
	at org.apache.maven.lifecycle.internal.LifecycleModuleBuilder.buildProject(LifecycleModuleBuilder.java:59)
	at org.apache.maven.lifecycle.internal.LifecycleStarter.singleThreadedBuild(LifecycleStarter.java:183)
	at org.apache.maven.lifecycle.internal.LifecycleStarter.execute(LifecycleStarter.java:161)
	at org.apache.maven.DefaultMaven.doExecute(DefaultMaven.java:320)
	at org.apache.maven.DefaultMaven.execute(DefaultMaven.java:156)
	at org.jvnet.hudson.maven3.launcher.Maven3Launcher.main(Maven3Launcher.java:79)
	at sun.reflect.NativeMethodAccessorImpl.invoke0(Native Method)
	at sun.reflect.NativeMethodAccessorImpl.invoke(NativeMethodAccessorImpl.java:57)
	at sun.reflect.DelegatingMethodAccessorImpl.invoke(DelegatingMethodAccessorImpl.java:43)
	at java.lang.reflect.Method.invoke(Method.java:601)
	at org.codehaus.plexus.classworlds.launcher.Launcher.launchStandard(Launcher.java:329)
	at org.codehaus.plexus.classworlds.launcher.Launcher.launch(Launcher.java:239)
	at org.jvnet.hudson.maven3.agent.Maven3Main.launch(Maven3Main.java:158)
	at hudson.maven.Maven3Builder.call(Maven3Builder.java:104)
	at hudson.maven.Maven3Builder.call(Maven3Builder.java:70)
	at hudson.remoting.UserRequest.perform(UserRequest.java:118)
	at hudson.remoting.UserRequest.perform(UserRequest.java:48)
	at hudson.remoting.Request$2.run(Request.java:287)
	at hudson.remoting.InterceptingExecutorService$1.call(InterceptingExecutorService.java:72)
	at java.util.concurrent.FutureTask$Sync.innerRun(FutureTask.java:334)
	at java.util.concurrent.FutureTask.run(FutureTask.java:166)
	at java.util.concurrent.ThreadPoolExecutor.runWorker(ThreadPoolExecutor.java:1145)
	at java.util.concurrent.ThreadPoolExecutor$Worker.run(ThreadPoolExecutor.java:615)
	at java.lang.Thread.run(Thread.java:722)
Caused by: org.apache.maven.plugin.PluginExecutionException: Execution integration of goal
org.apache.maven.plugins:maven-surefire-plugin:2.12.4:test failed: The forked VM terminated
without saying properly goodbye. VM crash or System.exit called ?
	at org.apache.maven.plugin.DefaultBuildPluginManager.executeMojo(DefaultBuildPluginManager.java:110)
	at org.apache.maven.lifecycle.internal.MojoExecutor.execute(MojoExecutor.java:209)
	... 27 more
Caused by: java.lang.RuntimeException: The forked VM terminated without saying properly goodbye.
VM crash or System.exit called ?
	at org.apache.maven.plugin.surefire.booterclient.output.ForkClient.close(ForkClient.java:257)
	at org.apache.maven.plugin.surefire.booterclient.ForkStarter.fork(ForkStarter.java:301)
	at org.apache.maven.plugin.surefire.booterclient.ForkStarter.run(ForkStarter.java:116)
	at org.apache.maven.plugin.surefire.AbstractSurefireMojo.executeProvider(AbstractSurefireMojo.java:740)
	at org.apache.maven.plugin.surefire.AbstractSurefireMojo.executeAllProviders(AbstractSurefireMojo.java:682)
	at org.apache.maven.plugin.surefire.AbstractSurefireMojo.executeAfterPreconditionsChecked(AbstractSurefireMojo.java:648)
	at org.apache.maven.plugin.surefire.AbstractSurefireMojo.execute(AbstractSurefireMojo.java:586)
	at org.apache.maven.plugin.DefaultBuildPluginManager.executeMojo(DefaultBuildPluginManager.java:101)
	... 28 more
channel stopped

Mime
View raw message