jclouds-dev mailing list archives

Site index · List index
Message view « Date » · « Thread »
Top « Date » · « Thread »
From jenkins-no-re...@cloudbees.com
Subject Build failed in Jenkins: jclouds-chef-1.6.x-branch #32
Date Thu, 13 Jun 2013 01:24:12 GMT
See <https://jclouds.ci.cloudbees.com/job/jclouds-chef-1.6.x-branch/32/changes>

Changes:

[Andrew Bayer] Revert "[maven-release-plugin] prepare release jclouds-chef-1.6.1-incubating-rc2"

[Andrew Bayer] [maven-release-plugin] prepare release jclouds-chef-1.6.1-incubating-rc3

------------------------------------------
[...truncated 1803 lines...]
Downloading: http://repo.cloudbees.com/content/repositories/central/org/apache/maven/surefire/maven-surefire-common/2.12/maven-surefire-common-2.12.pom
Downloaded: http://repo.cloudbees.com/content/repositories/central/org/apache/maven/surefire/maven-surefire-common/2.12/maven-surefire-common-2.12.pom
(6 KB at 417.3 KB/sec)
Downloading: https://repository-jclouds.forge.cloudbees.com/release/org/apache/maven/maven-toolchain/2.0.9/maven-toolchain-2.0.9.pom
Downloading: http://repo.cloudbees.com/content/repositories/central/org/apache/maven/maven-toolchain/2.0.9/maven-toolchain-2.0.9.pom
Downloaded: http://repo.cloudbees.com/content/repositories/central/org/apache/maven/maven-toolchain/2.0.9/maven-toolchain-2.0.9.pom
(4 KB at 282.9 KB/sec)
Downloading: https://repository-jclouds.forge.cloudbees.com/release/org/apache/maven/surefire/surefire-booter/2.12/surefire-booter-2.12.jar
Downloading: https://repository-jclouds.forge.cloudbees.com/release/org/apache/maven/surefire/surefire-api/2.12/surefire-api-2.12.jar
Downloading: https://repository-jclouds.forge.cloudbees.com/release/org/apache/maven/surefire/maven-surefire-common/2.12/maven-surefire-common-2.12.jar
Downloading: https://repository-jclouds.forge.cloudbees.com/release/org/apache/maven/reporting/maven-reporting-api/2.0.9/maven-reporting-api-2.0.9.jar
Downloading: http://repo.cloudbees.com/content/repositories/central/org/apache/maven/surefire/surefire-booter/2.12/surefire-booter-2.12.jar
Downloading: http://repo.cloudbees.com/content/repositories/central/org/apache/maven/surefire/surefire-api/2.12/surefire-api-2.12.jar
Downloading: http://repo.cloudbees.com/content/repositories/central/org/apache/maven/surefire/maven-surefire-common/2.12/maven-surefire-common-2.12.jar
Downloading: http://repo.cloudbees.com/content/repositories/central/org/apache/maven/reporting/maven-reporting-api/2.0.9/maven-reporting-api-2.0.9.jar
Downloaded: http://repo.cloudbees.com/content/repositories/central/org/apache/maven/surefire/surefire-booter/2.12/surefire-booter-2.12.jar
(33 KB at 720.2 KB/sec)
Downloaded: http://repo.cloudbees.com/content/repositories/central/org/apache/maven/surefire/maven-surefire-common/2.12/maven-surefire-common-2.12.jar
(219 KB at 4458.4 KB/sec)
Downloaded: http://repo.cloudbees.com/content/repositories/central/org/apache/maven/reporting/maven-reporting-api/2.0.9/maven-reporting-api-2.0.9.jar
(10 KB at 220.0 KB/sec)
Downloaded: http://repo.cloudbees.com/content/repositories/central/org/apache/maven/surefire/surefire-api/2.12/surefire-api-2.12.jar
(122 KB at 1516.7 KB/sec)
[INFO] No tests to run.
[INFO] Surefire report directory: <https://jclouds.ci.cloudbees.com/job/jclouds-chef-1.6.x-branch/ws/project/target/surefire-reports>
Downloading: https://repository-jclouds.forge.cloudbees.com/release/org/apache/maven/surefire/surefire-testng/2.12/surefire-testng-2.12.pom
Downloading: http://repo.cloudbees.com/content/repositories/central/org/apache/maven/surefire/surefire-testng/2.12/surefire-testng-2.12.pom
Downloaded: http://repo.cloudbees.com/content/repositories/central/org/apache/maven/surefire/surefire-testng/2.12/surefire-testng-2.12.pom
(4 KB at 107.1 KB/sec)
Downloading: https://repository-jclouds.forge.cloudbees.com/release/org/apache/maven/surefire/surefire-providers/2.12/surefire-providers-2.12.pom
Downloading: http://repo.cloudbees.com/content/repositories/central/org/apache/maven/surefire/surefire-providers/2.12/surefire-providers-2.12.pom
Downloaded: http://repo.cloudbees.com/content/repositories/central/org/apache/maven/surefire/surefire-providers/2.12/surefire-providers-2.12.pom
(3 KB at 208.3 KB/sec)
Downloading: https://repository-jclouds.forge.cloudbees.com/release/org/apache/maven/surefire/surefire-testng-utils/2.12/surefire-testng-utils-2.12.pom
Downloading: http://repo.cloudbees.com/content/repositories/central/org/apache/maven/surefire/surefire-testng-utils/2.12/surefire-testng-utils-2.12.pom
Downloaded: http://repo.cloudbees.com/content/repositories/central/org/apache/maven/surefire/surefire-testng-utils/2.12/surefire-testng-utils-2.12.pom
(3 KB at 79.9 KB/sec)
Downloading: https://repository-jclouds.forge.cloudbees.com/release/org/apache/maven/surefire/surefire-grouper/2.12/surefire-grouper-2.12.pom
Downloading: http://repo.cloudbees.com/content/repositories/central/org/apache/maven/surefire/surefire-grouper/2.12/surefire-grouper-2.12.pom
Downloaded: http://repo.cloudbees.com/content/repositories/central/org/apache/maven/surefire/surefire-grouper/2.12/surefire-grouper-2.12.pom
(3 KB at 224.1 KB/sec)
Downloading: https://repository-jclouds.forge.cloudbees.com/release/org/testng/testng/5.7/testng-5.7.pom
Downloading: http://repo.cloudbees.com/content/repositories/central/org/testng/testng/5.7/testng-5.7.pom
Downloaded: http://repo.cloudbees.com/content/repositories/central/org/testng/testng/5.7/testng-5.7.pom
(12 KB at 688.9 KB/sec)
Downloading: https://repository-jclouds.forge.cloudbees.com/release/org/apache/maven/wagon/wagon-provider-api/1.0-beta-2/wagon-provider-api-1.0-beta-2.pom
Downloading: http://repo.cloudbees.com/content/repositories/central/org/apache/maven/wagon/wagon-provider-api/1.0-beta-2/wagon-provider-api-1.0-beta-2.pom
Downloaded: http://repo.cloudbees.com/content/repositories/central/org/apache/maven/wagon/wagon-provider-api/1.0-beta-2/wagon-provider-api-1.0-beta-2.pom
(680 B at 60.4 KB/sec)
Downloading: https://repository-jclouds.forge.cloudbees.com/release/org/apache/maven/wagon/wagon/1.0-beta-2/wagon-1.0-beta-2.pom
Downloading: http://repo.cloudbees.com/content/repositories/central/org/apache/maven/wagon/wagon/1.0-beta-2/wagon-1.0-beta-2.pom
Downloaded: http://repo.cloudbees.com/content/repositories/central/org/apache/maven/wagon/wagon/1.0-beta-2/wagon-1.0-beta-2.pom
(6 KB at 92.6 KB/sec)
Downloading: https://repository-jclouds.forge.cloudbees.com/release/org/apache/maven/maven-parent/4/maven-parent-4.pom
Downloading: http://repo.cloudbees.com/content/repositories/central/org/apache/maven/maven-parent/4/maven-parent-4.pom
Downloaded: http://repo.cloudbees.com/content/repositories/central/org/apache/maven/maven-parent/4/maven-parent-4.pom
(10 KB at 154.9 KB/sec)
Downloading: https://repository-jclouds.forge.cloudbees.com/release/org/apache/maven/surefire/surefire-testng-utils/2.12/surefire-testng-utils-2.12.jar
Downloading: https://repository-jclouds.forge.cloudbees.com/release/org/apache/maven/surefire/surefire-testng/2.12/surefire-testng-2.12.jar
Downloading: https://repository-jclouds.forge.cloudbees.com/release/org/apache/maven/maven-artifact/2.0/maven-artifact-2.0.jar
Downloading: https://repository-jclouds.forge.cloudbees.com/release/org/apache/maven/surefire/surefire-grouper/2.12/surefire-grouper-2.12.jar
Downloading: https://repository-jclouds.forge.cloudbees.com/release/org/codehaus/plexus/plexus-utils/1.0.4/plexus-utils-1.0.4.jar
Downloading: http://repo.cloudbees.com/content/repositories/central/org/apache/maven/surefire/surefire-testng/2.12/surefire-testng-2.12.jar
Downloading: http://repo.cloudbees.com/content/repositories/central/org/apache/maven/surefire/surefire-grouper/2.12/surefire-grouper-2.12.jar
Downloading: http://repo.cloudbees.com/content/repositories/central/org/apache/maven/surefire/surefire-testng-utils/2.12/surefire-testng-utils-2.12.jar
Downloading: http://repo.cloudbees.com/content/repositories/central/org/apache/maven/maven-artifact/2.0/maven-artifact-2.0.jar
Downloaded: http://repo.cloudbees.com/content/repositories/central/org/apache/maven/surefire/surefire-testng/2.12/surefire-testng-2.12.jar
(32 KB at 740.7 KB/sec)
Downloaded: http://repo.cloudbees.com/content/repositories/central/org/apache/maven/surefire/surefire-testng-utils/2.12/surefire-testng-utils-2.12.jar
(21 KB at 220.6 KB/sec)
Downloading: http://repo.cloudbees.com/content/repositories/central/org/codehaus/plexus/plexus-utils/1.0.4/plexus-utils-1.0.4.jar
Downloaded: http://repo.cloudbees.com/content/repositories/central/org/apache/maven/surefire/surefire-grouper/2.12/surefire-grouper-2.12.jar
(37 KB at 275.2 KB/sec)
Downloaded: http://repo.cloudbees.com/content/repositories/central/org/apache/maven/maven-artifact/2.0/maven-artifact-2.0.jar
(77 KB at 712.2 KB/sec)
Downloading: https://repository-jclouds.forge.cloudbees.com/release/org/apache/maven/maven-project/2.0.9/maven-project-2.0.9.jar
Downloading: https://repository-jclouds.forge.cloudbees.com/release/org/apache/maven/maven-plugin-api/2.0.9/maven-plugin-api-2.0.9.jar
Downloaded: http://repo.cloudbees.com/content/repositories/central/org/codehaus/plexus/plexus-utils/1.0.4/plexus-utils-1.0.4.jar
(160 KB at 2962.3 KB/sec)
Downloading: https://repository-jclouds.forge.cloudbees.com/release/org/apache/maven/maven-model/2.0.9/maven-model-2.0.9.jar
Downloading: https://repository-jclouds.forge.cloudbees.com/release/org/apache/maven/maven-settings/2.0.9/maven-settings-2.0.9.jar
Downloading: https://repository-jclouds.forge.cloudbees.com/release/org/codehaus/plexus/plexus-container-default/1.0-alpha-9-stable-1/plexus-container-default-1.0-alpha-9-stable-1.jar
Downloading: http://repo.cloudbees.com/content/repositories/central/org/apache/maven/maven-project/2.0.9/maven-project-2.0.9.jar
Downloading: http://repo.cloudbees.com/content/repositories/central/org/apache/maven/maven-plugin-api/2.0.9/maven-plugin-api-2.0.9.jar
Downloading: http://repo.cloudbees.com/content/repositories/central/org/apache/maven/maven-settings/2.0.9/maven-settings-2.0.9.jar
Downloaded: http://repo.cloudbees.com/content/repositories/central/org/apache/maven/maven-project/2.0.9/maven-project-2.0.9.jar
(119 KB at 2427.1 KB/sec)
Downloading: http://repo.cloudbees.com/content/repositories/central/org/codehaus/plexus/plexus-container-default/1.0-alpha-9-stable-1/plexus-container-default-1.0-alpha-9-stable-1.jar
Downloaded: http://repo.cloudbees.com/content/repositories/central/org/apache/maven/maven-plugin-api/2.0.9/maven-plugin-api-2.0.9.jar
(13 KB at 124.7 KB/sec)
Downloading: https://repository-jclouds.forge.cloudbees.com/release/classworlds/classworlds/1.1/classworlds-1.1.jar
Downloaded: http://repo.cloudbees.com/content/repositories/central/org/apache/maven/maven-settings/2.0.9/maven-settings-2.0.9.jar
(48 KB at 319.7 KB/sec)
Downloading: http://repo.cloudbees.com/content/repositories/central/org/apache/maven/maven-model/2.0.9/maven-model-2.0.9.jar
Downloading: https://repository-jclouds.forge.cloudbees.com/release/org/apache/maven/maven-profile/2.0.9/maven-profile-2.0.9.jar
Downloading: https://repository-jclouds.forge.cloudbees.com/release/org/apache/maven/maven-artifact-manager/2.0.9/maven-artifact-manager-2.0.9.jar
Downloaded: http://repo.cloudbees.com/content/repositories/central/org/apache/maven/maven-model/2.0.9/maven-model-2.0.9.jar
(86 KB at 1027.4 KB/sec)
Downloading: http://repo.cloudbees.com/content/repositories/central/classworlds/classworlds/1.1/classworlds-1.1.jar
Downloaded: http://repo.cloudbees.com/content/repositories/central/org/codehaus/plexus/plexus-container-default/1.0-alpha-9-stable-1/plexus-container-default-1.0-alpha-9-stable-1.jar
(190 KB at 998.1 KB/sec)
Downloading: https://repository-jclouds.forge.cloudbees.com/release/org/apache/maven/maven-repository-metadata/2.0.9/maven-repository-metadata-2.0.9.jar
Downloaded: http://repo.cloudbees.com/content/repositories/central/classworlds/classworlds/1.1/classworlds-1.1.jar
(37 KB at 901.6 KB/sec)
Downloading: http://repo.cloudbees.com/content/repositories/central/org/apache/maven/maven-profile/2.0.9/maven-profile-2.0.9.jar
Downloading: https://repository-jclouds.forge.cloudbees.com/release/org/apache/maven/maven-plugin-registry/2.0.9/maven-plugin-registry-2.0.9.jar
Downloaded: http://repo.cloudbees.com/content/repositories/central/org/apache/maven/maven-profile/2.0.9/maven-profile-2.0.9.jar
(35 KB at 2158.1 KB/sec)
Downloading: https://repository-jclouds.forge.cloudbees.com/release/org/apache/maven/wagon/wagon-provider-api/1.0-beta-2/wagon-provider-api-1.0-beta-2.jar
Downloading: http://repo.cloudbees.com/content/repositories/central/org/apache/maven/maven-artifact-manager/2.0.9/maven-artifact-manager-2.0.9.jar
Downloading: http://repo.cloudbees.com/content/repositories/central/org/apache/maven/maven-repository-metadata/2.0.9/maven-repository-metadata-2.0.9.jar
Downloading: https://repository-jclouds.forge.cloudbees.com/release/org/apache/maven/maven-core/2.0.9/maven-core-2.0.9.jar
Downloading: http://repo.cloudbees.com/content/repositories/central/org/apache/maven/maven-plugin-registry/2.0.9/maven-plugin-registry-2.0.9.jar
Downloaded: http://repo.cloudbees.com/content/repositories/central/org/apache/maven/maven-repository-metadata/2.0.9/maven-repository-metadata-2.0.9.jar
(24 KB at 615.0 KB/sec)
Downloaded: http://repo.cloudbees.com/content/repositories/central/org/apache/maven/maven-artifact-manager/2.0.9/maven-artifact-manager-2.0.9.jar
(57 KB at 324.6 KB/sec)
Downloaded: http://repo.cloudbees.com/content/repositories/central/org/apache/maven/maven-plugin-registry/2.0.9/maven-plugin-registry-2.0.9.jar
(29 KB at 199.9 KB/sec)
Downloading: https://repository-jclouds.forge.cloudbees.com/release/org/apache/maven/maven-plugin-parameter-documenter/2.0.9/maven-plugin-parameter-documenter-2.0.9.jar
Downloading: http://repo.cloudbees.com/content/repositories/central/org/apache/maven/maven-core/2.0.9/maven-core-2.0.9.jar
Downloading: https://repository-jclouds.forge.cloudbees.com/release/org/apache/maven/maven-error-diagnostics/2.0.9/maven-error-diagnostics-2.0.9.jar
Downloading: http://repo.cloudbees.com/content/repositories/central/org/apache/maven/wagon/wagon-provider-api/1.0-beta-2/wagon-provider-api-1.0-beta-2.jar
Downloading: https://repository-jclouds.forge.cloudbees.com/release/org/apache/maven/maven-plugin-descriptor/2.0.9/maven-plugin-descriptor-2.0.9.jar
Downloaded: http://repo.cloudbees.com/content/repositories/central/org/apache/maven/wagon/wagon-provider-api/1.0-beta-2/wagon-provider-api-1.0-beta-2.jar
(46 KB at 2513.3 KB/sec)
Downloaded: http://repo.cloudbees.com/content/repositories/central/org/apache/maven/maven-core/2.0.9/maven-core-2.0.9.jar
(156 KB at 6777.8 KB/sec)
Downloading: http://repo.cloudbees.com/content/repositories/central/org/apache/maven/maven-error-diagnostics/2.0.9/maven-error-diagnostics-2.0.9.jar
Downloading: http://repo.cloudbees.com/content/repositories/central/org/apache/maven/maven-plugin-parameter-documenter/2.0.9/maven-plugin-parameter-documenter-2.0.9.jar
Downloading: http://repo.cloudbees.com/content/repositories/central/org/apache/maven/maven-plugin-descriptor/2.0.9/maven-plugin-descriptor-2.0.9.jar
Downloading: https://repository-jclouds.forge.cloudbees.com/release/org/apache/maven/maven-toolchain/2.0.9/maven-toolchain-2.0.9.jar
Downloading: https://repository-jclouds.forge.cloudbees.com/release/org/apache/maven/maven-monitor/2.0.9/maven-monitor-2.0.9.jar
Downloaded: http://repo.cloudbees.com/content/repositories/central/org/apache/maven/maven-error-diagnostics/2.0.9/maven-error-diagnostics-2.0.9.jar
(14 KB at 292.7 KB/sec)
Downloaded: http://repo.cloudbees.com/content/repositories/central/org/apache/maven/maven-plugin-parameter-documenter/2.0.9/maven-plugin-parameter-documenter-2.0.9.jar
(21 KB at 509.7 KB/sec)
Downloading: http://repo.cloudbees.com/content/repositories/central/org/apache/maven/maven-toolchain/2.0.9/maven-toolchain-2.0.9.jar
Downloading: http://repo.cloudbees.com/content/repositories/central/org/apache/maven/maven-monitor/2.0.9/maven-monitor-2.0.9.jar
Downloaded: http://repo.cloudbees.com/content/repositories/central/org/apache/maven/maven-toolchain/2.0.9/maven-toolchain-2.0.9.jar
(38 KB at 927.1 KB/sec)
Downloaded: http://repo.cloudbees.com/content/repositories/central/org/apache/maven/maven-monitor/2.0.9/maven-monitor-2.0.9.jar
(11 KB at 627.5 KB/sec)
Downloaded: http://repo.cloudbees.com/content/repositories/central/org/apache/maven/maven-plugin-descriptor/2.0.9/maven-plugin-descriptor-2.0.9.jar
(37 KB at 270.0 KB/sec)

-------------------------------------------------------
 T E S T S
-------------------------------------------------------

Results :

Tests run: 0, Failures: 0, Errors: 0, Skipped: 0

mojoSucceeded org.apache.maven.plugins:maven-surefire-plugin:2.12(integration)
[JENKINS] Recording test resultsDownloading: https://repository-jclouds.forge.cloudbees.com/release/org/codehaus/plexus/plexus-digest/1.0/plexus-digest-1.0.pom

Downloading: http://repo.cloudbees.com/content/repositories/central/org/codehaus/plexus/plexus-digest/1.0/plexus-digest-1.0.pom
mojoStarted org.apache.maven.plugins:maven-install-plugin:2.3.1(default-install)
[INFO] 
[INFO] --- maven-install-plugin:2.3.1:install (default-install) @ chef-parent ---
Downloaded: http://repo.cloudbees.com/content/repositories/central/org/codehaus/plexus/plexus-digest/1.0/plexus-digest-1.0.pom
(2 KB at 94.0 KB/sec)
Downloading: https://repository-jclouds.forge.cloudbees.com/release/org/codehaus/plexus/plexus-components/1.1.7/plexus-components-1.1.7.pom
Downloading: http://repo.cloudbees.com/content/repositories/central/org/codehaus/plexus/plexus-components/1.1.7/plexus-components-1.1.7.pom
Downloaded: http://repo.cloudbees.com/content/repositories/central/org/codehaus/plexus/plexus-components/1.1.7/plexus-components-1.1.7.pom
(5 KB at 156.7 KB/sec)
Downloading: https://repository-jclouds.forge.cloudbees.com/release/org/codehaus/plexus/plexus-utils/2.0.5/plexus-utils-2.0.5.jar
Downloading: https://repository-jclouds.forge.cloudbees.com/release/org/codehaus/plexus/plexus-digest/1.0/plexus-digest-1.0.jar
Downloading: http://repo.cloudbees.com/content/repositories/central/org/codehaus/plexus/plexus-utils/2.0.5/plexus-utils-2.0.5.jar
Downloading: http://repo.cloudbees.com/content/repositories/central/org/codehaus/plexus/plexus-digest/1.0/plexus-digest-1.0.jar
Downloaded: http://repo.cloudbees.com/content/repositories/central/org/codehaus/plexus/plexus-digest/1.0/plexus-digest-1.0.jar
(12 KB at 965.0 KB/sec)
Downloaded: http://repo.cloudbees.com/content/repositories/central/org/codehaus/plexus/plexus-utils/2.0.5/plexus-utils-2.0.5.jar
(218 KB at 2115.9 KB/sec)
[INFO] Installing <https://jclouds.ci.cloudbees.com/job/jclouds-chef-1.6.x-branch/ws/project/pom.xml>
to <https://jclouds.ci.cloudbees.com/job/jclouds-chef-1.6.x-branch/ws/.repository/org/apache/jclouds/chef/chef-parent/1.6.1-incubating/chef-parent-1.6.1-incubating.pom>
[INFO] Installing <https://jclouds.ci.cloudbees.com/job/jclouds-chef-1.6.x-branch/ws/project/target/chef-parent-1.6.1-incubating-tests.jar>
to <https://jclouds.ci.cloudbees.com/job/jclouds-chef-1.6.x-branch/ws/.repository/org/apache/jclouds/chef/chef-parent/1.6.1-incubating/chef-parent-1.6.1-incubating-tests.jar>
mojoSucceeded org.apache.maven.plugins:maven-install-plugin:2.3.1(default-install)
mojoStarted org.apache.maven.plugins:maven-deploy-plugin:2.7(default-deploy)Downloading: https://repository-jclouds.forge.cloudbees.com/release/org/codehaus/plexus/plexus-utils/1.5.6/plexus-utils-1.5.6.jar

[INFO] 
[INFO] --- maven-deploy-plugin:2.7:deploy (default-deploy) @ chef-parent ---
Downloading: http://repo.cloudbees.com/content/repositories/central/org/codehaus/plexus/plexus-utils/1.5.6/plexus-utils-1.5.6.jar
Downloaded: http://repo.cloudbees.com/content/repositories/central/org/codehaus/plexus/plexus-utils/1.5.6/plexus-utils-1.5.6.jar
(245 KB at 3351.7 KB/sec)
Uploading: https://repository.apache.org/service/local/staging/deploy/maven2/org/apache/jclouds/chef/chef-parent/1.6.1-incubating/chef-parent-1.6.1-incubating.pom
mojoFailed org.apache.maven.plugins:maven-deploy-plugin:2.7(default-deploy)
projectFailed org.apache.jclouds.chef:chef-parent:1.6.1-incubating
sessionEnded
[INFO] ------------------------------------------------------------------------
[INFO] Reactor Summary:
[INFO] 
[INFO] JClouds Chef :: Parent POM ........................ FAILURE [45.021s]
[INFO] JClouds Chef :: Core .............................. SKIPPED
[INFO] JClouds Chef :: Servlet ........................... SKIPPED
[INFO] JClouds Chef :: Compute ........................... SKIPPED
[INFO] JClouds Chef :: Hosted Chef ....................... SKIPPED
[INFO] JClouds Chef :: Private Chef ...................... SKIPPED
[INFO] JClouds Chef :: Labs .............................. SKIPPED
[INFO] JClouds Chef :: Project POM ....................... SKIPPED
[INFO] ------------------------------------------------------------------------
[INFO] BUILD FAILURE
[INFO] ------------------------------------------------------------------------
[INFO] Total time: 57.462s
[INFO] Finished at: Wed Jun 12 21:24:06 EDT 2013
[Unloading class GregorSamsa$2]
[Unloading class GregorSamsa$1]
[Unloading class GregorSamsa$0]
[Unloading class GregorSamsa]
[INFO] Final Memory: 20M/142M
[INFO] ------------------------------------------------------------------------
Projects to build: [MavenProject: org.apache.jclouds.chef:chef-parent:1.6.1-incubating @ <https://jclouds.ci.cloudbees.com/job/jclouds-chef-1.6.x-branch/ws/project/pom.xml,>
MavenProject: org.apache.jclouds.api:chef:1.6.1-incubating @ <https://jclouds.ci.cloudbees.com/job/jclouds-chef-1.6.x-branch/ws/core/pom.xml,>
MavenProject: org.apache.jclouds.chef:chef-servlet:1.6.1-incubating @ <https://jclouds.ci.cloudbees.com/job/jclouds-chef-1.6.x-branch/ws/servlet/pom.xml,>
MavenProject: org.apache.jclouds.chef:chef-compute:1.6.1-incubating @ <https://jclouds.ci.cloudbees.com/job/jclouds-chef-1.6.x-branch/ws/compute/pom.xml,>
MavenProject: org.apache.jclouds.labs:hostedchef:1.6.1-incubating @ <https://jclouds.ci.cloudbees.com/job/jclouds-chef-1.6.x-branch/ws/labs/hostedchef/pom.xml,>
MavenProject: org.apache.jclouds.labs:privatechef:1.6.1-incubating @ <https://jclouds.ci.cloudbees.com/job/jclouds-chef-1.6.x-branch/ws/labs/privatechef/pom.xml,>
MavenProject: org.apache.jclouds.labs:chef-labs-project:1.6.1-incubating @ <https://jclouds.ci.cloudbees.com/job/jclouds-chef-1.6.x-branch/ws/labs/pom.xml,>
MavenProject: org.apache.jclouds.chef:jclouds-chef:1.6.1-incubating @ <https://jclouds.ci.cloudbees.com/job/jclouds-chef-1.6.x-branch/ws/pom.xml]>
[JENKINS] Archiving <https://jclouds.ci.cloudbees.com/job/jclouds-chef-1.6.x-branch/ws/labs/privatechef/pom.xml>
to /home/jclouds/hudson_home/jobs/jclouds-chef-1.6.x-branch/modules/org.apache.jclouds.labs$privatechef/builds/2013-06-12_21-22-57/archive/org.apache.jclouds.labs/privatechef/1.6.1-incubating/privatechef-1.6.1-incubating.pom
[JENKINS] Archiving <https://jclouds.ci.cloudbees.com/job/jclouds-chef-1.6.x-branch/ws/pom.xml>
to /home/jclouds/hudson_home/jobs/jclouds-chef-1.6.x-branch/modules/org.apache.jclouds.chef$jclouds-chef/builds/2013-06-12_21-22-57/archive/org.apache.jclouds.chef/jclouds-chef/1.6.1-incubating/jclouds-chef-1.6.1-incubating.pom
[JENKINS] Archiving <https://jclouds.ci.cloudbees.com/job/jclouds-chef-1.6.x-branch/ws/labs/pom.xml>
to /home/jclouds/hudson_home/jobs/jclouds-chef-1.6.x-branch/modules/org.apache.jclouds.labs$chef-labs-project/builds/2013-06-12_21-22-57/archive/org.apache.jclouds.labs/chef-labs-project/1.6.1-incubating/chef-labs-project-1.6.1-incubating.pom
[JENKINS] Archiving <https://jclouds.ci.cloudbees.com/job/jclouds-chef-1.6.x-branch/ws/servlet/pom.xml>
to /home/jclouds/hudson_home/jobs/jclouds-chef-1.6.x-branch/modules/org.apache.jclouds.chef$chef-servlet/builds/2013-06-12_21-22-57/archive/org.apache.jclouds.chef/chef-servlet/1.6.1-incubating/chef-servlet-1.6.1-incubating.pom
[JENKINS] Archiving <https://jclouds.ci.cloudbees.com/job/jclouds-chef-1.6.x-branch/ws/compute/pom.xml>
to /home/jclouds/hudson_home/jobs/jclouds-chef-1.6.x-branch/modules/org.apache.jclouds.chef$chef-compute/builds/2013-06-12_21-22-57/archive/org.apache.jclouds.chef/chef-compute/1.6.1-incubating/chef-compute-1.6.1-incubating.pom
[JENKINS] Archiving <https://jclouds.ci.cloudbees.com/job/jclouds-chef-1.6.x-branch/ws/core/pom.xml>
to /home/jclouds/hudson_home/jobs/jclouds-chef-1.6.x-branch/modules/org.apache.jclouds.api$chef/builds/2013-06-12_21-22-57/archive/org.apache.jclouds.api/chef/1.6.1-incubating/chef-1.6.1-incubating.pom
[JENKINS] Archiving <https://jclouds.ci.cloudbees.com/job/jclouds-chef-1.6.x-branch/ws/project/pom.xml>
to /home/jclouds/hudson_home/jobs/jclouds-chef-1.6.x-branch/modules/org.apache.jclouds.chef$chef-parent/builds/2013-06-12_21-22-57/archive/org.apache.jclouds.chef/chef-parent/1.6.1-incubating/chef-parent-1.6.1-incubating.pom
[JENKINS] Archiving <https://jclouds.ci.cloudbees.com/job/jclouds-chef-1.6.x-branch/ws/project/target/chef-parent-1.6.1-incubating-tests.jar>
to /home/jclouds/hudson_home/jobs/jclouds-chef-1.6.x-branch/modules/org.apache.jclouds.chef$chef-parent/builds/2013-06-12_21-22-57/archive/org.apache.jclouds.chef/chef-parent/1.6.1-incubating/chef-parent-1.6.1-incubating-tests.jar
[JENKINS] Archiving <https://jclouds.ci.cloudbees.com/job/jclouds-chef-1.6.x-branch/ws/labs/hostedchef/pom.xml>
to /home/jclouds/hudson_home/jobs/jclouds-chef-1.6.x-branch/modules/org.apache.jclouds.labs$hostedchef/builds/2013-06-12_21-22-57/archive/org.apache.jclouds.labs/hostedchef/1.6.1-incubating/hostedchef-1.6.1-incubating.pom
[WARNING] The requested profile "src" could not be activated because it does not exist.
Waiting for Jenkins to finish collecting data
mavenExecutionResult exceptions not empty
message : Failed to execute goal org.apache.maven.plugins:maven-deploy-plugin:2.7:deploy (default-deploy)
on project chef-parent: Failed to deploy artifacts: Could not transfer artifact org.apache.jclouds.chef:chef-parent:pom:1.6.1-incubating
from/to apache.releases.https (https://repository.apache.org/service/local/staging/deploy/maven2):
Failed to transfer file: https://repository.apache.org/service/local/staging/deploy/maven2/org/apache/jclouds/chef/chef-parent/1.6.1-incubating/chef-parent-1.6.1-incubating.pom.
Return code is: 401
cause : Failed to deploy artifacts: Could not transfer artifact org.apache.jclouds.chef:chef-parent:pom:1.6.1-incubating
from/to apache.releases.https (https://repository.apache.org/service/local/staging/deploy/maven2):
Failed to transfer file: https://repository.apache.org/service/local/staging/deploy/maven2/org/apache/jclouds/chef/chef-parent/1.6.1-incubating/chef-parent-1.6.1-incubating.pom.
Return code is: 401
Stack trace : 
org.apache.maven.lifecycle.LifecycleExecutionException: Failed to execute goal org.apache.maven.plugins:maven-deploy-plugin:2.7:deploy
(default-deploy) on project chef-parent: Failed to deploy artifacts: Could not transfer artifact
org.apache.jclouds.chef:chef-parent:pom:1.6.1-incubating from/to apache.releases.https (https://repository.apache.org/service/local/staging/deploy/maven2):
Failed to transfer file: https://repository.apache.org/service/local/staging/deploy/maven2/org/apache/jclouds/chef/chef-parent/1.6.1-incubating/chef-parent-1.6.1-incubating.pom.
Return code is: 401
	at org.apache.maven.lifecycle.internal.MojoExecutor.execute(MojoExecutor.java:217)
	at org.apache.maven.lifecycle.internal.MojoExecutor.execute(MojoExecutor.java:153)
	at org.apache.maven.lifecycle.internal.MojoExecutor.execute(MojoExecutor.java:145)
	at org.apache.maven.lifecycle.internal.LifecycleModuleBuilder.buildProject(LifecycleModuleBuilder.java:84)
	at org.apache.maven.lifecycle.internal.LifecycleModuleBuilder.buildProject(LifecycleModuleBuilder.java:59)
	at org.apache.maven.lifecycle.internal.LifecycleStarter.singleThreadedBuild(LifecycleStarter.java:183)
	at org.apache.maven.lifecycle.internal.LifecycleStarter.execute(LifecycleStarter.java:161)
	at org.apache.maven.DefaultMaven.doExecute(DefaultMaven.java:319)
	at org.apache.maven.DefaultMaven.execute(DefaultMaven.java:156)
	at org.jvnet.hudson.maven3.launcher.Maven3Launcher.main(Maven3Launcher.java:79)
	at sun.reflect.NativeMethodAccessorImpl.invoke0(Native Method)
	at sun.reflect.NativeMethodAccessorImpl.invoke(NativeMethodAccessorImpl.java:39)
	at sun.reflect.DelegatingMethodAccessorImpl.invoke(DelegatingMethodAccessorImpl.java:25)
	at java.lang.reflect.Method.invoke(Method.java:597)
	at org.codehaus.plexus.classworlds.launcher.Launcher.launchStandard(Launcher.java:329)
	at org.codehaus.plexus.classworlds.launcher.Launcher.launch(Launcher.java:239)
	at org.jvnet.hudson.maven3.agent.Maven3Main.launch(Maven3Main.java:158)
	at hudson.maven.Maven3Builder.call(Maven3Builder.java:98)
	at hudson.maven.Maven3Builder.call(Maven3Builder.java:64)
	at hudson.remoting.UserRequest.perform(UserRequest.java:118)
	at hudson.remoting.UserRequest.perform(UserRequest.java:48)
	at hudson.remoting.Request$2.run(Request.java:326)
	at hudson.remoting.InterceptingExecutorService$1.call(InterceptingExecutorService.java:72)
	at java.util.concurrent.FutureTask$Sync.innerRun(FutureTask.java:303)
	at java.util.concurrent.FutureTask.run(FutureTask.java:138)
	at java.util.concurrent.ThreadPoolExecutor$Worker.runTask(ThreadPoolExecutor.java:895)
	at java.util.concurrent.ThreadPoolExecutor$Worker.run(ThreadPoolExecutor.java:918)
	at java.lang.Thread.run(Thread.java:662)
Caused by: org.apache.maven.plugin.MojoExecutionException: Failed to deploy artifacts: Could
not transfer artifact org.apache.jclouds.chef:chef-parent:pom:1.6.1-incubating from/to apache.releases.https
(https://repository.apache.org/service/local/staging/deploy/maven2): Failed to transfer file:
https://repository.apache.org/service/local/staging/deploy/maven2/org/apache/jclouds/chef/chef-parent/1.6.1-incubating/chef-parent-1.6.1-incubating.pom.
Return code is: 401
	at org.apache.maven.plugin.deploy.DeployMojo.execute(DeployMojo.java:193)
	at org.apache.maven.plugin.DefaultBuildPluginManager.executeMojo(DefaultBuildPluginManager.java:101)
	at org.apache.maven.lifecycle.internal.MojoExecutor.execute(MojoExecutor.java:209)
	... 27 more
Caused by: org.apache.maven.artifact.deployer.ArtifactDeploymentException: Failed to deploy
artifacts: Could not transfer artifact org.apache.jclouds.chef:chef-parent:pom:1.6.1-incubating
from/to apache.releases.https (https://repository.apache.org/service/local/staging/deploy/maven2):
Failed to transfer file: https://repository.apache.org/service/local/staging/deploy/maven2/org/apache/jclouds/chef/chef-parent/1.6.1-incubating/chef-parent-1.6.1-incubating.pom.
Return code is: 401
	at org.apache.maven.artifact.deployer.DefaultArtifactDeployer.deploy(DefaultArtifactDeployer.java:141)
	at org.apache.maven.plugin.deploy.AbstractDeployMojo.deploy(AbstractDeployMojo.java:167)
	at org.apache.maven.plugin.deploy.DeployMojo.execute(DeployMojo.java:149)
	... 29 more
Caused by: org.sonatype.aether.deployment.DeploymentException: Failed to deploy artifacts:
Could not transfer artifact org.apache.jclouds.chef:chef-parent:pom:1.6.1-incubating from/to
apache.releases.https (https://repository.apache.org/service/local/staging/deploy/maven2):
Failed to transfer file: https://repository.apache.org/service/local/staging/deploy/maven2/org/apache/jclouds/chef/chef-parent/1.6.1-incubating/chef-parent-1.6.1-incubating.pom.
Return code is: 401
	at org.sonatype.aether.impl.internal.DefaultDeployer.deploy(DefaultDeployer.java:284)
	at org.sonatype.aether.impl.internal.DefaultDeployer.deploy(DefaultDeployer.java:215)
	at org.sonatype.aether.impl.internal.DefaultRepositorySystem.deploy(DefaultRepositorySystem.java:480)
	at org.apache.maven.artifact.deployer.DefaultArtifactDeployer.deploy(DefaultArtifactDeployer.java:137)
	... 31 more
Caused by: org.sonatype.aether.transfer.ArtifactTransferException: Could not transfer artifact
org.apache.jclouds.chef:chef-parent:pom:1.6.1-incubating from/to apache.releases.https (https://repository.apache.org/service/local/staging/deploy/maven2):
Failed to transfer file: https://repository.apache.org/service/local/staging/deploy/maven2/org/apache/jclouds/chef/chef-parent/1.6.1-incubating/chef-parent-1.6.1-incubating.pom.
Return code is: 401
	at org.sonatype.aether.connector.wagon.WagonRepositoryConnector$4.wrap(WagonRepositoryConnector.java:949)
	at org.sonatype.aether.connector.wagon.WagonRepositoryConnector$4.wrap(WagonRepositoryConnector.java:940)
	at org.sonatype.aether.connector.wagon.WagonRepositoryConnector$PutTask.flush(WagonRepositoryConnector.java:864)
	at org.sonatype.aether.connector.wagon.WagonRepositoryConnector.put(WagonRepositoryConnector.java:466)
	at org.sonatype.aether.impl.internal.DefaultDeployer.deploy(DefaultDeployer.java:278)
	... 34 more
Caused by: org.apache.maven.wagon.TransferFailedException: Failed to transfer file: https://repository.apache.org/service/local/staging/deploy/maven2/org/apache/jclouds/chef/chef-parent/1.6.1-incubating/chef-parent-1.6.1-incubating.pom.
Return code is: 401
	at org.apache.maven.wagon.providers.http.LightweightHttpWagon.finishPutTransfer(LightweightHttpWagon.java:205)
	at org.apache.maven.wagon.AbstractWagon.putTransfer(AbstractWagon.java:413)
	at org.apache.maven.wagon.AbstractWagon.transfer(AbstractWagon.java:392)
	at org.apache.maven.wagon.AbstractWagon.putTransfer(AbstractWagon.java:365)
	at org.apache.maven.wagon.StreamWagon.put(StreamWagon.java:163)
	at org.sonatype.aether.connector.wagon.WagonRepositoryConnector$PutTask.run(WagonRepositoryConnector.java:825)
	at org.sonatype.aether.connector.wagon.WagonRepositoryConnector.put(WagonRepositoryConnector.java:465)
	... 35 more
Sending e-mails to: dev@jclouds.incubator.apache.org
channel stopped

Mime
View raw message