jclouds-dev mailing list archives

Site index · List index
Message view « Date » · « Thread »
Top « Date » · « Thread »
From jenkins-no-re...@cloudbees.com
Subject Build failed in Jenkins: jclouds-karaf #270
Date Mon, 03 Jun 2013 23:33:54 GMT
See <https://jclouds.ci.cloudbees.com/job/jclouds-karaf/270/>

------------------------------------------
[...truncated 71 lines...]
[INFO] 
[INFO] --- apache-rat-plugin:0.8:check (default) @ jclouds-karaf ---
[INFO] Exclude: **/BUILD.txt
[INFO] Exclude: **/CHANGES.txt
[INFO] Exclude: **/NOTICE-src.txt
[INFO] Exclude: **/README.md
[INFO] Exclude: .git/**
[INFO] Exclude: **/.gitignore
[INFO] Exclude: **/*.json
[INFO] Exclude: **/*.log*
[INFO] Exclude: **/TODO
[INFO] Exclude: .mailmap
[INFO] Exclude: .idea/**
[INFO] Exclude: **/*.iml
[INFO] Exclude: **/.project
[INFO] Exclude: **/.classpath
[INFO] Exclude: **/.settings/**
[INFO] Exclude: **/.checkstyle
[INFO] Exclude: **/target/**
[INFO] Exclude: .repository/**
[INFO] Exclude: **/src/main/resources/**/*.txt
mojoSucceeded org.apache.rat:apache-rat-plugin:0.8(default)
mojoStarted org.apache.maven.plugins:maven-install-plugin:2.3.1(default-install)
[INFO] 
[INFO] --- maven-install-plugin:2.3.1:install (default-install) @ jclouds-karaf ---
[INFO] Installing <https://jclouds.ci.cloudbees.com/job/jclouds-karaf/ws/pom.xml> to
/home/jenkins/.m2/repository/org/apache/jclouds/jclouds-karaf/1.7.0-SNAPSHOT/jclouds-karaf-1.7.0-SNAPSHOT.pom
mojoSucceeded org.apache.maven.plugins:maven-install-plugin:2.3.1(default-install)
mojoStarted org.apache.maven.plugins:maven-deploy-plugin:2.7(default-deploy)
[INFO] 
[INFO] --- maven-deploy-plugin:2.7:deploy (default-deploy) @ jclouds-karaf ---
Downloading: https://repository.apache.org/content/repositories/snapshots/org/apache/jclouds/jclouds-karaf/1.7.0-SNAPSHOT/maven-metadata.xml
Downloaded: https://repository.apache.org/content/repositories/snapshots/org/apache/jclouds/jclouds-karaf/1.7.0-SNAPSHOT/maven-metadata.xml
(608 B at 0.3 KB/sec)
Uploading: https://repository.apache.org/content/repositories/snapshots/org/apache/jclouds/jclouds-karaf/1.7.0-SNAPSHOT/jclouds-karaf-1.7.0-20130603.232719-4.pom
Uploaded: https://repository.apache.org/content/repositories/snapshots/org/apache/jclouds/jclouds-karaf/1.7.0-SNAPSHOT/jclouds-karaf-1.7.0-20130603.232719-4.pom
(21 KB at 19.2 KB/sec)
Downloading: https://repository.apache.org/content/repositories/snapshots/org/apache/jclouds/jclouds-karaf/maven-metadata.xml
Downloaded: https://repository.apache.org/content/repositories/snapshots/org/apache/jclouds/jclouds-karaf/maven-metadata.xml
(413 B at 0.9 KB/sec)
Uploading: https://repository.apache.org/content/repositories/snapshots/org/apache/jclouds/jclouds-karaf/1.7.0-SNAPSHOT/maven-metadata.xml
Uploaded: https://repository.apache.org/content/repositories/snapshots/org/apache/jclouds/jclouds-karaf/1.7.0-SNAPSHOT/maven-metadata.xml
(608 B at 1.2 KB/sec)
Uploading: https://repository.apache.org/content/repositories/snapshots/org/apache/jclouds/jclouds-karaf/maven-metadata.xml
Uploaded: https://repository.apache.org/content/repositories/snapshots/org/apache/jclouds/jclouds-karaf/maven-metadata.xml
(392 B at 0.6 KB/sec)
mojoSucceeded org.apache.maven.plugins:maven-deploy-plugin:2.7(default-deploy)
projectSucceeded org.apache.jclouds:jclouds-karaf:1.7.0-SNAPSHOT
projectStarted org.apache.jclouds.karaf:core:1.7.0-SNAPSHOT
[INFO]                                                                         
[INFO] ------------------------------------------------------------------------
[INFO] Building JClouds :: Karaf :: Core 1.7.0-SNAPSHOT
[INFO] ------------------------------------------------------------------------
Downloading: https://repository-jclouds.forge.cloudbees.com/snapshot/org/apache/jclouds/jclouds-core/1.7.0-SNAPSHOT/maven-metadata.xml
Downloading: https://repository.apache.org/content/repositories/snapshots/org/apache/jclouds/jclouds-core/1.7.0-SNAPSHOT/maven-metadata.xml
Downloading: https://oss.sonatype.org/content/repositories/releases/org/apache/jclouds/jclouds-core/1.7.0-SNAPSHOT/maven-metadata.xml
Downloading: http://download.java.net/maven/2/org/apache/jclouds/jclouds-core/1.7.0-SNAPSHOT/maven-metadata.xml
Downloading: http://repository.apache.org/snapshots/org/apache/jclouds/jclouds-core/1.7.0-SNAPSHOT/maven-metadata.xml
Downloaded: http://repository.apache.org/snapshots/org/apache/jclouds/jclouds-core/1.7.0-SNAPSHOT/maven-metadata.xml
(2 KB at 4.7 KB/sec)
Downloaded: https://repository.apache.org/content/repositories/snapshots/org/apache/jclouds/jclouds-core/1.7.0-SNAPSHOT/maven-metadata.xml
(2 KB at 2.3 KB/sec)
[WARNING] Could not transfer metadata org.apache.jclouds:jclouds-core:1.7.0-SNAPSHOT/maven-metadata.xml
from/to cloudbees-private-snapshot-repository (https://repository-jclouds.forge.cloudbees.com/snapshot):
Access denied to: https://repository-jclouds.forge.cloudbees.com/snapshot/org/apache/jclouds/jclouds-core/1.7.0-SNAPSHOT/maven-metadata.xml
Downloading: https://repository-jclouds.forge.cloudbees.com/snapshot/org/apache/jclouds/jclouds-core/1.7.0-SNAPSHOT/jclouds-core-1.7.0-20130603.220850-28.pom
Downloaded: https://repository-jclouds.forge.cloudbees.com/snapshot/org/apache/jclouds/jclouds-core/1.7.0-SNAPSHOT/jclouds-core-1.7.0-20130603.220850-28.pom
(6 KB at 37.0 KB/sec)
Downloading: https://repository-jclouds.forge.cloudbees.com/snapshot/org/apache/jclouds/jclouds-project/1.7.0-SNAPSHOT/maven-metadata.xml
Downloading: https://repository.apache.org/content/repositories/snapshots/org/apache/jclouds/jclouds-project/1.7.0-SNAPSHOT/maven-metadata.xml
Downloading: https://oss.sonatype.org/content/repositories/releases/org/apache/jclouds/jclouds-project/1.7.0-SNAPSHOT/maven-metadata.xml
Downloading: http://download.java.net/maven/2/org/apache/jclouds/jclouds-project/1.7.0-SNAPSHOT/maven-metadata.xml
Downloading: http://repository.apache.org/snapshots/org/apache/jclouds/jclouds-project/1.7.0-SNAPSHOT/maven-metadata.xml
Downloaded: https://repository-jclouds.forge.cloudbees.com/snapshot/org/apache/jclouds/jclouds-project/1.7.0-SNAPSHOT/maven-metadata.xml
(825 B at 5.2 KB/sec)
Downloaded: http://repository.apache.org/snapshots/org/apache/jclouds/jclouds-project/1.7.0-SNAPSHOT/maven-metadata.xml
(825 B at 4.0 KB/sec)
Downloaded: https://repository.apache.org/content/repositories/snapshots/org/apache/jclouds/jclouds-project/1.7.0-SNAPSHOT/maven-metadata.xml
(825 B at 1.4 KB/sec)
Downloading: https://repository-jclouds.forge.cloudbees.com/snapshot/org/apache/jclouds/jclouds-project/1.7.0-SNAPSHOT/jclouds-project-1.7.0-20130603.232413-12.pom
Downloaded: https://repository-jclouds.forge.cloudbees.com/snapshot/org/apache/jclouds/jclouds-project/1.7.0-SNAPSHOT/jclouds-project-1.7.0-20130603.232413-12.pom
(37 KB at 1258.9 KB/sec)
[Unloading class GregorSamsa$0]
[Unloading class GregorSamsa$1]
[Unloading class GregorSamsa$2]
[Unloading class GregorSamsa]
Downloading: https://repository-jclouds.forge.cloudbees.com/snapshot/org/apache/jclouds/jclouds-compute/1.7.0-SNAPSHOT/maven-metadata.xml
Downloading: https://oss.sonatype.org/content/repositories/releases/org/apache/jclouds/jclouds-compute/1.7.0-SNAPSHOT/maven-metadata.xml
Downloading: https://repository.apache.org/content/repositories/snapshots/org/apache/jclouds/jclouds-compute/1.7.0-SNAPSHOT/maven-metadata.xml
Downloading: http://download.java.net/maven/2/org/apache/jclouds/jclouds-compute/1.7.0-SNAPSHOT/maven-metadata.xml
Downloaded: https://repository-jclouds.forge.cloudbees.com/snapshot/org/apache/jclouds/jclouds-compute/1.7.0-SNAPSHOT/maven-metadata.xml
(2 KB at 77.5 KB/sec)
Downloading: http://repository.apache.org/snapshots/org/apache/jclouds/jclouds-compute/1.7.0-SNAPSHOT/maven-metadata.xml
Downloaded: http://repository.apache.org/snapshots/org/apache/jclouds/jclouds-compute/1.7.0-SNAPSHOT/maven-metadata.xml
(2 KB at 6.5 KB/sec)
Downloaded: https://repository.apache.org/content/repositories/snapshots/org/apache/jclouds/jclouds-compute/1.7.0-SNAPSHOT/maven-metadata.xml
(2 KB at 2.1 KB/sec)
Downloading: https://repository-jclouds.forge.cloudbees.com/snapshot/org/apache/jclouds/jclouds-compute/1.7.0-SNAPSHOT/jclouds-compute-1.7.0-20130603.221338-26.pom
Downloaded: https://repository-jclouds.forge.cloudbees.com/snapshot/org/apache/jclouds/jclouds-compute/1.7.0-SNAPSHOT/jclouds-compute-1.7.0-20130603.221338-26.pom
(3 KB at 309.6 KB/sec)
Downloading: https://repository-jclouds.forge.cloudbees.com/snapshot/org/apache/jclouds/jclouds-scriptbuilder/1.7.0-SNAPSHOT/maven-metadata.xml
Downloading: https://repository.apache.org/content/repositories/snapshots/org/apache/jclouds/jclouds-scriptbuilder/1.7.0-SNAPSHOT/maven-metadata.xml
Downloading: https://oss.sonatype.org/content/repositories/releases/org/apache/jclouds/jclouds-scriptbuilder/1.7.0-SNAPSHOT/maven-metadata.xml
Downloading: http://download.java.net/maven/2/org/apache/jclouds/jclouds-scriptbuilder/1.7.0-SNAPSHOT/maven-metadata.xml
Downloaded: https://repository-jclouds.forge.cloudbees.com/snapshot/org/apache/jclouds/jclouds-scriptbuilder/1.7.0-SNAPSHOT/maven-metadata.xml
(2 KB at 35.0 KB/sec)
Downloading: http://repository.apache.org/snapshots/org/apache/jclouds/jclouds-scriptbuilder/1.7.0-SNAPSHOT/maven-metadata.xml
Downloaded: http://repository.apache.org/snapshots/org/apache/jclouds/jclouds-scriptbuilder/1.7.0-SNAPSHOT/maven-metadata.xml
(2 KB at 7.1 KB/sec)
[WARNING] Could not transfer metadata org.apache.jclouds:jclouds-scriptbuilder:1.7.0-SNAPSHOT/maven-metadata.xml
from/to apache-snapshots (https://repository.apache.org/content/repositories/snapshots): Error
transferring file: Connection timed out
Downloading: https://repository-jclouds.forge.cloudbees.com/snapshot/org/apache/jclouds/jclouds-scriptbuilder/1.7.0-SNAPSHOT/jclouds-scriptbuilder-1.7.0-20130603.221055-27.pom
Downloaded: https://repository-jclouds.forge.cloudbees.com/snapshot/org/apache/jclouds/jclouds-scriptbuilder/1.7.0-SNAPSHOT/jclouds-scriptbuilder-1.7.0-20130603.221055-27.pom
(3 KB at 35.9 KB/sec)
Downloading: https://repository-jclouds.forge.cloudbees.com/snapshot/org/apache/jclouds/jclouds-blobstore/1.7.0-SNAPSHOT/maven-metadata.xml
Downloading: https://oss.sonatype.org/content/repositories/releases/org/apache/jclouds/jclouds-blobstore/1.7.0-SNAPSHOT/maven-metadata.xml
Downloading: https://repository.apache.org/content/repositories/snapshots/org/apache/jclouds/jclouds-blobstore/1.7.0-SNAPSHOT/maven-metadata.xml
Downloading: http://download.java.net/maven/2/org/apache/jclouds/jclouds-blobstore/1.7.0-SNAPSHOT/maven-metadata.xml
Downloaded: https://repository-jclouds.forge.cloudbees.com/snapshot/org/apache/jclouds/jclouds-blobstore/1.7.0-SNAPSHOT/maven-metadata.xml
(2 KB at 33.3 KB/sec)
Downloading: http://repository.apache.org/snapshots/org/apache/jclouds/jclouds-blobstore/1.7.0-SNAPSHOT/maven-metadata.xml
Downloaded: https://repository.apache.org/content/repositories/snapshots/org/apache/jclouds/jclouds-blobstore/1.7.0-SNAPSHOT/maven-metadata.xml
(2 KB at 2.6 KB/sec)
[WARNING] Could not transfer metadata org.apache.jclouds:jclouds-blobstore:1.7.0-SNAPSHOT/maven-metadata.xml
from/to sonatype (https://oss.sonatype.org/content/repositories/releases/): Error transferring
file: Connection timed out
[WARNING] Could not transfer metadata org.apache.jclouds:jclouds-blobstore:1.7.0-SNAPSHOT/maven-metadata.xml
from/to apache.snapshots (http://repository.apache.org/snapshots): Error transferring file:
Connection timed out
Downloading: https://repository-jclouds.forge.cloudbees.com/snapshot/org/apache/jclouds/jclouds-blobstore/1.7.0-SNAPSHOT/jclouds-blobstore-1.7.0-20130603.222508-24.pom
Downloaded: https://repository-jclouds.forge.cloudbees.com/snapshot/org/apache/jclouds/jclouds-blobstore/1.7.0-SNAPSHOT/jclouds-blobstore-1.7.0-20130603.222508-24.pom
(4 KB at 111.0 KB/sec)
Downloading: http://repo.cloudbees.com/content/repositories/central/org/slf4j/slf4j-api/1.5.8/slf4j-api-1.5.8.pom
Downloaded: http://repo.cloudbees.com/content/repositories/central/org/slf4j/slf4j-api/1.5.8/slf4j-api-1.5.8.pom
(3 KB at 153.4 KB/sec)
Downloading: http://repo.cloudbees.com/content/repositories/central/org/slf4j/slf4j-parent/1.5.8/slf4j-parent-1.5.8.pom
Downloaded: http://repo.cloudbees.com/content/repositories/central/org/slf4j/slf4j-parent/1.5.8/slf4j-parent-1.5.8.pom
(8 KB at 658.2 KB/sec)
Downloading: https://repository.apache.org/content/repositories/snapshots/org/apache/jclouds/jclouds-core/1.7.0-SNAPSHOT/jclouds-core-1.7.0-20130603.220850-28.jar
Downloading: https://repository-jclouds.forge.cloudbees.com/snapshot/org/apache/jclouds/jclouds-compute/1.7.0-SNAPSHOT/jclouds-compute-1.7.0-20130603.221338-26.jar
Downloading: https://repository-jclouds.forge.cloudbees.com/snapshot/org/apache/jclouds/jclouds-blobstore/1.7.0-SNAPSHOT/jclouds-blobstore-1.7.0-20130603.222508-24.jar
Downloading: https://repository-jclouds.forge.cloudbees.com/snapshot/org/apache/jclouds/jclouds-scriptbuilder/1.7.0-SNAPSHOT/jclouds-scriptbuilder-1.7.0-20130603.221055-27.jar
Downloaded: https://repository-jclouds.forge.cloudbees.com/snapshot/org/apache/jclouds/jclouds-blobstore/1.7.0-SNAPSHOT/jclouds-blobstore-1.7.0-20130603.222508-24.jar
(187 KB at 264.0 KB/sec)
Downloaded: https://repository-jclouds.forge.cloudbees.com/snapshot/org/apache/jclouds/jclouds-compute/1.7.0-SNAPSHOT/jclouds-compute-1.7.0-20130603.221338-26.jar
(474 KB at 651.5 KB/sec)
Downloaded: https://repository-jclouds.forge.cloudbees.com/snapshot/org/apache/jclouds/jclouds-scriptbuilder/1.7.0-SNAPSHOT/jclouds-scriptbuilder-1.7.0-20130603.221055-27.jar
(168 KB at 254.4 KB/sec)
Downloading: http://repo.cloudbees.com/content/repositories/central/org/slf4j/slf4j-api/1.5.8/slf4j-api-1.5.8.jar
Downloaded: http://repo.cloudbees.com/content/repositories/central/org/slf4j/slf4j-api/1.5.8/slf4j-api-1.5.8.jar
(23 KB at 1431.0 KB/sec)
projectFailed org.apache.jclouds.karaf:core:1.7.0-SNAPSHOT
sessionEnded
[INFO] ------------------------------------------------------------------------
[INFO] Reactor Summary:
[INFO] 
[INFO] JClouds :: Karaf .................................. SUCCESS [25.253s]
[INFO] JClouds :: Karaf :: Core .......................... FAILURE [6:27.238s]
[INFO] JClouds :: Karaf :: Utils ......................... SKIPPED
[INFO] JClouds :: Karaf :: Recipe ........................ SKIPPED
[INFO] JClouds :: Karaf :: Cache ......................... SKIPPED
[INFO] JClouds :: Karaf :: Services ...................... SKIPPED
[INFO] JClouds :: Karaf :: Commands ...................... SKIPPED
[INFO] JClouds :: Karaf :: URL Handler ................... SKIPPED
[INFO] JClouds :: Karaf :: Chef .......................... SKIPPED
[INFO] JClouds :: Karaf :: Chef :: Core .................. SKIPPED
[INFO] JClouds :: Karaf :: Chef :: Services .............. SKIPPED
[INFO] JClouds :: Karaf :: Chef :: Commands .............. SKIPPED
[INFO] JClouds :: Karaf :: Chef :: Cache ................. SKIPPED
[INFO] JClouds :: Karaf :: Feature ....................... SKIPPED
[INFO] JClouds :: Karaf :: Integration Tests ............. SKIPPED
[INFO] ------------------------------------------------------------------------
[INFO] BUILD FAILURE
[INFO] ------------------------------------------------------------------------
[INFO] Total time: 6:59.121s
[INFO] Finished at: Mon Jun 03 19:33:49 EDT 2013
[INFO] Final Memory: 18M/122M
[INFO] ------------------------------------------------------------------------
Projects to build: [MavenProject: org.apache.jclouds:jclouds-karaf:1.7.0-SNAPSHOT @ <https://jclouds.ci.cloudbees.com/job/jclouds-karaf/ws/pom.xml,>
MavenProject: org.apache.jclouds.karaf:core:1.7.0-SNAPSHOT @ <https://jclouds.ci.cloudbees.com/job/jclouds-karaf/ws/core/pom.xml,>
MavenProject: org.apache.jclouds.karaf:utils:1.7.0-SNAPSHOT @ <https://jclouds.ci.cloudbees.com/job/jclouds-karaf/ws/utils/pom.xml,>
MavenProject: org.apache.jclouds.karaf:recipe:1.7.0-SNAPSHOT @ <https://jclouds.ci.cloudbees.com/job/jclouds-karaf/ws/recipe/pom.xml,>
MavenProject: org.apache.jclouds.karaf:cache:1.7.0-SNAPSHOT @ <https://jclouds.ci.cloudbees.com/job/jclouds-karaf/ws/cache/pom.xml,>
MavenProject: org.apache.jclouds.karaf:services:1.7.0-SNAPSHOT @ <https://jclouds.ci.cloudbees.com/job/jclouds-karaf/ws/services/pom.xml,>
MavenProject: org.apache.jclouds.karaf:commands:1.7.0-SNAPSHOT @ <https://jclouds.ci.cloudbees.com/job/jclouds-karaf/ws/commands/pom.xml,>
MavenProject: org.apache.jclouds.karaf:urlhandler:1.7.0-SNAPSHOT @ <https://jclouds.ci.cloudbees.com/job/jclouds-karaf/ws/urlhandler/pom.xml,>
MavenProject: org.apache.jclouds.karaf:chef:1.7.0-SNAPSHOT @ <https://jclouds.ci.cloudbees.com/job/jclouds-karaf/ws/chef/pom.xml,>
MavenProject: org.apache.jclouds.karaf.chef:core:1.7.0-SNAPSHOT @ <https://jclouds.ci.cloudbees.com/job/jclouds-karaf/ws/chef/core/pom.xml,>
MavenProject: org.apache.jclouds.karaf.chef:services:1.7.0-SNAPSHOT @ <https://jclouds.ci.cloudbees.com/job/jclouds-karaf/ws/chef/services/pom.xml,>
MavenProject: org.apache.jclouds.karaf.chef:commands:1.7.0-SNAPSHOT @ <https://jclouds.ci.cloudbees.com/job/jclouds-karaf/ws/chef/commands/pom.xml,>
MavenProject: org.apache.jclouds.karaf.chef:cache:1.7.0-SNAPSHOT @ <https://jclouds.ci.cloudbees.com/job/jclouds-karaf/ws/chef/cache/pom.xml,>
MavenProject: org.apache.jclouds.karaf:jclouds-karaf:1.7.0-SNAPSHOT @ <https://jclouds.ci.cloudbees.com/job/jclouds-karaf/ws/feature/pom.xml,>
MavenProject: org.apache.jclouds.karaf:itests:1.7.0-SNAPSHOT @ <https://jclouds.ci.cloudbees.com/job/jclouds-karaf/ws/itests/pom.xml]>
[JENKINS] Archiving <https://jclouds.ci.cloudbees.com/job/jclouds-karaf/ws/utils/pom.xml>
to /home/jclouds/hudson_home/jobs/jclouds-karaf/modules/org.apache.jclouds.karaf$utils/builds/2013-06-03_19-26-36/archive/org.apache.jclouds.karaf/utils/1.7.0-SNAPSHOT/utils-1.7.0-SNAPSHOT.pom
[JENKINS] Archiving <https://jclouds.ci.cloudbees.com/job/jclouds-karaf/ws/cache/pom.xml>
to /home/jclouds/hudson_home/jobs/jclouds-karaf/modules/org.apache.jclouds.karaf$cache/builds/2013-06-03_19-26-36/archive/org.apache.jclouds.karaf/cache/1.7.0-SNAPSHOT/cache-1.7.0-SNAPSHOT.pom
[JENKINS] Archiving <https://jclouds.ci.cloudbees.com/job/jclouds-karaf/ws/chef/commands/pom.xml>
to /home/jclouds/hudson_home/jobs/jclouds-karaf/modules/org.apache.jclouds.karaf.chef$commands/builds/2013-06-03_19-26-36/archive/org.apache.jclouds.karaf.chef/commands/1.7.0-SNAPSHOT/commands-1.7.0-SNAPSHOT.pom
[JENKINS] Archiving <https://jclouds.ci.cloudbees.com/job/jclouds-karaf/ws/recipe/pom.xml>
to /home/jclouds/hudson_home/jobs/jclouds-karaf/modules/org.apache.jclouds.karaf$recipe/builds/2013-06-03_19-26-36/archive/org.apache.jclouds.karaf/recipe/1.7.0-SNAPSHOT/recipe-1.7.0-SNAPSHOT.pom
[JENKINS] Archiving <https://jclouds.ci.cloudbees.com/job/jclouds-karaf/ws/feature/pom.xml>
to /home/jclouds/hudson_home/jobs/jclouds-karaf/modules/org.apache.jclouds.karaf$jclouds-karaf/builds/2013-06-03_19-26-36/archive/org.apache.jclouds.karaf/jclouds-karaf/1.7.0-SNAPSHOT/jclouds-karaf-1.7.0-SNAPSHOT.pom
[JENKINS] Archiving <https://jclouds.ci.cloudbees.com/job/jclouds-karaf/ws/commands/pom.xml>
to /home/jclouds/hudson_home/jobs/jclouds-karaf/modules/org.apache.jclouds.karaf$commands/builds/2013-06-03_19-26-36/archive/org.apache.jclouds.karaf/commands/1.7.0-SNAPSHOT/commands-1.7.0-SNAPSHOT.pom
[JENKINS] Archiving <https://jclouds.ci.cloudbees.com/job/jclouds-karaf/ws/itests/pom.xml>
to /home/jclouds/hudson_home/jobs/jclouds-karaf/modules/org.apache.jclouds.karaf$itests/builds/2013-06-03_19-26-36/archive/org.apache.jclouds.karaf/itests/1.7.0-SNAPSHOT/itests-1.7.0-SNAPSHOT.pom
[JENKINS] Archiving <https://jclouds.ci.cloudbees.com/job/jclouds-karaf/ws/urlhandler/pom.xml>
to /home/jclouds/hudson_home/jobs/jclouds-karaf/modules/org.apache.jclouds.karaf$urlhandler/builds/2013-06-03_19-26-36/archive/org.apache.jclouds.karaf/urlhandler/1.7.0-SNAPSHOT/urlhandler-1.7.0-SNAPSHOT.pom
[JENKINS] Archiving <https://jclouds.ci.cloudbees.com/job/jclouds-karaf/ws/services/pom.xml>
to /home/jclouds/hudson_home/jobs/jclouds-karaf/modules/org.apache.jclouds.karaf$services/builds/2013-06-03_19-26-36/archive/org.apache.jclouds.karaf/services/1.7.0-SNAPSHOT/services-1.7.0-SNAPSHOT.pom
[JENKINS] Archiving <https://jclouds.ci.cloudbees.com/job/jclouds-karaf/ws/chef/core/pom.xml>
to /home/jclouds/hudson_home/jobs/jclouds-karaf/modules/org.apache.jclouds.karaf.chef$core/builds/2013-06-03_19-26-36/archive/org.apache.jclouds.karaf.chef/core/1.7.0-SNAPSHOT/core-1.7.0-SNAPSHOT.pom
[JENKINS] Archiving <https://jclouds.ci.cloudbees.com/job/jclouds-karaf/ws/chef/services/pom.xml>
to /home/jclouds/hudson_home/jobs/jclouds-karaf/modules/org.apache.jclouds.karaf.chef$services/builds/2013-06-03_19-26-36/archive/org.apache.jclouds.karaf.chef/services/1.7.0-SNAPSHOT/services-1.7.0-SNAPSHOT.pom
[JENKINS] Archiving <https://jclouds.ci.cloudbees.com/job/jclouds-karaf/ws/chef/pom.xml>
to /home/jclouds/hudson_home/jobs/jclouds-karaf/modules/org.apache.jclouds.karaf$chef/builds/2013-06-03_19-26-36/archive/org.apache.jclouds.karaf/chef/1.7.0-SNAPSHOT/chef-1.7.0-SNAPSHOT.pom
[JENKINS] Archiving <https://jclouds.ci.cloudbees.com/job/jclouds-karaf/ws/pom.xml>
to /home/jclouds/hudson_home/jobs/jclouds-karaf/modules/org.apache.jclouds$jclouds-karaf/builds/2013-06-03_19-26-36/archive/org.apache.jclouds/jclouds-karaf/1.7.0-SNAPSHOT/jclouds-karaf-1.7.0-SNAPSHOT.pom
[JENKINS] Archiving <https://jclouds.ci.cloudbees.com/job/jclouds-karaf/ws/core/pom.xml>
to /home/jclouds/hudson_home/jobs/jclouds-karaf/modules/org.apache.jclouds.karaf$core/builds/2013-06-03_19-26-36/archive/org.apache.jclouds.karaf/core/1.7.0-SNAPSHOT/core-1.7.0-SNAPSHOT.pom
[JENKINS] Archiving <https://jclouds.ci.cloudbees.com/job/jclouds-karaf/ws/chef/cache/pom.xml>
to /home/jclouds/hudson_home/jobs/jclouds-karaf/modules/org.apache.jclouds.karaf.chef$cache/builds/2013-06-03_19-26-36/archive/org.apache.jclouds.karaf.chef/cache/1.7.0-SNAPSHOT/cache-1.7.0-SNAPSHOT.pom
[WARNING] The requested profile "doc" could not be activated because it does not exist.
[WARNING] The requested profile "src" could not be activated because it does not exist.
Waiting for Jenkins to finish collecting data
mavenExecutionResult exceptions not empty
message : Failed to execute goal on project core: Could not resolve dependencies for project
org.apache.jclouds.karaf:core:bundle:1.7.0-SNAPSHOT: Could not transfer artifact org.apache.jclouds:jclouds-core:jar:1.7.0-20130603.220850-28
from/to apache-snapshots (https://repository.apache.org/content/repositories/snapshots): Error
transferring file: Connection timed out
cause : Could not resolve dependencies for project org.apache.jclouds.karaf:core:bundle:1.7.0-SNAPSHOT:
Could not transfer artifact org.apache.jclouds:jclouds-core:jar:1.7.0-20130603.220850-28 from/to
apache-snapshots (https://repository.apache.org/content/repositories/snapshots): Error transferring
file: Connection timed out
Stack trace : 
org.apache.maven.lifecycle.LifecycleExecutionException: Failed to execute goal on project
core: Could not resolve dependencies for project org.apache.jclouds.karaf:core:bundle:1.7.0-SNAPSHOT:
Could not transfer artifact org.apache.jclouds:jclouds-core:jar:1.7.0-20130603.220850-28 from/to
apache-snapshots (https://repository.apache.org/content/repositories/snapshots): Error transferring
file: Connection timed out
	at org.apache.maven.lifecycle.internal.LifecycleDependencyResolver.getDependencies(LifecycleDependencyResolver.java:196)
	at org.apache.maven.lifecycle.internal.LifecycleDependencyResolver.resolveProjectDependencies(LifecycleDependencyResolver.java:108)
	at org.apache.maven.lifecycle.internal.MojoExecutor.ensureDependenciesAreResolved(MojoExecutor.java:258)
	at org.apache.maven.lifecycle.internal.MojoExecutor.execute(MojoExecutor.java:201)
	at org.apache.maven.lifecycle.internal.MojoExecutor.execute(MojoExecutor.java:153)
	at org.apache.maven.lifecycle.internal.MojoExecutor.execute(MojoExecutor.java:145)
	at org.apache.maven.lifecycle.internal.LifecycleModuleBuilder.buildProject(LifecycleModuleBuilder.java:84)
	at org.apache.maven.lifecycle.internal.LifecycleModuleBuilder.buildProject(LifecycleModuleBuilder.java:59)
	at org.apache.maven.lifecycle.internal.LifecycleStarter.singleThreadedBuild(LifecycleStarter.java:183)
	at org.apache.maven.lifecycle.internal.LifecycleStarter.execute(LifecycleStarter.java:161)
	at org.apache.maven.DefaultMaven.doExecute(DefaultMaven.java:319)
	at org.apache.maven.DefaultMaven.execute(DefaultMaven.java:156)
	at org.jvnet.hudson.maven3.launcher.Maven3Launcher.main(Maven3Launcher.java:79)
	at sun.reflect.NativeMethodAccessorImpl.invoke0(Native Method)
	at sun.reflect.NativeMethodAccessorImpl.invoke(NativeMethodAccessorImpl.java:39)
	at sun.reflect.DelegatingMethodAccessorImpl.invoke(DelegatingMethodAccessorImpl.java:25)
	at java.lang.reflect.Method.invoke(Method.java:597)
	at org.codehaus.plexus.classworlds.launcher.Launcher.launchStandard(Launcher.java:329)
	at org.codehaus.plexus.classworlds.launcher.Launcher.launch(Launcher.java:239)
	at org.jvnet.hudson.maven3.agent.Maven3Main.launch(Maven3Main.java:158)
	at hudson.maven.Maven3Builder.call(Maven3Builder.java:98)
	at hudson.maven.Maven3Builder.call(Maven3Builder.java:64)
	at hudson.remoting.UserRequest.perform(UserRequest.java:118)
	at hudson.remoting.UserRequest.perform(UserRequest.java:48)
	at hudson.remoting.Request$2.run(Request.java:326)
	at hudson.remoting.InterceptingExecutorService$1.call(InterceptingExecutorService.java:72)
	at java.util.concurrent.FutureTask$Sync.innerRun(FutureTask.java:303)
	at java.util.concurrent.FutureTask.run(FutureTask.java:138)
	at java.util.concurrent.ThreadPoolExecutor$Worker.runTask(ThreadPoolExecutor.java:895)
	at java.util.concurrent.ThreadPoolExecutor$Worker.run(ThreadPoolExecutor.java:918)
	at java.lang.Thread.run(Thread.java:662)
Caused by: org.apache.maven.project.DependencyResolutionException: Could not resolve dependencies
for project org.apache.jclouds.karaf:core:bundle:1.7.0-SNAPSHOT: Could not transfer artifact
org.apache.jclouds:jclouds-core:jar:1.7.0-20130603.220850-28 from/to apache-snapshots (https://repository.apache.org/content/repositories/snapshots):
Error transferring file: Connection timed out
	at org.apache.maven.project.DefaultProjectDependenciesResolver.resolve(DefaultProjectDependenciesResolver.java:170)
	at org.apache.maven.lifecycle.internal.LifecycleDependencyResolver.getDependencies(LifecycleDependencyResolver.java:171)
	... 30 more
Caused by: org.sonatype.aether.resolution.DependencyResolutionException: Could not transfer
artifact org.apache.jclouds:jclouds-core:jar:1.7.0-20130603.220850-28 from/to apache-snapshots
(https://repository.apache.org/content/repositories/snapshots): Error transferring file: Connection
timed out
	at org.sonatype.aether.impl.internal.DefaultRepositorySystem.resolveDependencies(DefaultRepositorySystem.java:412)
	at org.apache.maven.project.DefaultProjectDependenciesResolver.resolve(DefaultProjectDependenciesResolver.java:164)
	... 31 more
Caused by: org.sonatype.aether.resolution.ArtifactResolutionException: Could not transfer
artifact org.apache.jclouds:jclouds-core:jar:1.7.0-20130603.220850-28 from/to apache-snapshots
(https://repository.apache.org/content/repositories/snapshots): Error transferring file: Connection
timed out
	at org.sonatype.aether.impl.internal.DefaultArtifactResolver.resolve(DefaultArtifactResolver.java:541)
	at org.sonatype.aether.impl.internal.DefaultArtifactResolver.resolveArtifacts(DefaultArtifactResolver.java:220)
	at org.sonatype.aether.impl.internal.DefaultRepositorySystem.resolveDependencies(DefaultRepositorySystem.java:395)
	... 32 more
Caused by: org.sonatype.aether.transfer.ArtifactTransferException: Could not transfer artifact
org.apache.jclouds:jclouds-core:jar:1.7.0-20130603.220850-28 from/to apache-snapshots (https://repository.apache.org/content/repositories/snapshots):
Error transferring file: Connection timed out
	at org.sonatype.aether.connector.wagon.WagonRepositoryConnector$4.wrap(WagonRepositoryConnector.java:949)
	at org.sonatype.aether.connector.wagon.WagonRepositoryConnector$4.wrap(WagonRepositoryConnector.java:940)
	at org.sonatype.aether.connector.wagon.WagonRepositoryConnector$GetTask.flush(WagonRepositoryConnector.java:695)
	at org.sonatype.aether.connector.wagon.WagonRepositoryConnector$GetTask.flush(WagonRepositoryConnector.java:689)
	at org.sonatype.aether.connector.wagon.WagonRepositoryConnector.get(WagonRepositoryConnector.java:445)
	at org.sonatype.aether.impl.internal.DefaultArtifactResolver.resolve(DefaultArtifactResolver.java:460)
	... 34 more
Caused by: org.apache.maven.wagon.TransferFailedException: Error transferring file: Connection
timed out
	at org.apache.maven.wagon.providers.http.LightweightHttpWagon.fillInputData(LightweightHttpWagon.java:143)
	at org.apache.maven.wagon.StreamWagon.getInputStream(StreamWagon.java:116)
	at org.apache.maven.wagon.StreamWagon.getIfNewer(StreamWagon.java:88)
	at org.apache.maven.wagon.StreamWagon.get(StreamWagon.java:61)
	at org.sonatype.aether.connector.wagon.WagonRepositoryConnector$GetTask.run(WagonRepositoryConnector.java:608)
	at org.sonatype.aether.util.concurrency.RunnableErrorForwarder$1.run(RunnableErrorForwarder.java:64)
	... 3 more
Caused by: java.net.ConnectException: Connection timed out
	at java.net.PlainSocketImpl.socketConnect(Native Method)
	at java.net.PlainSocketImpl.doConnect(PlainSocketImpl.java:351)
	at java.net.PlainSocketImpl.connectToAddress(PlainSocketImpl.java:213)
	at java.net.PlainSocketImpl.connect(PlainSocketImpl.java:200)
	at java.net.SocksSocketImpl.connect(SocksSocketImpl.java:366)
	at java.net.Socket.connect(Socket.java:529)
	at com.sun.net.ssl.internal.ssl.SSLSocketImpl.connect(SSLSocketImpl.java:570)
	at com.sun.net.ssl.internal.ssl.BaseSSLSocketImpl.connect(BaseSSLSocketImpl.java:141)
	at sun.net.NetworkClient.doConnect(NetworkClient.java:163)
	at sun.net.www.http.HttpClient.openServer(HttpClient.java:411)
	at sun.net.www.http.HttpClient.openServer(HttpClient.java:525)
	at sun.net.www.protocol.https.HttpsClient.<init>(HttpsClient.java:272)
	at sun.net.www.protocol.https.HttpsClient.New(HttpsClient.java:329)
	at sun.net.www.protocol.https.AbstractDelegateHttpsURLConnection.getNewHttpClient(AbstractDelegateHttpsURLConnection.java:172)
	at sun.net.www.protocol.http.HttpURLConnection.plainConnect(HttpURLConnection.java:923)
	at sun.net.www.protocol.https.AbstractDelegateHttpsURLConnection.connect(AbstractDelegateHttpsURLConnection.java:158)
	at sun.net.www.protocol.http.HttpURLConnection.getInputStream(HttpURLConnection.java:1195)
	at java.net.HttpURLConnection.getResponseCode(HttpURLConnection.java:379)
	at sun.net.www.protocol.https.HttpsURLConnectionImpl.getResponseCode(HttpsURLConnectionImpl.java:318)
	at org.apache.maven.wagon.providers.http.LightweightHttpWagon.fillInputData(LightweightHttpWagon.java:115)
	... 8 more
channel stopped

Mime
View raw message