jclouds-dev mailing list archives

Site index · List index
Message view « Date » · « Thread »
Top « Date » · « Thread »
From jenkins-no-re...@cloudbees.com
Subject Build failed in Jenkins: jclouds-karaf #511
Date Wed, 01 Jan 2014 19:34:58 GMT
See <https://jclouds.ci.cloudbees.com/job/jclouds-karaf/511/>

------------------------------------------
[...truncated 7187 lines...]
[Unloading class com.sun.tools.javac.jvm.ClassFile]
[Unloading class com.sun.tools.javac.util.Convert]
[Unloading class com.sun.tools.javac.main.RecognizedOptions$7]
[Unloading class com.sun.tools.javac.util.ListBuffer$1]
[Unloading class com.sun.tools.javac.code.Symbol$ClassSymbol]
[Unloading class com.sun.tools.javac.jvm.Gen$CodeSizeOverflow]
[Unloading class com.sun.tools.javac.tree.JCTree$JCTypeCast]
[Unloading class com.sun.tools.javac.processing.JavacProcessingEnvironment]
[Unloading class com.sun.tools.javac.util.DefaultFileManager$ZipFileIndexFileObject]
[Unloading class com.sun.source.tree.CompoundAssignmentTree]
[Unloading class com.sun.tools.javac.tree.JCTree$JCFieldAccess]
[Unloading class com.sun.tools.javac.code.Attribute$Visitor]
[Unloading class com.sun.tools.javac.code.Types$1]
[Unloading class com.sun.tools.javac.jvm.UninitializedType]
[Unloading class com.sun.tools.javac.processing.AnnotationProcessingError]
[Unloading class com.sun.tools.javac.code.Type$UndetVar]
[Unloading class com.sun.tools.javac.code.Symbol]
[Unloading class com.sun.source.tree.ConditionalExpressionTree]
[Unloading class com.sun.tools.javac.jvm.Items$AssignItem]
[Unloading class com.sun.source.tree.BinaryTree]
[Unloading class com.sun.tools.javac.tree.JCTree$LetExpr]
[Unloading class com.sun.tools.javac.code.Types$19]
[Unloading class com.sun.source.tree.ExpressionTree]
[Unloading class com.sun.tools.javac.jvm.Items$MemberItem]
[Unloading class com.sun.tools.javac.tree.JCTree$JCThrow]
[Unloading class com.sun.tools.javac.code.Types$8]
[Unloading class com.sun.tools.javac.resources.compiler]
[Unloading class com.sun.tools.javac.comp.AttrContext]
[Unloading class com.sun.tools.javac.util.Log$1]
[Unloading class com.sun.tools.javac.tree.TreeInfo$1DeclScanner]
[Unloading class com.sun.tools.javac.comp.Annotate$Annotator]
[Unloading class com.sun.tools.javac.parser.Parser]
[Unloading class com.sun.tools.javac.code.Types$22]
[Unloading class com.sun.tools.javac.main.RecognizedOptions$17]
[Unloading class com.sun.tools.javac.tree.JCTree$JCParens]
[Unloading class com.sun.tools.javac.code.Type]
[Unloading class com.sun.tools.javac.code.Symtab$1]
[Unloading class com.sun.tools.javac.comp.Check$1SpecialTreeVisitor]
[Unloading class com.sun.tools.javac.code.Types$TypeRelation]
[Unloading class com.sun.tools.javac.code.Symbol$VarSymbol$1]
[Unloading class com.sun.tools.javac.jvm.Pool]
[Unloading class com.sun.tools.javac.jvm.Items$ImmediateItem]
[Unloading class com.sun.tools.javac.jvm.Gen$2]
[Unloading class com.sun.tools.javac.tree.TreeInfo$1Result]
[Unloading class com.sun.tools.javac.tree.JCTree$JCInstanceOf]
[Unloading class com.sun.tools.javac.util.DefaultFileManager]
[Unloading class com.sun.tools.javac.main.RecognizedOptions$25]
[Unloading class com.sun.tools.javac.comp.Infer$1]
[Unloading class com.sun.tools.javac.code.Attribute$Error]
[Unloading class com.sun.tools.javac.parser.Parser$1]
[Unloading class com.sun.tools.javac.tree.JCTree$JCVariableDecl]
[Unloading class com.sun.source.tree.CaseTree]
[Unloading class com.sun.tools.javac.code.Type$ClassType]
Jan 1, 2014 2:34:46 PM org.apache.maven.cli.event.ExecutionEventLogger logStats
INFO: Final Memory: 82M/236M
Jan 1, 2014 2:34:46 PM org.apache.maven.cli.event.ExecutionEventLogger sessionEnded
INFO: ------------------------------------------------------------------------
[JENKINS] Archiving <https://jclouds.ci.cloudbees.com/job/jclouds-karaf/ws/utils/pom.xml>
to /home/jclouds/hudson_home/jobs/jclouds-karaf/modules/org.apache.jclouds.karaf$utils/builds/2014-01-01_19-23-32/archive/org.apache.jclouds.karaf/utils/1.8.0-SNAPSHOT/utils-1.8.0-SNAPSHOT.pom
[JENKINS] Archiving <https://jclouds.ci.cloudbees.com/job/jclouds-karaf/ws/utils/target/utils-1.8.0-SNAPSHOT.jar>
to /home/jclouds/hudson_home/jobs/jclouds-karaf/modules/org.apache.jclouds.karaf$utils/builds/2014-01-01_19-23-32/archive/org.apache.jclouds.karaf/utils/1.8.0-20140101.192728-68/utils-1.8.0-20140101.192728-68.jar
[JENKINS] Archiving <https://jclouds.ci.cloudbees.com/job/jclouds-karaf/ws/cache/pom.xml>
to /home/jclouds/hudson_home/jobs/jclouds-karaf/modules/org.apache.jclouds.karaf$cache/builds/2014-01-01_19-23-32/archive/org.apache.jclouds.karaf/cache/1.8.0-SNAPSHOT/cache-1.8.0-SNAPSHOT.pom
[JENKINS] Archiving <https://jclouds.ci.cloudbees.com/job/jclouds-karaf/ws/cache/target/cache-1.8.0-SNAPSHOT.jar>
to /home/jclouds/hudson_home/jobs/jclouds-karaf/modules/org.apache.jclouds.karaf$cache/builds/2014-01-01_19-23-32/archive/org.apache.jclouds.karaf/cache/1.8.0-20140101.192745-68/cache-1.8.0-20140101.192745-68.jar
[JENKINS] Archiving <https://jclouds.ci.cloudbees.com/job/jclouds-karaf/ws/chef/commands/pom.xml>
to /home/jclouds/hudson_home/jobs/jclouds-karaf/modules/org.apache.jclouds.karaf.chef$commands/builds/2014-01-01_19-23-32/archive/org.apache.jclouds.karaf.chef/commands/1.8.0-SNAPSHOT/commands-1.8.0-SNAPSHOT.pom
[JENKINS] Archiving <https://jclouds.ci.cloudbees.com/job/jclouds-karaf/ws/chef/commands/target/commands-1.8.0-SNAPSHOT.jar>
to /home/jclouds/hudson_home/jobs/jclouds-karaf/modules/org.apache.jclouds.karaf.chef$commands/builds/2014-01-01_19-23-32/archive/org.apache.jclouds.karaf.chef/commands/1.8.0-20140101.193006-68/commands-1.8.0-20140101.193006-68.jar
[JENKINS] Archiving <https://jclouds.ci.cloudbees.com/job/jclouds-karaf/ws/recipe/pom.xml>
to /home/jclouds/hudson_home/jobs/jclouds-karaf/modules/org.apache.jclouds.karaf$recipe/builds/2014-01-01_19-23-32/archive/org.apache.jclouds.karaf/recipe/1.8.0-SNAPSHOT/recipe-1.8.0-SNAPSHOT.pom
[JENKINS] Archiving <https://jclouds.ci.cloudbees.com/job/jclouds-karaf/ws/recipe/target/recipe-1.8.0-SNAPSHOT.jar>
to /home/jclouds/hudson_home/jobs/jclouds-karaf/modules/org.apache.jclouds.karaf$recipe/builds/2014-01-01_19-23-32/archive/org.apache.jclouds.karaf/recipe/1.8.0-20140101.192738-68/recipe-1.8.0-20140101.192738-68.jar
[JENKINS] Archiving <https://jclouds.ci.cloudbees.com/job/jclouds-karaf/ws/feature/pom.xml>
to /home/jclouds/hudson_home/jobs/jclouds-karaf/modules/org.apache.jclouds.karaf$jclouds-karaf/builds/2014-01-01_19-23-32/archive/org.apache.jclouds.karaf/jclouds-karaf/1.8.0-SNAPSHOT/jclouds-karaf-1.8.0-SNAPSHOT.pom
[JENKINS] Archiving <https://jclouds.ci.cloudbees.com/job/jclouds-karaf/ws/feature/target/feature.xml>
to /home/jclouds/hudson_home/jobs/jclouds-karaf/modules/org.apache.jclouds.karaf$jclouds-karaf/builds/2014-01-01_19-23-32/archive/org.apache.jclouds.karaf/jclouds-karaf/1.8.0-20140101.193316-65/jclouds-karaf-1.8.0-20140101.193316-65-features.xml
[JENKINS] Archiving <https://jclouds.ci.cloudbees.com/job/jclouds-karaf/ws/feature/target/credentials.cfg>
to /home/jclouds/hudson_home/jobs/jclouds-karaf/modules/org.apache.jclouds.karaf$jclouds-karaf/builds/2014-01-01_19-23-32/archive/org.apache.jclouds.karaf/jclouds-karaf/1.8.0-20140101.193316-65/jclouds-karaf-1.8.0-20140101.193316-65-credentials.cfg
[JENKINS] Archiving <https://jclouds.ci.cloudbees.com/job/jclouds-karaf/ws/feature/target/shell.cfg>
to /home/jclouds/hudson_home/jobs/jclouds-karaf/modules/org.apache.jclouds.karaf$jclouds-karaf/builds/2014-01-01_19-23-32/archive/org.apache.jclouds.karaf/jclouds-karaf/1.8.0-20140101.193316-65/jclouds-karaf-1.8.0-20140101.193316-65-shell.cfg
[JENKINS] Archiving <https://jclouds.ci.cloudbees.com/job/jclouds-karaf/ws/commands/pom.xml>
to /home/jclouds/hudson_home/jobs/jclouds-karaf/modules/org.apache.jclouds.karaf$commands/builds/2014-01-01_19-23-32/archive/org.apache.jclouds.karaf/commands/1.8.0-SNAPSHOT/commands-1.8.0-SNAPSHOT.pom
[JENKINS] Archiving <https://jclouds.ci.cloudbees.com/job/jclouds-karaf/ws/commands/target/commands-1.8.0-SNAPSHOT.jar>
to /home/jclouds/hudson_home/jobs/jclouds-karaf/modules/org.apache.jclouds.karaf$commands/builds/2014-01-01_19-23-32/archive/org.apache.jclouds.karaf/commands/1.8.0-20140101.192923-68/commands-1.8.0-20140101.192923-68.jar
[JENKINS] Archiving <https://jclouds.ci.cloudbees.com/job/jclouds-karaf/ws/itests/pom.xml>
to /home/jclouds/hudson_home/jobs/jclouds-karaf/modules/org.apache.jclouds.karaf$itests/builds/2014-01-01_19-23-32/archive/org.apache.jclouds.karaf/itests/1.8.0-SNAPSHOT/itests-1.8.0-SNAPSHOT.pom
[JENKINS] Archiving <https://jclouds.ci.cloudbees.com/job/jclouds-karaf/ws/urlhandler/pom.xml>
to /home/jclouds/hudson_home/jobs/jclouds-karaf/modules/org.apache.jclouds.karaf$urlhandler/builds/2014-01-01_19-23-32/archive/org.apache.jclouds.karaf/urlhandler/1.8.0-SNAPSHOT/urlhandler-1.8.0-SNAPSHOT.pom
[JENKINS] Archiving <https://jclouds.ci.cloudbees.com/job/jclouds-karaf/ws/urlhandler/target/urlhandler-1.8.0-SNAPSHOT.jar>
to /home/jclouds/hudson_home/jobs/jclouds-karaf/modules/org.apache.jclouds.karaf$urlhandler/builds/2014-01-01_19-23-32/archive/org.apache.jclouds.karaf/urlhandler/1.8.0-20140101.192930-68/urlhandler-1.8.0-20140101.192930-68.jar
[JENKINS] Archiving <https://jclouds.ci.cloudbees.com/job/jclouds-karaf/ws/services/pom.xml>
to /home/jclouds/hudson_home/jobs/jclouds-karaf/modules/org.apache.jclouds.karaf$services/builds/2014-01-01_19-23-32/archive/org.apache.jclouds.karaf/services/1.8.0-SNAPSHOT/services-1.8.0-SNAPSHOT.pom
[JENKINS] Archiving <https://jclouds.ci.cloudbees.com/job/jclouds-karaf/ws/services/target/services-1.8.0-SNAPSHOT.jar>
to /home/jclouds/hudson_home/jobs/jclouds-karaf/modules/org.apache.jclouds.karaf$services/builds/2014-01-01_19-23-32/archive/org.apache.jclouds.karaf/services/1.8.0-20140101.192837-68/services-1.8.0-20140101.192837-68.jar
[JENKINS] Archiving <https://jclouds.ci.cloudbees.com/job/jclouds-karaf/ws/chef/core/pom.xml>
to /home/jclouds/hudson_home/jobs/jclouds-karaf/modules/org.apache.jclouds.karaf.chef$core/builds/2014-01-01_19-23-32/archive/org.apache.jclouds.karaf.chef/core/1.8.0-SNAPSHOT/core-1.8.0-SNAPSHOT.pom
[JENKINS] Archiving <https://jclouds.ci.cloudbees.com/job/jclouds-karaf/ws/chef/core/target/core-1.8.0-SNAPSHOT.jar>
to /home/jclouds/hudson_home/jobs/jclouds-karaf/modules/org.apache.jclouds.karaf.chef$core/builds/2014-01-01_19-23-32/archive/org.apache.jclouds.karaf.chef/core/1.8.0-20140101.192945-68/core-1.8.0-20140101.192945-68.jar
[JENKINS] Archiving <https://jclouds.ci.cloudbees.com/job/jclouds-karaf/ws/chef/services/pom.xml>
to /home/jclouds/hudson_home/jobs/jclouds-karaf/modules/org.apache.jclouds.karaf.chef$services/builds/2014-01-01_19-23-32/archive/org.apache.jclouds.karaf.chef/services/1.8.0-SNAPSHOT/services-1.8.0-SNAPSHOT.pom
[JENKINS] Archiving <https://jclouds.ci.cloudbees.com/job/jclouds-karaf/ws/chef/services/target/services-1.8.0-SNAPSHOT.jar>
to /home/jclouds/hudson_home/jobs/jclouds-karaf/modules/org.apache.jclouds.karaf.chef$services/builds/2014-01-01_19-23-32/archive/org.apache.jclouds.karaf.chef/services/1.8.0-20140101.192951-68/services-1.8.0-20140101.192951-68.jar
[JENKINS] Archiving <https://jclouds.ci.cloudbees.com/job/jclouds-karaf/ws/chef/pom.xml>
to /home/jclouds/hudson_home/jobs/jclouds-karaf/modules/org.apache.jclouds.karaf$chef/builds/2014-01-01_19-23-32/archive/org.apache.jclouds.karaf/chef/1.8.0-SNAPSHOT/chef-1.8.0-SNAPSHOT.pom
[JENKINS] Archiving <https://jclouds.ci.cloudbees.com/job/jclouds-karaf/ws/pom.xml>
to /home/jclouds/hudson_home/jobs/jclouds-karaf/modules/org.apache.jclouds$jclouds-karaf/builds/2014-01-01_19-23-32/archive/org.apache.jclouds/jclouds-karaf/1.8.0-SNAPSHOT/jclouds-karaf-1.8.0-SNAPSHOT.pom
[JENKINS] Archiving <https://jclouds.ci.cloudbees.com/job/jclouds-karaf/ws/core/pom.xml>
to /home/jclouds/hudson_home/jobs/jclouds-karaf/modules/org.apache.jclouds.karaf$core/builds/2014-01-01_19-23-32/archive/org.apache.jclouds.karaf/core/1.8.0-SNAPSHOT/core-1.8.0-SNAPSHOT.pom
[JENKINS] Archiving <https://jclouds.ci.cloudbees.com/job/jclouds-karaf/ws/core/target/core-1.8.0-SNAPSHOT.jar>
to /home/jclouds/hudson_home/jobs/jclouds-karaf/modules/org.apache.jclouds.karaf$core/builds/2014-01-01_19-23-32/archive/org.apache.jclouds.karaf/core/1.8.0-20140101.192711-68/core-1.8.0-20140101.192711-68.jar
[JENKINS] Archiving <https://jclouds.ci.cloudbees.com/job/jclouds-karaf/ws/chef/cache/pom.xml>
to /home/jclouds/hudson_home/jobs/jclouds-karaf/modules/org.apache.jclouds.karaf.chef$cache/builds/2014-01-01_19-23-32/archive/org.apache.jclouds.karaf.chef/cache/1.8.0-SNAPSHOT/cache-1.8.0-SNAPSHOT.pom
[JENKINS] Archiving <https://jclouds.ci.cloudbees.com/job/jclouds-karaf/ws/chef/cache/target/cache-1.8.0-SNAPSHOT.jar>
to /home/jclouds/hudson_home/jobs/jclouds-karaf/modules/org.apache.jclouds.karaf.chef$cache/builds/2014-01-01_19-23-32/archive/org.apache.jclouds.karaf.chef/cache/1.8.0-20140101.193013-68/cache-1.8.0-20140101.193013-68.jar
Waiting for Jenkins to finish collecting data
mavenExecutionResult exceptions not empty
message : Failed to execute goal org.apache.maven.plugins:maven-surefire-plugin:2.10:test
(default-test) on project itests: Execution default-test of goal org.apache.maven.plugins:maven-surefire-plugin:2.10:test
failed: Unable to load the mojo 'test' in the plugin 'org.apache.maven.plugins:maven-surefire-plugin:2.10'.
A required class is missing: org/apache/maven/surefire/util/NestedCheckedException
-----------------------------------------------------
realm =    plugin>org.apache.maven.plugins:maven-surefire-plugin:2.10
strategy = org.codehaus.plexus.classworlds.strategy.SelfFirstStrategy
urls[0] = file:/home/jenkins/.m2/repository/org/apache/maven/plugins/maven-surefire-plugin/2.10/maven-surefire-plugin-2.10.jar
urls[1] = file:/home/jenkins/.m2/repository/org/apache/maven/surefire/surefire-booter/2.10/surefire-booter-2.10.jar
urls[2] = file:/home/jenkins/.m2/repository/org/apache/maven/surefire/maven-surefire-common/2.10/maven-surefire-common-2.10.jar
urls[3] = file:/home/jenkins/.m2/repository/org/apache/maven/shared/maven-common-artifact-filters/1.3/maven-common-artifact-filters-1.3.jar
urls[4] = file:/home/jenkins/.m2/repository/org/codehaus/plexus/plexus-utils/2.1/plexus-utils-2.1.jar
urls[5] = file:/home/jenkins/.m2/repository/org/apache/maven/reporting/maven-reporting-api/2.0.9/maven-reporting-api-2.0.9.jar
Number of foreign imports: 1
import: Entry[import  from realm ClassRealm[project>org.apache.jclouds:jclouds-karaf:1.8.0-SNAPSHOT,
parent: ClassRealm[maven.api, parent: null]]]

-----------------------------------------------------

cause : Execution default-test of goal org.apache.maven.plugins:maven-surefire-plugin:2.10:test
failed: Unable to load the mojo 'test' in the plugin 'org.apache.maven.plugins:maven-surefire-plugin:2.10'.
A required class is missing: org/apache/maven/surefire/util/NestedCheckedException
-----------------------------------------------------
realm =    plugin>org.apache.maven.plugins:maven-surefire-plugin:2.10
strategy = org.codehaus.plexus.classworlds.strategy.SelfFirstStrategy
urls[0] = file:/home/jenkins/.m2/repository/org/apache/maven/plugins/maven-surefire-plugin/2.10/maven-surefire-plugin-2.10.jar
urls[1] = file:/home/jenkins/.m2/repository/org/apache/maven/surefire/surefire-booter/2.10/surefire-booter-2.10.jar
urls[2] = file:/home/jenkins/.m2/repository/org/apache/maven/surefire/maven-surefire-common/2.10/maven-surefire-common-2.10.jar
urls[3] = file:/home/jenkins/.m2/repository/org/apache/maven/shared/maven-common-artifact-filters/1.3/maven-common-artifact-filters-1.3.jar
urls[4] = file:/home/jenkins/.m2/repository/org/codehaus/plexus/plexus-utils/2.1/plexus-utils-2.1.jar
urls[5] = file:/home/jenkins/.m2/repository/org/apache/maven/reporting/maven-reporting-api/2.0.9/maven-reporting-api-2.0.9.jar
Number of foreign imports: 1
import: Entry[import  from realm ClassRealm[project>org.apache.jclouds:jclouds-karaf:1.8.0-SNAPSHOT,
parent: ClassRealm[maven.api, parent: null]]]

-----------------------------------------------------

Stack trace : 
org.apache.maven.lifecycle.LifecycleExecutionException: Failed to execute goal org.apache.maven.plugins:maven-surefire-plugin:2.10:test
(default-test) on project itests: Execution default-test of goal org.apache.maven.plugins:maven-surefire-plugin:2.10:test
failed: Unable to load the mojo 'test' in the plugin 'org.apache.maven.plugins:maven-surefire-plugin:2.10'.
A required class is missing: org/apache/maven/surefire/util/NestedCheckedException
-----------------------------------------------------
realm =    plugin>org.apache.maven.plugins:maven-surefire-plugin:2.10
strategy = org.codehaus.plexus.classworlds.strategy.SelfFirstStrategy
urls[0] = file:/home/jenkins/.m2/repository/org/apache/maven/plugins/maven-surefire-plugin/2.10/maven-surefire-plugin-2.10.jar
urls[1] = file:/home/jenkins/.m2/repository/org/apache/maven/surefire/surefire-booter/2.10/surefire-booter-2.10.jar
urls[2] = file:/home/jenkins/.m2/repository/org/apache/maven/surefire/maven-surefire-common/2.10/maven-surefire-common-2.10.jar
urls[3] = file:/home/jenkins/.m2/repository/org/apache/maven/shared/maven-common-artifact-filters/1.3/maven-common-artifact-filters-1.3.jar
urls[4] = file:/home/jenkins/.m2/repository/org/codehaus/plexus/plexus-utils/2.1/plexus-utils-2.1.jar
urls[5] = file:/home/jenkins/.m2/repository/org/apache/maven/reporting/maven-reporting-api/2.0.9/maven-reporting-api-2.0.9.jar
Number of foreign imports: 1
import: Entry[import  from realm ClassRealm[project>org.apache.jclouds:jclouds-karaf:1.8.0-SNAPSHOT,
parent: ClassRealm[maven.api, parent: null]]]

-----------------------------------------------------

	at org.apache.maven.lifecycle.internal.MojoExecutor.execute(MojoExecutor.java:225)
	at org.apache.maven.lifecycle.internal.MojoExecutor.execute(MojoExecutor.java:153)
	at org.apache.maven.lifecycle.internal.MojoExecutor.execute(MojoExecutor.java:145)
	at org.apache.maven.lifecycle.internal.LifecycleModuleBuilder.buildProject(LifecycleModuleBuilder.java:84)
	at org.apache.maven.lifecycle.internal.LifecycleModuleBuilder.buildProject(LifecycleModuleBuilder.java:59)
	at org.apache.maven.lifecycle.internal.LifecycleStarter.singleThreadedBuild(LifecycleStarter.java:183)
	at org.apache.maven.lifecycle.internal.LifecycleStarter.execute(LifecycleStarter.java:161)
	at org.apache.maven.DefaultMaven.doExecute(DefaultMaven.java:319)
	at org.apache.maven.DefaultMaven.execute(DefaultMaven.java:156)
	at org.jvnet.hudson.maven3.launcher.Maven3Launcher.main(Maven3Launcher.java:117)
	at sun.reflect.NativeMethodAccessorImpl.invoke0(Native Method)
	at sun.reflect.NativeMethodAccessorImpl.invoke(NativeMethodAccessorImpl.java:39)
	at sun.reflect.DelegatingMethodAccessorImpl.invoke(DelegatingMethodAccessorImpl.java:25)
	at java.lang.reflect.Method.invoke(Method.java:597)
	at org.codehaus.plexus.classworlds.launcher.Launcher.launchStandard(Launcher.java:329)
	at org.codehaus.plexus.classworlds.launcher.Launcher.launch(Launcher.java:239)
	at org.jvnet.hudson.maven3.agent.Maven3Main.launch(Maven3Main.java:178)
	at sun.reflect.NativeMethodAccessorImpl.invoke0(Native Method)
	at sun.reflect.NativeMethodAccessorImpl.invoke(NativeMethodAccessorImpl.java:39)
	at sun.reflect.DelegatingMethodAccessorImpl.invoke(DelegatingMethodAccessorImpl.java:25)
	at java.lang.reflect.Method.invoke(Method.java:597)
	at hudson.maven.Maven3Builder.call(Maven3Builder.java:129)
	at hudson.maven.Maven3Builder.call(Maven3Builder.java:67)
	at hudson.remoting.UserRequest.perform(UserRequest.java:118)
	at hudson.remoting.UserRequest.perform(UserRequest.java:48)
	at hudson.remoting.Request$2.run(Request.java:326)
	at hudson.remoting.InterceptingExecutorService$1.call(InterceptingExecutorService.java:72)
	at java.util.concurrent.FutureTask$Sync.innerRun(FutureTask.java:303)
	at java.util.concurrent.FutureTask.run(FutureTask.java:138)
	at java.util.concurrent.ThreadPoolExecutor$Worker.runTask(ThreadPoolExecutor.java:895)
	at java.util.concurrent.ThreadPoolExecutor$Worker.run(ThreadPoolExecutor.java:918)
	at java.lang.Thread.run(Thread.java:662)
Caused by: org.apache.maven.plugin.PluginExecutionException: Execution default-test of goal
org.apache.maven.plugins:maven-surefire-plugin:2.10:test failed: Unable to load the mojo 'test'
in the plugin 'org.apache.maven.plugins:maven-surefire-plugin:2.10'. A required class is missing:
org/apache/maven/surefire/util/NestedCheckedException
-----------------------------------------------------
realm =    plugin>org.apache.maven.plugins:maven-surefire-plugin:2.10
strategy = org.codehaus.plexus.classworlds.strategy.SelfFirstStrategy
urls[0] = file:/home/jenkins/.m2/repository/org/apache/maven/plugins/maven-surefire-plugin/2.10/maven-surefire-plugin-2.10.jar
urls[1] = file:/home/jenkins/.m2/repository/org/apache/maven/surefire/surefire-booter/2.10/surefire-booter-2.10.jar
urls[2] = file:/home/jenkins/.m2/repository/org/apache/maven/surefire/maven-surefire-common/2.10/maven-surefire-common-2.10.jar
urls[3] = file:/home/jenkins/.m2/repository/org/apache/maven/shared/maven-common-artifact-filters/1.3/maven-common-artifact-filters-1.3.jar
urls[4] = file:/home/jenkins/.m2/repository/org/codehaus/plexus/plexus-utils/2.1/plexus-utils-2.1.jar
urls[5] = file:/home/jenkins/.m2/repository/org/apache/maven/reporting/maven-reporting-api/2.0.9/maven-reporting-api-2.0.9.jar
Number of foreign imports: 1
import: Entry[import  from realm ClassRealm[project>org.apache.jclouds:jclouds-karaf:1.8.0-SNAPSHOT,
parent: ClassRealm[maven.api, parent: null]]]

-----------------------------------------------------

	at org.apache.maven.plugin.DefaultBuildPluginManager.executeMojo(DefaultBuildPluginManager.java:115)
	at org.apache.maven.lifecycle.internal.MojoExecutor.execute(MojoExecutor.java:209)
	... 31 more
Caused by: org.apache.maven.plugin.PluginContainerException: Unable to load the mojo 'test'
in the plugin 'org.apache.maven.plugins:maven-surefire-plugin:2.10'. A required class is missing:
org/apache/maven/surefire/util/NestedCheckedException
-----------------------------------------------------
realm =    plugin>org.apache.maven.plugins:maven-surefire-plugin:2.10
strategy = org.codehaus.plexus.classworlds.strategy.SelfFirstStrategy
urls[0] = file:/home/jenkins/.m2/repository/org/apache/maven/plugins/maven-surefire-plugin/2.10/maven-surefire-plugin-2.10.jar
urls[1] = file:/home/jenkins/.m2/repository/org/apache/maven/surefire/surefire-booter/2.10/surefire-booter-2.10.jar
urls[2] = file:/home/jenkins/.m2/repository/org/apache/maven/surefire/maven-surefire-common/2.10/maven-surefire-common-2.10.jar
urls[3] = file:/home/jenkins/.m2/repository/org/apache/maven/shared/maven-common-artifact-filters/1.3/maven-common-artifact-filters-1.3.jar
urls[4] = file:/home/jenkins/.m2/repository/org/codehaus/plexus/plexus-utils/2.1/plexus-utils-2.1.jar
urls[5] = file:/home/jenkins/.m2/repository/org/apache/maven/reporting/maven-reporting-api/2.0.9/maven-reporting-api-2.0.9.jar
Number of foreign imports: 1
import: Entry[import  from realm ClassRealm[project>org.apache.jclouds:jclouds-karaf:1.8.0-SNAPSHOT,
parent: ClassRealm[maven.api, parent: null]]]

-----------------------------------------------------

	at org.apache.maven.plugin.internal.DefaultMavenPluginManager.getConfiguredMojo(DefaultMavenPluginManager.java:474)
	at org.apache.maven.plugin.DefaultBuildPluginManager.executeMojo(DefaultBuildPluginManager.java:92)
	... 32 more
Caused by: java.lang.NoClassDefFoundError: org/apache/maven/surefire/util/NestedCheckedException
	at java.lang.ClassLoader.defineClass1(Native Method)
	at java.lang.ClassLoader.defineClassCond(ClassLoader.java:631)
	at java.lang.ClassLoader.defineClass(ClassLoader.java:615)
	at java.security.SecureClassLoader.defineClass(SecureClassLoader.java:141)
	at java.net.URLClassLoader.defineClass(URLClassLoader.java:283)
	at java.net.URLClassLoader.access$000(URLClassLoader.java:58)
	at java.net.URLClassLoader$1.run(URLClassLoader.java:197)
	at java.security.AccessController.doPrivileged(Native Method)
	at java.net.URLClassLoader.findClass(URLClassLoader.java:190)
	at org.codehaus.plexus.classworlds.realm.ClassRealm.loadClassFromSelf(ClassRealm.java:386)
	at org.codehaus.plexus.classworlds.strategy.SelfFirstStrategy.loadClass(SelfFirstStrategy.java:42)
	at org.codehaus.plexus.classworlds.realm.ClassRealm.loadClass(ClassRealm.java:244)
	at org.codehaus.plexus.classworlds.realm.ClassRealm.loadClass(ClassRealm.java:230)
	at java.lang.Class.getDeclaredConstructors0(Native Method)
	at java.lang.Class.privateGetDeclaredConstructors(Class.java:2398)
	at java.lang.Class.getDeclaredConstructors(Class.java:1838)
	at com.google.inject.spi.InjectionPoint.forConstructorOf(InjectionPoint.java:243)
	at com.google.inject.internal.ConstructorBindingImpl.create(ConstructorBindingImpl.java:96)
	at com.google.inject.internal.InjectorImpl.createUninitializedBinding(InjectorImpl.java:628)
	at com.google.inject.internal.InjectorImpl.createJustInTimeBinding(InjectorImpl.java:835)
	at com.google.inject.internal.InjectorImpl.createJustInTimeBindingRecursive(InjectorImpl.java:769)
	at com.google.inject.internal.InjectorImpl.getJustInTimeBinding(InjectorImpl.java:254)
	at com.google.inject.internal.InjectorImpl.getBindingOrThrow(InjectorImpl.java:205)
	at com.google.inject.internal.InjectorImpl.getInternalFactory(InjectorImpl.java:843)
	at com.google.inject.internal.InjectorImpl.getProviderOrThrow(InjectorImpl.java:957)
	at com.google.inject.internal.InjectorImpl.getProvider(InjectorImpl.java:990)
	at com.google.inject.internal.InjectorImpl.getProvider(InjectorImpl.java:951)
	at com.google.inject.internal.InjectorImpl.getInstance(InjectorImpl.java:1003)
	at org.sonatype.guice.bean.reflect.AbstractDeferredClass.get(AbstractDeferredClass.java:47)
	at com.google.inject.internal.InternalFactoryToProviderAdapter.get(InternalFactoryToProviderAdapter.java:40)
	at com.google.inject.internal.InjectorImpl$4$1.call(InjectorImpl.java:968)
	at com.google.inject.internal.InjectorImpl.callInContext(InjectorImpl.java:1014)
	at com.google.inject.internal.InjectorImpl$4.get(InjectorImpl.java:964)
	at com.google.inject.Scopes$1$1.get(Scopes.java:59)
	at org.sonatype.guice.bean.locators.LazyBeanEntry.getValue(LazyBeanEntry.java:79)
	at org.sonatype.guice.plexus.locators.LazyPlexusBean.getValue(LazyPlexusBean.java:53)
	at org.codehaus.plexus.DefaultPlexusContainer.lookup(DefaultPlexusContainer.java:243)
	at org.codehaus.plexus.DefaultPlexusContainer.lookup(DefaultPlexusContainer.java:235)
	at org.apache.maven.plugin.internal.DefaultMavenPluginManager.getConfiguredMojo(DefaultMavenPluginManager.java:455)
	... 33 more
Caused by: java.lang.ClassNotFoundException: org.apache.maven.surefire.util.NestedCheckedException
	at org.codehaus.plexus.classworlds.strategy.SelfFirstStrategy.loadClass(SelfFirstStrategy.java:50)
	at org.codehaus.plexus.classworlds.realm.ClassRealm.loadClass(ClassRealm.java:244)
	at org.codehaus.plexus.classworlds.realm.ClassRealm.loadClass(ClassRealm.java:230)
	... 72 more
channel stopped

Mime
View raw message