jclouds-dev mailing list archives

Site index · List index
Message view « Date » · « Thread »
Top « Date » · « Thread »
From jenkins-no-re...@cloudbees.com
Subject Build failed in Jenkins: jclouds-karaf #515
Date Thu, 02 Jan 2014 03:32:56 GMT
See <https://jclouds.ci.cloudbees.com/job/jclouds-karaf/515/>

------------------------------------------
[...truncated 4633 lines...]
[Unloading class GregorSamsa]
[Unloading class GregorSamsa]
[Unloading class GregorSamsa$1]
[Unloading class GregorSamsa]
[Unloading class GregorSamsa]
[Unloading class GregorSamsa$0]
[Unloading class GregorSamsa]
[Unloading class GregorSamsa]
[Unloading class GregorSamsa]
[Unloading class GregorSamsa$1]
[Unloading class GregorSamsa]
[Unloading class GregorSamsa$1]
[Unloading class GregorSamsa$1]
[Unloading class GregorSamsa$0]
[Unloading class GregorSamsa$1]
[Unloading class GregorSamsa$0]
[Unloading class GregorSamsa$0]
[Unloading class GregorSamsa$0]
[Unloading class GregorSamsa$1]
[Unloading class GregorSamsa]
[Unloading class GregorSamsa$1]
[Unloading class GregorSamsa$0]
[Unloading class GregorSamsa$0]
[Unloading class GregorSamsa]
[Unloading class GregorSamsa$0]
[Unloading class GregorSamsa$0]
[Unloading class GregorSamsa$1]
[Unloading class GregorSamsa$0]
[Unloading class GregorSamsa$0]
[Unloading class GregorSamsa$1]
[Unloading class GregorSamsa]
[Unloading class GregorSamsa$0]
[Unloading class GregorSamsa$1]
[Unloading class GregorSamsa$0]
[Unloading class GregorSamsa$2]
[Unloading class GregorSamsa$1]
[Unloading class GregorSamsa$0]
[Unloading class GregorSamsa]
[Unloading class GregorSamsa]
[Unloading class GregorSamsa]
[Unloading class GregorSamsa$0]
[Unloading class GregorSamsa$0]
[Unloading class GregorSamsa$1]
[Unloading class GregorSamsa]
[Unloading class GregorSamsa]
[Unloading class GregorSamsa$0]
[Unloading class GregorSamsa]
[Unloading class GregorSamsa$0]
[Unloading class GregorSamsa]
[Unloading class GregorSamsa$1]
[Unloading class GregorSamsa$0]
[Unloading class GregorSamsa$2]
[Unloading class GregorSamsa]
[Unloading class GregorSamsa$0]
[Unloading class GregorSamsa$2]
[Unloading class GregorSamsa]
[Unloading class GregorSamsa$2]
[Unloading class GregorSamsa]
[INFO] Copying bundle: org.apache.jclouds.provider:ninefold-storage:jar:1.8.0-SNAPSHOT
Downloading: https://repository-jclouds.forge.cloudbees.com/snapshot/org/apache/jclouds/provider/ninefold-storage/1.8.0-SNAPSHOT/maven-metadata.xml
Downloading: https://oss.sonatype.org/content/repositories/releases/org/apache/jclouds/provider/ninefold-storage/1.8.0-SNAPSHOT/maven-metadata.xml
Downloading: http://download.java.net/maven/2/org/apache/jclouds/provider/ninefold-storage/1.8.0-SNAPSHOT/maven-metadata.xml
Downloading: https://repository.apache.org/content/repositories/snapshots/org/apache/jclouds/provider/ninefold-storage/1.8.0-SNAPSHOT/maven-metadata.xml
Downloading: http://repository.apache.org/snapshots/org/apache/jclouds/provider/ninefold-storage/1.8.0-SNAPSHOT/maven-metadata.xml
Downloaded: http://repository.apache.org/snapshots/org/apache/jclouds/provider/ninefold-storage/1.8.0-SNAPSHOT/maven-metadata.xml
(2 KB at 4.7 KB/sec)
Downloaded: https://repository.apache.org/content/repositories/snapshots/org/apache/jclouds/provider/ninefold-storage/1.8.0-SNAPSHOT/maven-metadata.xml
(2 KB at 2.4 KB/sec)
Downloading: https://repository.apache.org/content/repositories/snapshots/org/apache/jclouds/provider/ninefold-storage/1.8.0-SNAPSHOT/ninefold-storage-1.8.0-20140102.025712-66.jar
Downloaded: https://repository.apache.org/content/repositories/snapshots/org/apache/jclouds/provider/ninefold-storage/1.8.0-SNAPSHOT/ninefold-storage-1.8.0-20140102.025712-66.jar
(12 KB at 28.7 KB/sec)
[INFO] Copying bundle: org.apache.jclouds.api:cloudsigma:jar:1.8.0-SNAPSHOT
Downloading: https://repository-jclouds.forge.cloudbees.com/snapshot/org/apache/jclouds/api/cloudsigma/1.8.0-SNAPSHOT/maven-metadata.xml
Downloading: https://repository.apache.org/content/repositories/snapshots/org/apache/jclouds/api/cloudsigma/1.8.0-SNAPSHOT/maven-metadata.xml
Downloading: http://download.java.net/maven/2/org/apache/jclouds/api/cloudsigma/1.8.0-SNAPSHOT/maven-metadata.xml
Downloading: https://oss.sonatype.org/content/repositories/releases/org/apache/jclouds/api/cloudsigma/1.8.0-SNAPSHOT/maven-metadata.xml
Downloading: http://repository.apache.org/snapshots/org/apache/jclouds/api/cloudsigma/1.8.0-SNAPSHOT/maven-metadata.xml
Downloaded: http://repository.apache.org/snapshots/org/apache/jclouds/api/cloudsigma/1.8.0-SNAPSHOT/maven-metadata.xml
(2 KB at 6.7 KB/sec)
Downloaded: https://repository.apache.org/content/repositories/snapshots/org/apache/jclouds/api/cloudsigma/1.8.0-SNAPSHOT/maven-metadata.xml
(2 KB at 2.4 KB/sec)
Downloading: https://repository.apache.org/content/repositories/snapshots/org/apache/jclouds/api/cloudsigma/1.8.0-SNAPSHOT/cloudsigma-1.8.0-20140102.021846-67.jar
Downloaded: https://repository.apache.org/content/repositories/snapshots/org/apache/jclouds/api/cloudsigma/1.8.0-SNAPSHOT/cloudsigma-1.8.0-20140102.021846-67.jar
(167 KB at 145.6 KB/sec)
[INFO] Copying bundle: org.apache.aries.jmx:org.apache.aries.jmx.api:jar:0.3
Downloading: http://repo.cloudbees.com/content/repositories/central/org/apache/aries/jmx/org.apache.aries.jmx.api/0.3/org.apache.aries.jmx.api-0.3.jar
Downloading: https://repository-jclouds.forge.cloudbees.com/release/org/apache/aries/jmx/org.apache.aries.jmx.api/0.3/org.apache.aries.jmx.api-0.3.jar
Downloading: https://oss.sonatype.org/content/repositories/releases/org/apache/aries/jmx/org.apache.aries.jmx.api/0.3/org.apache.aries.jmx.api-0.3.jar
Downloading: http://download.java.net/maven/2/org/apache/aries/jmx/org.apache.aries.jmx.api/0.3/org.apache.aries.jmx.api-0.3.jar
Jan 1, 2014 10:32:44 PM org.apache.maven.cli.event.ExecutionEventLogger logReactorSummary
INFO: ------------------------------------------------------------------------
Jan 1, 2014 10:32:44 PM org.apache.maven.cli.event.ExecutionEventLogger logReactorSummary
INFO: Reactor Summary:
Jan 1, 2014 10:32:44 PM org.apache.maven.cli.event.ExecutionEventLogger logReactorSummary
INFO: 
Jan 1, 2014 10:32:44 PM org.apache.maven.cli.event.ExecutionEventLogger logReactorSummary
INFO: Apache jclouds :: Karaf ........................... SUCCESS [1:56.743s]
Jan 1, 2014 10:32:44 PM org.apache.maven.cli.event.ExecutionEventLogger logReactorSummary
INFO: jclouds :: Karaf :: Core .......................... SUCCESS [44.848s]
Jan 1, 2014 10:32:44 PM org.apache.maven.cli.event.ExecutionEventLogger logReactorSummary
INFO: jclouds :: Karaf :: Utils ......................... SUCCESS [12.504s]
Jan 1, 2014 10:32:44 PM org.apache.maven.cli.event.ExecutionEventLogger logReactorSummary
INFO: jclouds :: Karaf :: Recipe ........................ SUCCESS [13.847s]
Jan 1, 2014 10:32:44 PM org.apache.maven.cli.event.ExecutionEventLogger logReactorSummary
INFO: jclouds :: Karaf :: Cache ......................... SUCCESS [8.738s]
Jan 1, 2014 10:32:44 PM org.apache.maven.cli.event.ExecutionEventLogger logReactorSummary
INFO: jclouds :: Karaf :: Services ...................... SUCCESS [51.902s]
Jan 1, 2014 10:32:44 PM org.apache.maven.cli.event.ExecutionEventLogger logReactorSummary
INFO: jclouds :: Karaf :: Commands ...................... SUCCESS [24.792s]
Jan 1, 2014 10:32:44 PM org.apache.maven.cli.event.ExecutionEventLogger logReactorSummary
INFO: jclouds :: Karaf :: URL Handler ................... SUCCESS [5.553s]
Jan 1, 2014 10:32:44 PM org.apache.maven.cli.event.ExecutionEventLogger logReactorSummary
INFO: jclouds :: Karaf :: Chef .......................... SUCCESS [2.461s]
Jan 1, 2014 10:32:44 PM org.apache.maven.cli.event.ExecutionEventLogger logReactorSummary
INFO: jclouds :: Karaf :: Chef :: Core .................. SUCCESS [16.541s]
Jan 1, 2014 10:32:44 PM org.apache.maven.cli.event.ExecutionEventLogger logReactorSummary
INFO: jclouds :: Karaf :: Chef :: Services .............. SUCCESS [6.124s]
Jan 1, 2014 10:32:44 PM org.apache.maven.cli.event.ExecutionEventLogger logReactorSummary
INFO: jclouds :: Karaf :: Chef :: Commands .............. SUCCESS [8.109s]
Jan 1, 2014 10:32:44 PM org.apache.maven.cli.event.ExecutionEventLogger logReactorSummary
INFO: jclouds :: Karaf :: Chef :: Cache ................. SUCCESS [5.858s]
Jan 1, 2014 10:32:44 PM org.apache.maven.cli.event.ExecutionEventLogger logReactorSummary
INFO: jclouds :: Karaf :: Feature ....................... FAILURE [18.363s]
Jan 1, 2014 10:32:44 PM org.apache.maven.cli.event.ExecutionEventLogger logReactorSummary
INFO: jclouds :: Karaf :: Integration Tests ............. SKIPPED
Jan 1, 2014 10:32:44 PM org.apache.maven.cli.event.ExecutionEventLogger logResult
INFO: ------------------------------------------------------------------------
Jan 1, 2014 10:32:44 PM org.apache.maven.cli.event.ExecutionEventLogger logResult
INFO: BUILD FAILURE
Jan 1, 2014 10:32:44 PM org.apache.maven.cli.event.ExecutionEventLogger logStats
INFO: ------------------------------------------------------------------------
Jan 1, 2014 10:32:44 PM org.apache.maven.cli.event.ExecutionEventLogger logStats
INFO: Total time: 5:50.748s
Jan 1, 2014 10:32:44 PM org.apache.maven.cli.event.ExecutionEventLogger logStats
INFO: Finished at: Wed Jan 01 22:32:44 EST 2014
Jan 1, 2014 10:32:46 PM org.apache.maven.cli.event.ExecutionEventLogger logStats
INFO: Final Memory: 73M/201M
Jan 1, 2014 10:32:46 PM org.apache.maven.cli.event.ExecutionEventLogger sessionEnded
INFO: ------------------------------------------------------------------------
[JENKINS] Archiving <https://jclouds.ci.cloudbees.com/job/jclouds-karaf/ws/utils/pom.xml>
to /home/jclouds/hudson_home/jobs/jclouds-karaf/modules/org.apache.jclouds.karaf$utils/builds/2014-01-02_03-26-43/archive/org.apache.jclouds.karaf/utils/1.8.0-SNAPSHOT/utils-1.8.0-SNAPSHOT.pom
[JENKINS] Archiving <https://jclouds.ci.cloudbees.com/job/jclouds-karaf/ws/utils/target/utils-1.8.0-SNAPSHOT.jar>
to /home/jclouds/hudson_home/jobs/jclouds-karaf/modules/org.apache.jclouds.karaf$utils/builds/2014-01-02_03-26-43/archive/org.apache.jclouds.karaf/utils/1.8.0-20140102.032957-71/utils-1.8.0-20140102.032957-71.jar
[JENKINS] Archiving <https://jclouds.ci.cloudbees.com/job/jclouds-karaf/ws/cache/pom.xml>
to /home/jclouds/hudson_home/jobs/jclouds-karaf/modules/org.apache.jclouds.karaf$cache/builds/2014-01-02_03-26-43/archive/org.apache.jclouds.karaf/cache/1.8.0-SNAPSHOT/cache-1.8.0-SNAPSHOT.pom
[JENKINS] Archiving <https://jclouds.ci.cloudbees.com/job/jclouds-karaf/ws/cache/target/cache-1.8.0-SNAPSHOT.jar>
to /home/jclouds/hudson_home/jobs/jclouds-karaf/modules/org.apache.jclouds.karaf$cache/builds/2014-01-02_03-26-43/archive/org.apache.jclouds.karaf/cache/1.8.0-20140102.033020-71/cache-1.8.0-20140102.033020-71.jar
[JENKINS] Archiving <https://jclouds.ci.cloudbees.com/job/jclouds-karaf/ws/chef/commands/pom.xml>
to /home/jclouds/hudson_home/jobs/jclouds-karaf/modules/org.apache.jclouds.karaf.chef$commands/builds/2014-01-02_03-26-43/archive/org.apache.jclouds.karaf.chef/commands/1.8.0-SNAPSHOT/commands-1.8.0-SNAPSHOT.pom
[JENKINS] Archiving <https://jclouds.ci.cloudbees.com/job/jclouds-karaf/ws/chef/commands/target/commands-1.8.0-SNAPSHOT.jar>
to /home/jclouds/hudson_home/jobs/jclouds-karaf/modules/org.apache.jclouds.karaf.chef$commands/builds/2014-01-02_03-26-43/archive/org.apache.jclouds.karaf.chef/commands/1.8.0-20140102.033217-71/commands-1.8.0-20140102.033217-71.jar
[JENKINS] Archiving <https://jclouds.ci.cloudbees.com/job/jclouds-karaf/ws/recipe/pom.xml>
to /home/jclouds/hudson_home/jobs/jclouds-karaf/modules/org.apache.jclouds.karaf$recipe/builds/2014-01-02_03-26-43/archive/org.apache.jclouds.karaf/recipe/1.8.0-SNAPSHOT/recipe-1.8.0-SNAPSHOT.pom
[JENKINS] Archiving <https://jclouds.ci.cloudbees.com/job/jclouds-karaf/ws/recipe/target/recipe-1.8.0-SNAPSHOT.jar>
to /home/jclouds/hudson_home/jobs/jclouds-karaf/modules/org.apache.jclouds.karaf$recipe/builds/2014-01-02_03-26-43/archive/org.apache.jclouds.karaf/recipe/1.8.0-20140102.033010-71/recipe-1.8.0-20140102.033010-71.jar
[JENKINS] Archiving <https://jclouds.ci.cloudbees.com/job/jclouds-karaf/ws/feature/pom.xml>
to /home/jclouds/hudson_home/jobs/jclouds-karaf/modules/org.apache.jclouds.karaf$jclouds-karaf/builds/2014-01-02_03-26-43/archive/org.apache.jclouds.karaf/jclouds-karaf/1.8.0-SNAPSHOT/jclouds-karaf-1.8.0-SNAPSHOT.pom
[JENKINS] Archiving <https://jclouds.ci.cloudbees.com/job/jclouds-karaf/ws/feature/target/feature.xml>
to /home/jclouds/hudson_home/jobs/jclouds-karaf/modules/org.apache.jclouds.karaf$jclouds-karaf/builds/2014-01-02_03-26-43/archive/org.apache.jclouds.karaf/jclouds-karaf/1.8.0-SNAPSHOT/jclouds-karaf-1.8.0-SNAPSHOT-features.xml
[JENKINS] Archiving <https://jclouds.ci.cloudbees.com/job/jclouds-karaf/ws/feature/target/credentials.cfg>
to /home/jclouds/hudson_home/jobs/jclouds-karaf/modules/org.apache.jclouds.karaf$jclouds-karaf/builds/2014-01-02_03-26-43/archive/org.apache.jclouds.karaf/jclouds-karaf/1.8.0-SNAPSHOT/jclouds-karaf-1.8.0-SNAPSHOT-credentials.cfg
[JENKINS] Archiving <https://jclouds.ci.cloudbees.com/job/jclouds-karaf/ws/feature/target/shell.cfg>
to /home/jclouds/hudson_home/jobs/jclouds-karaf/modules/org.apache.jclouds.karaf$jclouds-karaf/builds/2014-01-02_03-26-43/archive/org.apache.jclouds.karaf/jclouds-karaf/1.8.0-SNAPSHOT/jclouds-karaf-1.8.0-SNAPSHOT-shell.cfg
[JENKINS] Archiving <https://jclouds.ci.cloudbees.com/job/jclouds-karaf/ws/commands/pom.xml>
to /home/jclouds/hudson_home/jobs/jclouds-karaf/modules/org.apache.jclouds.karaf$commands/builds/2014-01-02_03-26-43/archive/org.apache.jclouds.karaf/commands/1.8.0-SNAPSHOT/commands-1.8.0-SNAPSHOT.pom
[JENKINS] Archiving <https://jclouds.ci.cloudbees.com/job/jclouds-karaf/ws/commands/target/commands-1.8.0-SNAPSHOT.jar>
to /home/jclouds/hudson_home/jobs/jclouds-karaf/modules/org.apache.jclouds.karaf$commands/builds/2014-01-02_03-26-43/archive/org.apache.jclouds.karaf/commands/1.8.0-20140102.033137-71/commands-1.8.0-20140102.033137-71.jar
[JENKINS] Archiving <https://jclouds.ci.cloudbees.com/job/jclouds-karaf/ws/itests/pom.xml>
to /home/jclouds/hudson_home/jobs/jclouds-karaf/modules/org.apache.jclouds.karaf$itests/builds/2014-01-02_03-26-43/archive/org.apache.jclouds.karaf/itests/1.8.0-SNAPSHOT/itests-1.8.0-SNAPSHOT.pom
[JENKINS] Archiving <https://jclouds.ci.cloudbees.com/job/jclouds-karaf/ws/urlhandler/pom.xml>
to /home/jclouds/hudson_home/jobs/jclouds-karaf/modules/org.apache.jclouds.karaf$urlhandler/builds/2014-01-02_03-26-43/archive/org.apache.jclouds.karaf/urlhandler/1.8.0-SNAPSHOT/urlhandler-1.8.0-SNAPSHOT.pom
[JENKINS] Archiving <https://jclouds.ci.cloudbees.com/job/jclouds-karaf/ws/urlhandler/target/urlhandler-1.8.0-SNAPSHOT.jar>
to /home/jclouds/hudson_home/jobs/jclouds-karaf/modules/org.apache.jclouds.karaf$urlhandler/builds/2014-01-02_03-26-43/archive/org.apache.jclouds.karaf/urlhandler/1.8.0-20140102.033144-71/urlhandler-1.8.0-20140102.033144-71.jar
[JENKINS] Archiving <https://jclouds.ci.cloudbees.com/job/jclouds-karaf/ws/services/pom.xml>
to /home/jclouds/hudson_home/jobs/jclouds-karaf/modules/org.apache.jclouds.karaf$services/builds/2014-01-02_03-26-43/archive/org.apache.jclouds.karaf/services/1.8.0-SNAPSHOT/services-1.8.0-SNAPSHOT.pom
[JENKINS] Archiving <https://jclouds.ci.cloudbees.com/job/jclouds-karaf/ws/services/target/services-1.8.0-SNAPSHOT.jar>
to /home/jclouds/hudson_home/jobs/jclouds-karaf/modules/org.apache.jclouds.karaf$services/builds/2014-01-02_03-26-43/archive/org.apache.jclouds.karaf/services/1.8.0-20140102.033112-71/services-1.8.0-20140102.033112-71.jar
[JENKINS] Archiving <https://jclouds.ci.cloudbees.com/job/jclouds-karaf/ws/chef/core/pom.xml>
to /home/jclouds/hudson_home/jobs/jclouds-karaf/modules/org.apache.jclouds.karaf.chef$core/builds/2014-01-02_03-26-43/archive/org.apache.jclouds.karaf.chef/core/1.8.0-SNAPSHOT/core-1.8.0-SNAPSHOT.pom
[JENKINS] Archiving <https://jclouds.ci.cloudbees.com/job/jclouds-karaf/ws/chef/core/target/core-1.8.0-SNAPSHOT.jar>
to /home/jclouds/hudson_home/jobs/jclouds-karaf/modules/org.apache.jclouds.karaf.chef$core/builds/2014-01-02_03-26-43/archive/org.apache.jclouds.karaf.chef/core/1.8.0-20140102.033203-71/core-1.8.0-20140102.033203-71.jar
[JENKINS] Archiving <https://jclouds.ci.cloudbees.com/job/jclouds-karaf/ws/chef/services/pom.xml>
to /home/jclouds/hudson_home/jobs/jclouds-karaf/modules/org.apache.jclouds.karaf.chef$services/builds/2014-01-02_03-26-43/archive/org.apache.jclouds.karaf.chef/services/1.8.0-SNAPSHOT/services-1.8.0-SNAPSHOT.pom
[JENKINS] Archiving <https://jclouds.ci.cloudbees.com/job/jclouds-karaf/ws/chef/services/target/services-1.8.0-SNAPSHOT.jar>
to /home/jclouds/hudson_home/jobs/jclouds-karaf/modules/org.apache.jclouds.karaf.chef$services/builds/2014-01-02_03-26-43/archive/org.apache.jclouds.karaf.chef/services/1.8.0-20140102.033209-71/services-1.8.0-20140102.033209-71.jar
[JENKINS] Archiving <https://jclouds.ci.cloudbees.com/job/jclouds-karaf/ws/chef/pom.xml>
to /home/jclouds/hudson_home/jobs/jclouds-karaf/modules/org.apache.jclouds.karaf$chef/builds/2014-01-02_03-26-43/archive/org.apache.jclouds.karaf/chef/1.8.0-SNAPSHOT/chef-1.8.0-SNAPSHOT.pom
[JENKINS] Archiving <https://jclouds.ci.cloudbees.com/job/jclouds-karaf/ws/pom.xml>
to /home/jclouds/hudson_home/jobs/jclouds-karaf/modules/org.apache.jclouds$jclouds-karaf/builds/2014-01-02_03-26-43/archive/org.apache.jclouds/jclouds-karaf/1.8.0-SNAPSHOT/jclouds-karaf-1.8.0-SNAPSHOT.pom
[JENKINS] Archiving <https://jclouds.ci.cloudbees.com/job/jclouds-karaf/ws/core/pom.xml>
to /home/jclouds/hudson_home/jobs/jclouds-karaf/modules/org.apache.jclouds.karaf$core/builds/2014-01-02_03-26-43/archive/org.apache.jclouds.karaf/core/1.8.0-SNAPSHOT/core-1.8.0-SNAPSHOT.pom
[JENKINS] Archiving <https://jclouds.ci.cloudbees.com/job/jclouds-karaf/ws/core/target/core-1.8.0-SNAPSHOT.jar>
to /home/jclouds/hudson_home/jobs/jclouds-karaf/modules/org.apache.jclouds.karaf$core/builds/2014-01-02_03-26-43/archive/org.apache.jclouds.karaf/core/1.8.0-20140102.032944-71/core-1.8.0-20140102.032944-71.jar
[JENKINS] Archiving <https://jclouds.ci.cloudbees.com/job/jclouds-karaf/ws/chef/cache/pom.xml>
to /home/jclouds/hudson_home/jobs/jclouds-karaf/modules/org.apache.jclouds.karaf.chef$cache/builds/2014-01-02_03-26-43/archive/org.apache.jclouds.karaf.chef/cache/1.8.0-SNAPSHOT/cache-1.8.0-SNAPSHOT.pom
[JENKINS] Archiving <https://jclouds.ci.cloudbees.com/job/jclouds-karaf/ws/chef/cache/target/cache-1.8.0-SNAPSHOT.jar>
to /home/jclouds/hudson_home/jobs/jclouds-karaf/modules/org.apache.jclouds.karaf.chef$cache/builds/2014-01-02_03-26-43/archive/org.apache.jclouds.karaf.chef/cache/1.8.0-20140102.033223-71/cache-1.8.0-20140102.033223-71.jar
Waiting for Jenkins to finish collecting data
mavenExecutionResult exceptions not empty
message : Failed to execute goal org.apache.karaf.tooling:features-maven-plugin:2.2.7:add-features-to-repo
(add-features-to-repo) on project jclouds-karaf: Can't resolve bundle org.apache.aries.jmx:org.apache.aries.jmx.api:jar:0.3
cause : Can't resolve bundle org.apache.aries.jmx:org.apache.aries.jmx.api:jar:0.3
Stack trace : 
org.apache.maven.lifecycle.LifecycleExecutionException: Failed to execute goal org.apache.karaf.tooling:features-maven-plugin:2.2.7:add-features-to-repo
(add-features-to-repo) on project jclouds-karaf: Can't resolve bundle org.apache.aries.jmx:org.apache.aries.jmx.api:jar:0.3
	at org.apache.maven.lifecycle.internal.MojoExecutor.execute(MojoExecutor.java:213)
	at org.apache.maven.lifecycle.internal.MojoExecutor.execute(MojoExecutor.java:153)
	at org.apache.maven.lifecycle.internal.MojoExecutor.execute(MojoExecutor.java:145)
	at org.apache.maven.lifecycle.internal.LifecycleModuleBuilder.buildProject(LifecycleModuleBuilder.java:84)
	at org.apache.maven.lifecycle.internal.LifecycleModuleBuilder.buildProject(LifecycleModuleBuilder.java:59)
	at org.apache.maven.lifecycle.internal.LifecycleStarter.singleThreadedBuild(LifecycleStarter.java:183)
	at org.apache.maven.lifecycle.internal.LifecycleStarter.execute(LifecycleStarter.java:161)
	at org.apache.maven.DefaultMaven.doExecute(DefaultMaven.java:319)
	at org.apache.maven.DefaultMaven.execute(DefaultMaven.java:156)
	at org.jvnet.hudson.maven3.launcher.Maven3Launcher.main(Maven3Launcher.java:117)
	at sun.reflect.NativeMethodAccessorImpl.invoke0(Native Method)
	at sun.reflect.NativeMethodAccessorImpl.invoke(NativeMethodAccessorImpl.java:39)
	at sun.reflect.DelegatingMethodAccessorImpl.invoke(DelegatingMethodAccessorImpl.java:25)
	at java.lang.reflect.Method.invoke(Method.java:597)
	at org.codehaus.plexus.classworlds.launcher.Launcher.launchStandard(Launcher.java:329)
	at org.codehaus.plexus.classworlds.launcher.Launcher.launch(Launcher.java:239)
	at org.jvnet.hudson.maven3.agent.Maven3Main.launch(Maven3Main.java:178)
	at sun.reflect.NativeMethodAccessorImpl.invoke0(Native Method)
	at sun.reflect.NativeMethodAccessorImpl.invoke(NativeMethodAccessorImpl.java:39)
	at sun.reflect.DelegatingMethodAccessorImpl.invoke(DelegatingMethodAccessorImpl.java:25)
	at java.lang.reflect.Method.invoke(Method.java:597)
	at hudson.maven.Maven3Builder.call(Maven3Builder.java:129)
	at hudson.maven.Maven3Builder.call(Maven3Builder.java:67)
	at hudson.remoting.UserRequest.perform(UserRequest.java:118)
	at hudson.remoting.UserRequest.perform(UserRequest.java:48)
	at hudson.remoting.Request$2.run(Request.java:326)
	at hudson.remoting.InterceptingExecutorService$1.call(InterceptingExecutorService.java:72)
	at java.util.concurrent.FutureTask$Sync.innerRun(FutureTask.java:303)
	at java.util.concurrent.FutureTask.run(FutureTask.java:138)
	at java.util.concurrent.ThreadPoolExecutor$Worker.runTask(ThreadPoolExecutor.java:895)
	at java.util.concurrent.ThreadPoolExecutor$Worker.run(ThreadPoolExecutor.java:918)
	at java.lang.Thread.run(Thread.java:662)
Caused by: org.apache.maven.plugin.MojoFailureException: Can't resolve bundle org.apache.aries.jmx:org.apache.aries.jmx.api:jar:0.3
	at org.apache.karaf.tooling.features.AddFeaturesToRepoMojo.resolveBundle(AddFeaturesToRepoMojo.java:275)
	at org.apache.karaf.tooling.features.AddFeaturesToRepoMojo.execute(AddFeaturesToRepoMojo.java:203)
	at org.apache.maven.plugin.DefaultBuildPluginManager.executeMojo(DefaultBuildPluginManager.java:101)
	at org.apache.maven.lifecycle.internal.MojoExecutor.execute(MojoExecutor.java:209)
	... 31 more
Caused by: org.apache.maven.artifact.resolver.ArtifactNotFoundException: Could not find artifact
org.apache.aries.jmx:org.apache.aries.jmx.api:jar:0.3 in central (http://repo.cloudbees.com/content/repositories/central)

Try downloading the file manually from the project website.

Then, install it using the command: 
    mvn install:install-file -DgroupId=org.apache.aries.jmx -DartifactId=org.apache.aries.jmx.api
-Dversion=0.3 -Dpackaging=jar -Dfile=/path/to/file

Alternatively, if you host your own repository you can deploy the file there: 
    mvn deploy:deploy-file -DgroupId=org.apache.aries.jmx -DartifactId=org.apache.aries.jmx.api
-Dversion=0.3 -Dpackaging=jar -Dfile=/path/to/file -Durl=[url] -DrepositoryId=[id]


  org.apache.aries.jmx:org.apache.aries.jmx.api:jar:0.3

from the specified remote repositories:
  central (http://repo.cloudbees.com/content/repositories/central, releases=true, snapshots=false),
  cloudbees-private-snapshot-repository (https://repository-jclouds.forge.cloudbees.com/snapshot,
releases=false, snapshots=true),
  cloudbees-private-release-repository (https://repository-jclouds.forge.cloudbees.com/release,
releases=true, snapshots=false),
  apache-snapshots (https://repository.apache.org/content/repositories/snapshots, releases=false,
snapshots=true),
  sonatype (https://oss.sonatype.org/content/repositories/releases/, releases=true, snapshots=true),
  maven2-repository.dev.java.net (http://download.java.net/maven/2/, releases=true, snapshots=true),
  apache.snapshots (http://repository.apache.org/snapshots, releases=false, snapshots=true)

	at org.apache.maven.artifact.resolver.DefaultArtifactResolver.resolve(DefaultArtifactResolver.java:219)
	at org.apache.maven.artifact.resolver.DefaultArtifactResolver.resolve(DefaultArtifactResolver.java:157)
	at org.apache.maven.artifact.resolver.DefaultArtifactResolver.resolve(DefaultArtifactResolver.java:525)
	at org.apache.karaf.tooling.features.AddFeaturesToRepoMojo.resolveBundle(AddFeaturesToRepoMojo.java:262)
	... 34 more
Caused by: org.sonatype.aether.resolution.ArtifactResolutionException: Could not find artifact
org.apache.aries.jmx:org.apache.aries.jmx.api:jar:0.3 in central (http://repo.cloudbees.com/content/repositories/central)
	at org.sonatype.aether.impl.internal.DefaultArtifactResolver.resolve(DefaultArtifactResolver.java:541)
	at org.sonatype.aether.impl.internal.DefaultArtifactResolver.resolveArtifacts(DefaultArtifactResolver.java:220)
	at org.sonatype.aether.impl.internal.DefaultArtifactResolver.resolveArtifact(DefaultArtifactResolver.java:197)
	at org.sonatype.aether.impl.internal.DefaultRepositorySystem.resolveArtifact(DefaultRepositorySystem.java:323)
	at org.apache.maven.artifact.resolver.DefaultArtifactResolver.resolve(DefaultArtifactResolver.java:213)
	... 37 more
Caused by: org.sonatype.aether.transfer.ArtifactNotFoundException: Could not find artifact
org.apache.aries.jmx:org.apache.aries.jmx.api:jar:0.3 in central (http://repo.cloudbees.com/content/repositories/central)
	at org.sonatype.aether.connector.wagon.WagonRepositoryConnector$4.wrap(WagonRepositoryConnector.java:945)
	at org.sonatype.aether.connector.wagon.WagonRepositoryConnector$4.wrap(WagonRepositoryConnector.java:940)
	at org.sonatype.aether.connector.wagon.WagonRepositoryConnector$GetTask.flush(WagonRepositoryConnector.java:695)
	at org.sonatype.aether.connector.wagon.WagonRepositoryConnector$GetTask.flush(WagonRepositoryConnector.java:689)
	at org.sonatype.aether.connector.wagon.WagonRepositoryConnector.get(WagonRepositoryConnector.java:445)
	at org.sonatype.aether.impl.internal.DefaultArtifactResolver.resolve(DefaultArtifactResolver.java:460)
	... 41 more
channel stopped

Mime
View raw message